PCBNEW-LibModule-V1  
# encoding utf-8
Units mm
$INDEX
DIP794W46P254L2967H457Q28B
$EndINDEX
$MODULE DIP794W46P254L2967H457Q28B
Po 0 0 0 15 00000000 00000000 ~~
Li DIP794W46P254L2967H457Q28B
Cd 
Sc 00000000
At STD
Op 0 0 0
.SolderMask 0
.SolderPaste 0
T0 -2.506 -18.5661 1.002 1.002 0 0.05 N V 21 "DIP794W46P254L2967H457Q28B"
T1 -1.87708 18.5605 1.00165 1.00165 0 0.05 N V 21 "VAL**"
DS 2.38 17.4 2.38 -17.4 0.1524 21
DS -2.38 -17.4 -2.38 17.4 0.1524 21
DS 2.38 17.4 -2.38 17.4 0.1524 21
DS 2.38 -17.4 -2.38 -17.4 0.1524 21
DC -5.4 -17.1 -5.146 -17.1 0 21
DS -5 -17.75 5 -17.75 0.05 24
DS 5 -17.75 5 17.75 0.05 24
DS 5 17.75 -5 17.75 0.05 24
DS -5 17.75 -5 -17.75 0.05 24
$PAD
Sh "1" R 1.358 1.358 0 0 0
Dr 0.85 0 0
At STD N 00E0FFFF
.SolderMask 0
Ne 0 ""
Po -3.96 -16.51
$EndPAD
$PAD
Sh "2" C 1.358 1.358 0 0 0
Dr 0.85 0 0
At STD N 00E0FFFF
.SolderMask 0
Ne 0 ""
Po -3.96 -13.97
$EndPAD
$PAD
Sh "7" C 1.358 1.358 0 0 0
Dr 0.85 0 0
At STD N 00E0FFFF
.SolderMask 0
Ne 0 ""
Po -3.96 -1.27
$EndPAD
$PAD
Sh "8" C 1.358 1.358 0 0 0
Dr 0.85 0 0
At STD N 00E0FFFF
.SolderMask 0
Ne 0 ""
Po -3.96 1.27
$EndPAD
$PAD
Sh "3" C 1.358 1.358 0 0 0
Dr 0.85 0 0
At STD N 00E0FFFF
.SolderMask 0
Ne 0 ""
Po -3.96 -11.43
$EndPAD
$PAD
Sh "4" C 1.358 1.358 0 0 0
Dr 0.85 0 0
At STD N 00E0FFFF
.SolderMask 0
Ne 0 ""
Po -3.96 -8.89
$EndPAD
$PAD
Sh "6" C 1.358 1.358 0 0 0
Dr 0.85 0 0
At STD N 00E0FFFF
.SolderMask 0
Ne 0 ""
Po -3.96 -3.81
$EndPAD
$PAD
Sh "5" C 1.358 1.358 0 0 0
Dr 0.85 0 0
At STD N 00E0FFFF
.SolderMask 0
Ne 0 ""
Po -3.96 -6.35
$EndPAD
$PAD
Sh "9" C 1.358 1.358 0 0 0
Dr 0.85 0 0
At STD N 00E0FFFF
.SolderMask 0
Ne 0 ""
Po -3.96 3.81
$EndPAD
$PAD
Sh "10" C 1.358 1.358 0 0 0
Dr 0.85 0 0
At STD N 00E0FFFF
.SolderMask 0
Ne 0 ""
Po -3.96 6.35
$EndPAD
$PAD
Sh "11" C 1.358 1.358 0 0 0
Dr 0.85 0 0
At STD N 00E0FFFF
.SolderMask 0
Ne 0 ""
Po -3.96 8.89
$EndPAD
$PAD
Sh "12" C 1.358 1.358 0 0 0
Dr 0.85 0 0
At STD N 00E0FFFF
.SolderMask 0
Ne 0 ""
Po -3.96 11.43
$EndPAD
$PAD
Sh "13" C 1.358 1.358 0 0 0
Dr 0.85 0 0
At STD N 00E0FFFF
.SolderMask 0
Ne 0 ""
Po -3.96 13.97
$EndPAD
$PAD
Sh "14" C 1.358 1.358 0 0 0
Dr 0.85 0 0
At STD N 00E0FFFF
.SolderMask 0
Ne 0 ""
Po -3.96 16.51
$EndPAD
$PAD
Sh "15" C 1.358 1.358 0 0 0
Dr 0.85 0 0
At STD N 00E0FFFF
.SolderMask 0
Ne 0 ""
Po 3.96 16.51
$EndPAD
$PAD
Sh "16" C 1.358 1.358 0 0 0
Dr 0.85 0 0
At STD N 00E0FFFF
.SolderMask 0
Ne 0 ""
Po 3.96 13.97
$EndPAD
$PAD
Sh "17" C 1.358 1.358 0 0 0
Dr 0.85 0 0
At STD N 00E0FFFF
.SolderMask 0
Ne 0 ""
Po 3.96 11.43
$EndPAD
$PAD
Sh "18" C 1.358 1.358 0 0 0
Dr 0.85 0 0
At STD N 00E0FFFF
.SolderMask 0
Ne 0 ""
Po 3.96 8.89
$EndPAD
$PAD
Sh "19" C 1.358 1.358 0 0 0
Dr 0.85 0 0
At STD N 00E0FFFF
.SolderMask 0
Ne 0 ""
Po 3.96 6.35
$EndPAD
$PAD
Sh "20" C 1.358 1.358 0 0 0
Dr 0.85 0 0
At STD N 00E0FFFF
.SolderMask 0
Ne 0 ""
Po 3.96 3.81
$EndPAD
$PAD
Sh "21" C 1.358 1.358 0 0 0
Dr 0.85 0 0
At STD N 00E0FFFF
.SolderMask 0
Ne 0 ""
Po 3.96 1.27
$EndPAD
$PAD
Sh "22" C 1.358 1.358 0 0 0
Dr 0.85 0 0
At STD N 00E0FFFF
.SolderMask 0
Ne 0 ""
Po 3.96 -1.27
$EndPAD
$PAD
Sh "23" C 1.358 1.358 0 0 0
Dr 0.85 0 0
At STD N 00E0FFFF
.SolderMask 0
Ne 0 ""
Po 3.96 -3.81
$EndPAD
$PAD
Sh "24" C 1.358 1.358 0 0 0
Dr 0.85 0 0
At STD N 00E0FFFF
.SolderMask 0
Ne 0 ""
Po 3.96 -6.35
$EndPAD
$PAD
Sh "25" C 1.358 1.358 0 0 0
Dr 0.85 0 0
At STD N 00E0FFFF
.SolderMask 0
Ne 0 ""
Po 3.96 -8.89
$EndPAD
$PAD
Sh "26" C 1.358 1.358 0 0 0
Dr 0.85 0 0
At STD N 00E0FFFF
.SolderMask 0
Ne 0 ""
Po 3.96 -11.43
$EndPAD
$PAD
Sh "27" C 1.358 1.358 0 0 0
Dr 0.85 0 0
At STD N 00E0FFFF
.SolderMask 0
Ne 0 ""
Po 3.96 -13.97
$EndPAD
$PAD
Sh "28" C 1.358 1.358 0 0 0
Dr 0.85 0 0
At STD N 00E0FFFF
.SolderMask 0
Ne 0 ""
Po 3.96 -16.51
$EndPAD
$EndMODULE DIP794W46P254L2967H457Q28B
