EESchema Schematic File Version 2
LIBS:power
LIBS:device
LIBS:switches
LIBS:relays
LIBS:motors
LIBS:transistors
LIBS:conn
LIBS:linear
LIBS:regul
LIBS:74xx
LIBS:cmos4000
LIBS:adc-dac
LIBS:memory
LIBS:xilinx
LIBS:microcontrollers
LIBS:dsp
LIBS:microchip
LIBS:analog_switches
LIBS:motorola
LIBS:texas
LIBS:intel
LIBS:audio
LIBS:interface
LIBS:digital-audio
LIBS:philips
LIBS:display
LIBS:cypress
LIBS:siliconi
LIBS:opto
LIBS:atmel
LIBS:contrib
LIBS:valves
LIBS:arduinostandalone-cache
EELAYER 25 0
EELAYER END
$Descr A4 11693 8268
encoding utf-8
Sheet 1 1
Title ""
Date ""
Rev ""
Comp ""
Comment1 ""
Comment2 ""
Comment3 ""
Comment4 ""
$EndDescr
$Comp
L ATMEGA328P-PU U2
U 1 1 5A661053
P 5700 3650
F 0 "U2" H 4950 4900 50  0000 L BNN
F 1 "ATMEGA328P-PU" H 6100 2250 50  0000 L BNN
F 2 "ATMEGA328P-PU:DIP794W46P254L2967H457Q28B" H 5700 3650 50  0001 C CIN
F 3 "" H 5700 3650 50  0001 C CNN
	1    5700 3650
	1    0    0    -1  
$EndComp
$Comp
L LED D1
U 1 1 5A6E8D70
P 4450 3200
F 0 "D1" H 4450 3300 50  0000 C CNN
F 1 "LED" H 4450 3100 50  0000 C CNN
F 2 "LEDs:LED_D3.0mm" H 4450 3200 50  0001 C CNN
F 3 "" H 4450 3200 50  0001 C CNN
	1    4450 3200
	0    1    1    0   
$EndComp
$Comp
L GND #PWR01
U 1 1 5A6E8E67
P 3650 4850
F 0 "#PWR01" H 3650 4600 50  0001 C CNN
F 1 "GND" H 3650 4700 50  0000 C CNN
F 2 "" H 3650 4850 50  0001 C CNN
F 3 "" H 3650 4850 50  0001 C CNN
	1    3650 4850
	1    0    0    -1  
$EndComp
$Comp
L C 10uF1
U 1 1 5A6E912E
P 1600 3100
F 0 "10uF1" H 1625 3200 50  0000 L CNN
F 1 "C" H 1625 3000 50  0000 L CNN
F 2 "Capacitors_THT:C_Axial_L3.8mm_D2.6mm_P10.00mm_Horizontal" H 1638 2950 50  0001 C CNN
F 3 "" H 1600 3100 50  0001 C CNN
	1    1600 3100
	1    0    0    -1  
$EndComp
$Comp
L C 22p1
U 1 1 5A6E93B3
P 7750 3100
F 0 "22p1" H 7775 3200 50  0000 L CNN
F 1 "C" H 7775 3000 50  0000 L CNN
F 2 "Capacitors_THT:C_Axial_L3.8mm_D2.6mm_P10.00mm_Horizontal" H 7788 2950 50  0001 C CNN
F 3 "" H 7750 3100 50  0001 C CNN
	1    7750 3100
	0    1    1    0   
$EndComp
$Comp
L C 22p2
U 1 1 5A6E940C
P 7750 3300
F 0 "22p2" H 7775 3400 50  0000 L CNN
F 1 "C" H 7775 3200 50  0000 L CNN
F 2 "Capacitors_THT:C_Axial_L3.8mm_D2.6mm_P10.00mm_Horizontal" H 7788 3150 50  0001 C CNN
F 3 "" H 7750 3300 50  0001 C CNN
	1    7750 3300
	0    1    1    0   
$EndComp
$Comp
L LM7805_TO220 Oscilattor1
U 1 1 5A6E9085
P 1900 2550
F 0 "Oscilattor1" H 1750 2675 50  0000 C CNN
F 1 "LM7805_TO220" H 1900 2675 50  0000 L CNN
F 2 "TO_SOT_Packages_THT:TO-220-3_Vertical" H 1900 2775 50  0001 C CIN
F 3 "" H 1900 2500 50  0001 C CNN
	1    1900 2550
	1    0    0    -1  
$EndComp
$Comp
L C 10uF2
U 1 1 5A6E9177
P 2200 3100
F 0 "10uF2" H 2225 3200 50  0000 L CNN
F 1 "C" H 2225 3000 50  0000 L CNN
F 2 "Capacitors_THT:C_Axial_L3.8mm_D2.6mm_P10.00mm_Horizontal" H 2238 2950 50  0001 C CNN
F 3 "" H 2200 3100 50  0001 C CNN
	1    2200 3100
	1    0    0    -1  
$EndComp
$Comp
L Battery_Cell 12~9V1
U 1 1 5A6EA59C
P 1450 3650
F 0 "12~9V1" H 1550 3750 50  0000 L CNN
F 1 "Battery_Cell" H 1550 3650 50  0000 L CNN
F 2 "Battery_Holders:Bulgin_BX0036_1xC" V 1450 3710 50  0001 C CNN
F 3 "" V 1450 3710 50  0001 C CNN
	1    1450 3650
	1    0    0    -1  
$EndComp
$Comp
L POT 10k1
U 1 1 5A6EA61F
P 3100 2850
F 0 "10k1" V 2925 2850 50  0000 C CNN
F 1 "POT" V 3000 2850 50  0000 C CNN
F 2 "Potentiometers:Potentiometer_VishaySpectrol_148_149_Single_Horizontal" H 3100 2850 50  0001 C CNN
F 3 "" H 3100 2850 50  0001 C CNN
	1    3100 2850
	1    0    0    -1  
$EndComp
$Comp
L SW_Push ON/OFF1
U 1 1 5A6EA688
P 2500 2550
F 0 "ON/OFF1" H 2550 2650 50  0000 L CNN
F 1 "Switch" H 2500 2490 50  0000 C CNN
F 2 "Buttons_Switches_THT:SW_Tactile_SPST_Angled_PTS645Vx58-2LFS" H 2500 2750 50  0001 C CNN
F 3 "" H 2500 2750 50  0001 C CNN
	1    2500 2550
	1    0    0    -1  
$EndComp
$Comp
L R R1
U 1 1 5A6EB418
P 4450 2750
F 0 "R1" V 4530 2750 50  0000 C CNN
F 1 "220" V 4450 2750 50  0000 C CNN
F 2 "Resistors_THT:R_Axial_DIN0204_L3.6mm_D1.6mm_P5.08mm_Horizontal" V 4380 2750 50  0001 C CNN
F 3 "" H 4450 2750 50  0001 C CNN
	1    4450 2750
	1    0    0    -1  
$EndComp
$Comp
L Crystal 16M1
U 1 1 5A6EBD1D
P 7300 3150
F 0 "16M1" H 7300 3300 50  0000 C CNN
F 1 "Crystal" H 7300 3000 50  0000 C CNN
F 2 "Crystals:Crystal_HC49-4H_Vertical" H 7300 3150 50  0001 C CNN
F 3 "" H 7300 3150 50  0001 C CNN
	1    7300 3150
	0    -1   -1   0   
$EndComp
$Comp
L LCD-016N002L U1
U 1 1 5A6EE320
P 2850 4200
F 0 "U1" H 2600 4940 50  0000 C CNN
F 1 "LCD-016N002L" H 3190 4940 50  0000 C CNN
F 2 "Displays:LM16255" H 2870 3280 50  0001 C CNN
F 3 "" H 3350 3900 50  0001 C CNN
	1    2850 4200
	0    -1   -1   0   
$EndComp
$Comp
L Fuse F1
U 1 1 5A7137C9
P 2900 2550
F 0 "F1" V 2980 2550 50  0000 C CNN
F 1 "Fuse" V 2825 2550 50  0000 C CNN
F 2 "Fuse_Holders_and_Fuses:Fuse_Littelfuse-LVR100" V 2830 2550 50  0001 C CNN
F 3 "" H 2900 2550 50  0001 C CNN
	1    2900 2550
	0    1    1    0   
$EndComp
$Comp
L USB_A J1
U 1 1 5A713BC2
P 5600 1650
F 0 "J1" H 5400 2100 50  0000 L CNN
F 1 "USB_A" H 5400 2000 50  0000 L CNN
F 2 "Connectors:USB_A" H 5750 1600 50  0001 C CNN
F 3 "" H 5750 1600 50  0001 C CNN
	1    5600 1650
	1    0    0    -1  
$EndComp
$Comp
L USB_A J2
U 1 1 5A715D9E
P 6400 1650
F 0 "J2" H 6200 2100 50  0000 L CNN
F 1 "USB_A" H 6200 2000 50  0000 L CNN
F 2 "Connectors:USB_A" H 6550 1600 50  0001 C CNN
F 3 "" H 6550 1600 50  0001 C CNN
	1    6400 1650
	1    0    0    -1  
$EndComp
$Comp
L USB_A J3
U 1 1 5A715DF9
P 7150 1700
F 0 "J3" H 6950 2150 50  0000 L CNN
F 1 "USB_A" H 6950 2050 50  0000 L CNN
F 2 "Connectors:USB_A" H 7300 1650 50  0001 C CNN
F 3 "" H 7300 1650 50  0001 C CNN
	1    7150 1700
	1    0    0    -1  
$EndComp
$Comp
L USB_A J4
U 1 1 5A715E62
P 7950 1700
F 0 "J4" H 7750 2150 50  0000 L CNN
F 1 "USB_A" H 7750 2050 50  0000 L CNN
F 2 "Connectors:USB_A" H 8100 1650 50  0001 C CNN
F 3 "" H 8100 1650 50  0001 C CNN
	1    7950 1700
	1    0    0    -1  
$EndComp
Text Label 7350 7500 0    60   ~ 12
ProjetoBalança
Text Label 7050 6700 0    60   Italic 0
Luiz_Gustavo
Text Label 7050 6850 0    60   Italic 0
Lukas_Lorenz
Text Label 7050 7000 0    60   Italic 0
Renan_Sisnando
Wire Wire Line
	4800 2550 4800 3150
Connection ~ 4800 2850
Wire Wire Line
	4450 2550 4450 2600
Wire Wire Line
	4450 2900 4450 3050
Wire Wire Line
	4450 3350 4450 4850
Wire Wire Line
	1450 4850 4800 4850
Wire Wire Line
	4800 4750 4700 4750
Wire Wire Line
	4700 4750 4700 5100
Connection ~ 4700 4850
Connection ~ 4450 4850
Connection ~ 3650 4850
Wire Wire Line
	1900 2850 1900 4850
Wire Wire Line
	2200 2950 2200 2550
Wire Wire Line
	1600 3250 2200 3250
Connection ~ 1900 4850
Wire Wire Line
	2200 2550 2300 2550
Connection ~ 1900 3350
Wire Wire Line
	6700 3250 7000 3250
Wire Wire Line
	7000 3250 7000 3300
Wire Wire Line
	7000 3300 7600 3300
Wire Wire Line
	7050 3000 7600 3000
Wire Wire Line
	7050 3000 7050 3150
Wire Wire Line
	7050 3150 6700 3150
Wire Wire Line
	7600 3000 7600 3100
Connection ~ 7300 3000
Connection ~ 7300 3300
Wire Wire Line
	6700 4000 7950 4000
Wire Wire Line
	7950 2100 7950 5100
Wire Wire Line
	7950 3100 7900 3100
Wire Wire Line
	7900 3300 7950 3300
Connection ~ 7950 3300
Wire Wire Line
	2350 4600 2350 4850
Connection ~ 2350 4850
Wire Wire Line
	3650 4200 3650 4850
Wire Wire Line
	7950 5100 4700 5100
Connection ~ 7950 4000
Connection ~ 4450 2550
Wire Wire Line
	2050 4200 2050 3450
Wire Wire Line
	2250 3500 2250 3800
Wire Wire Line
	2650 3800 2650 3650
Wire Wire Line
	2650 3650 3800 3650
Wire Wire Line
	3800 3650 3800 4850
Connection ~ 3800 4850
Wire Wire Line
	1450 2550 1600 2550
Wire Wire Line
	1600 2550 1600 2950
Wire Wire Line
	1900 3350 3100 3350
Wire Wire Line
	2250 3500 3250 3500
Wire Wire Line
	2050 3450 3350 3450
Wire Wire Line
	2550 3800 2550 3450
Connection ~ 2550 3450
Wire Wire Line
	1450 3450 1450 2550
Wire Wire Line
	1450 3750 1450 4850
Wire Wire Line
	3350 3450 3350 2550
Connection ~ 3350 2550
Wire Wire Line
	3100 2550 3100 2700
Connection ~ 3100 2550
Wire Wire Line
	3100 3350 3100 3000
Wire Wire Line
	3250 3500 3250 2850
Wire Wire Line
	2700 2550 2750 2550
Wire Wire Line
	3050 2550 4800 2550
Wire Wire Line
	5600 2050 5600 2300
Wire Wire Line
	5600 2300 7950 2300
Connection ~ 7950 3100
Wire Wire Line
	6400 2050 6400 2300
Connection ~ 6400 2300
Wire Wire Line
	7150 2100 7150 2300
Connection ~ 7150 2300
Connection ~ 7950 2300
Wire Wire Line
	6000 1650 5900 1650
Wire Wire Line
	6700 1650 6800 1650
Wire Wire Line
	7450 1700 7600 1700
Wire Wire Line
	8250 1700 9200 1700
Wire Wire Line
	5900 1750 5900 2150
Wire Wire Line
	8250 2150 8250 1800
Wire Wire Line
	7450 2150 7450 1800
Connection ~ 7450 2150
Wire Wire Line
	6700 1750 6700 2150
Connection ~ 6700 2150
Wire Wire Line
	5900 2150 9000 2150
Wire Wire Line
	2450 4600 2450 5300
Wire Wire Line
	2450 5300 8050 5300
Wire Wire Line
	2250 4600 2250 5400
Wire Wire Line
	2250 5400 8150 5400
Wire Wire Line
	6700 3050 6950 3050
Wire Wire Line
	6950 3050 6950 2950
Wire Wire Line
	6950 2950 8050 2950
Wire Wire Line
	8050 2950 8050 5300
Wire Wire Line
	6700 2950 6850 2950
Wire Wire Line
	6850 2950 6850 2900
Wire Wire Line
	6850 2900 8150 2900
Wire Wire Line
	8150 2900 8150 5400
Wire Wire Line
	6700 2850 8250 2850
Wire Wire Line
	8250 2850 8250 5800
Wire Wire Line
	6700 2750 8350 2750
Wire Wire Line
	8350 2750 8350 5700
Wire Wire Line
	6700 2650 8450 2650
Wire Wire Line
	8450 2650 8450 5600
Wire Wire Line
	6700 2550 8550 2550
Wire Wire Line
	8550 2550 8550 5500
Wire Wire Line
	3150 4600 3150 5800
Wire Wire Line
	3150 5800 8250 5800
Wire Wire Line
	3250 4600 3250 5700
Wire Wire Line
	3250 5700 8350 5700
Wire Wire Line
	3350 4600 3350 5600
Wire Wire Line
	3350 5600 8450 5600
Wire Wire Line
	3450 4600 3450 5500
Wire Wire Line
	3450 5500 8550 5500
Wire Wire Line
	8800 4350 6700 4350
Wire Wire Line
	8800 2400 8800 4350
Wire Wire Line
	8900 4450 6700 4450
Wire Wire Line
	8900 2250 8900 4450
Wire Wire Line
	9000 4550 6700 4550
Wire Wire Line
	9000 2150 9000 4550
Wire Wire Line
	9100 4650 6700 4650
Wire Wire Line
	9100 2050 9100 4650
Wire Wire Line
	9200 4750 6700 4750
Wire Wire Line
	9200 1700 9200 4750
Connection ~ 8250 2150
Wire Wire Line
	8800 2400 6000 2400
Wire Wire Line
	6000 2400 6000 1650
Wire Wire Line
	6800 1650 6800 2250
Wire Wire Line
	6800 2250 8900 2250
Wire Wire Line
	9100 2050 7600 2050
Wire Wire Line
	7600 2050 7600 1700
Wire Wire Line
	5900 1450 5900 1300
Wire Wire Line
	3950 1300 8250 1300
Wire Wire Line
	3950 1300 3950 2550
Connection ~ 3950 2550
Wire Wire Line
	6700 1300 6700 1450
Connection ~ 5900 1300
Wire Wire Line
	7450 1300 7450 1500
Connection ~ 6700 1300
Connection ~ 7450 1300
Wire Wire Line
	8250 1300 8250 1500
$EndSCHEMATC
