{
    "ignition": { "version": "3.4.0" },
    "storage": {
      "files": [
        {
            "path": "/etc/hostname",
            "mode": 420,
            "overwrite": true,
            "contents": { "source": "data:,docker02" }
        }
    ]},
    "passwd": {
        "users": [
          {
            "name": "root",
            "passwordHash": "$1$RWN2G9o/$tmoi3W20rZcMe0svpnPh91",
            "sshAuthorizedKeys": [
              "ssh-ed25519 AAAAC3NzaC1lZDI1NTE5AAAAINOR3caN4D638KeEbQGbWEF9VoJ/axYPaow8lX+mFX1n"
            ]
          }
        ]
    },
    "systemd": {
      "units": [{
        "name": "open-vm-tools.service",
        "enabled": true,
        "contents": "[Unit]\nDescription=Post Installation\nAfter=network-online.target\nWants=network-online.target\n[Service]\nTimeoutStartSec=0\nExecStart=/bin/bash -c 'docker run --privileged --pid=host --net=host --ipc=host --uts=host --restart always --name open-vm-tools arnegroskurth/open-vm-tools && reboot'\n[Install]\nWantedBy=multi-user.target"
      }]
    }
  }