%!PS-Adobe-3.0 EPSF-3.0
%%Creator: cairo 1.10.2 (http://cairographics.org)
%%CreationDate: Fri Aug  1 07:20:04 2014
%%Pages: 1
%%BoundingBox: 0 -1 332 378
%%DocumentData: Clean7Bit
%%LanguageLevel: 2
%%EndComments
%%BeginProlog
/cairo_eps_state save def
/dict_count countdictstack def
/op_count count 1 sub def
userdict begin
/q { gsave } bind def
/Q { grestore } bind def
/cm { 6 array astore concat } bind def
/w { setlinewidth } bind def
/J { setlinecap } bind def
/j { setlinejoin } bind def
/M { setmiterlimit } bind def
/d { setdash } bind def
/m { moveto } bind def
/l { lineto } bind def
/c { curveto } bind def
/h { closepath } bind def
/re { exch dup neg 3 1 roll 5 3 roll moveto 0 rlineto
      0 exch rlineto 0 rlineto closepath } bind def
/S { stroke } bind def
/f { fill } bind def
/f* { eofill } bind def
/n { newpath } bind def
/W { clip } bind def
/W* { eoclip } bind def
/BT { } bind def
/ET { } bind def
/pdfmark where { pop globaldict /?pdfmark /exec load put }
    { globaldict begin /?pdfmark /pop load def /pdfmark
    /cleartomark load def end } ifelse
/BDC { mark 3 1 roll /BDC pdfmark } bind def
/EMC { mark /EMC pdfmark } bind def
/cairo_store_point { /cairo_point_y exch def /cairo_point_x exch def } def
/Tj { show currentpoint cairo_store_point } bind def
/TJ {
  {
    dup
    type /stringtype eq
    { show } { -0.001 mul 0 cairo_font_matrix dtransform rmoveto } ifelse
  } forall
  currentpoint cairo_store_point
} bind def
/cairo_selectfont { cairo_font_matrix aload pop pop pop 0 0 6 array astore
    cairo_font exch selectfont cairo_point_x cairo_point_y moveto } bind def
/Tf { pop /cairo_font exch def /cairo_font_matrix where
      { pop cairo_selectfont } if } bind def
/Td { matrix translate cairo_font_matrix matrix concatmatrix dup
      /cairo_font_matrix exch def dup 4 get exch 5 get cairo_store_point
      /cairo_font where { pop cairo_selectfont } if } bind def
/Tm { 2 copy 8 2 roll 6 array astore /cairo_font_matrix exch def
      cairo_store_point /cairo_font where { pop cairo_selectfont } if } bind def
/g { setgray } bind def
/rg { setrgbcolor } bind def
/d1 { setcachedevice } bind def
%%EndProlog
%%Page: 1 1
%%BeginPageSetup
%%PageBoundingBox: 0 -1 332 378
%%EndPageSetup
q 0 -1 332 379 rectclip q
0 377.957 332 -378 re W n
0 g
329.855 259.578 m 323.41 291.164 327.52 357.359 218.09 374.808 c 
108.684 392.281 10.098 336.757 34.871 215.425 c 34.871 193.304 -8.898 
158.984 1.637 147.379 c 12.184 135.757 30.09 135.312 30.09 135.312 c 
30.09 135.312 18.457 113.218 23.676 107.109 c 28.941 100.988 43.461 
103.609 43.461 103.609 c 43.461 103.609 29.965 93.855 29.965 86.3 c 
29.965 78.754 52.793 68.683 52.793 68.683 c 52.793 68.683 48.602 26.82 
82.887 29.718 c 117.199 32.636 122.938 42.296 122.938 42.296 c 133.113 
-0 l 265.805 -0 l 261.156 91.976 l 261.156 91.976 342.645 180.437 
329.855 259.578 c h
234.969 184.57 m 232.352 180.125 231.109 143.523 230.309 138.629 c 
229.508 133.738 217.191 132.679 213.664 141.293 c 211.008 147.781 
202.922 184.109 199.082 201.683 c 184.781 204.265 173.887 217.527 
173.887 233.507 c 173.887 235.968 174.152 238.359 174.641 240.664 c 
173.625 240.554 172.598 240.5 171.555 240.5 c 162.738 240.5 154.801 
244.515 149.266 250.921 c 144.555 247.703 138.953 245.824 132.938 
245.824 c 119.812 245.824 108.645 254.718 104.434 267.164 c 104.273 
267.168 104.117 267.168 103.953 267.175 c 87.246 268.05 74.457 283.195 
75.387 301.004 c 75.5 303.156 75.812 305.254 76.297 307.269 c 77.652 
323.097 98.922 340.593 128.043 348.55 c 152.484 355.23 175.578 353.308 
187.82 344.871 c 191.934 347.097 196.586 348.359 201.516 348.359 c 
215.457 348.359 227.188 338.32 230.719 324.656 c 232.266 324.918 
233.855 325.054 235.473 325.054 c 249.477 325.054 261.254 314.925 
264.723 301.164 c 280.77 296.929 292.988 282.371 294.82 264.472 c 
301.965 256.777 306.383 246.191 306.383 234.507 c 306.383 213.816 
292.543 196.574 274.195 192.711 c 274.117 192.211 l 274.117 192.211 
237.59 189.019 234.969 184.57 c h
234.969 184.57 m f
229.059 301.406 m 228.492 301.464 227.895 301.5 227.277 301.5 c 221.07 
301.5 214.883 298.586 211.035 293.957 c 207.184 298.586 201 301.5 
194.793 301.5 c 194.18 301.5 193.582 301.464 193.008 301.406 c 186.012 
300.656 181.094 298.293 177.965 294.187 c 174.863 290.117 173.852 
284.597 174.961 277.785 c 176.582 267.902 189.383 255.863 199.664 
246.187 c 199.902 245.968 l 202.766 243.269 205.238 240.945 206.852 
239.207 c 207.066 238.964 209.031 236.816 211.184 236.816 c 213.344 
236.816 215.266 238.996 215.438 239.207 c 217.152 241.062 219.93 
243.695 222.676 246.289 c 232.844 255.937 245.5 267.941 247.105 277.789 
c 248.219 284.597 247.215 290.113 244.109 294.187 c 240.984 298.293 
236.062 300.656 229.059 301.406 c h
229.059 301.406 m f
Q Q
showpage
%%Trailer
count op_count sub {pop} repeat
countdictstack dict_count sub {end} repeat
cairo_eps_state restore
%%EOF
