<?xml version="1.0" encoding="iso-8859-1"?>
<!-- Generator: Adobe Illustrator 16.0.0, SVG Export Plug-In . SVG Version: 6.00 Build 0)  -->
<!DOCTYPE svg PUBLIC "-//W3C//DTD SVG 1.1//EN" "http://www.w3.org/Graphics/SVG/1.1/DTD/svg11.dtd">
<svg version="1.1" xmlns="http://www.w3.org/2000/svg" xmlns:xlink="http://www.w3.org/1999/xlink" x="0px" y="0px" width="512px"
	 height="512px" viewBox="0 0 512 512" style="enable-background:new 0 0 512 512;" xml:space="preserve">
<g id="Guides_For_Artboard">
</g>
<g id="_x30_">
</g>
<g id="_x31_">
</g>
<g id="_x32_">
	<g>
		<path d="M348.524,221.567c-45.367-32.234-82.974,10.745-91.927,10.745c-0.168,0-1.026,0-1.194,0
			c-8.953,0-46.561-42.979-91.927-10.745c-45.367,32.234-11.342,186.243,75.213,186.243c6.921,0,12.602,0,18.356,0
			c5.064,0,10.185,0,16.267,0C359.866,407.811,393.892,253.802,348.524,221.567z"/>
		<path d="M258.196,219.169c24.106-12.76,83.564-68.401,37.57-96.414c-42.037-25.602-53.874,65.929-47.163,90.743
			C255.315,218.465,254.228,216.829,258.196,219.169z"/>
		<path d="M386.557,15.514H136.429v0.171c-0.014-0.066-0.023-0.113-0.023-0.113l-85.414,85.395h-0.019v0.019l-0.024,0.024
			c0,0,0.015,0.002,0.024,0.003v321.288c0,41.062,33.407,74.469,74.469,74.469h261.114c41.063,0,74.47-33.407,74.47-74.469V89.983
			C461.026,48.921,427.62,15.514,386.557,15.514z M426.026,422.302c0,21.763-17.706,39.469-39.47,39.469H125.442
			c-21.763,0-39.469-17.706-39.469-39.469V135.728c32.954-1.026,54.379-5.706,68.401-21.021
			c13.311-14.538,16.291-35.366,16.905-64.192h215.277c21.764,0,39.47,17.706,39.47,39.469V422.302z"/>
	</g>
</g>
<g id="_x33_">
</g>
<g id="_x34_">
</g>
<g id="_x35_">
</g>
<g id="_x36_">
</g>
<g id="_x37_">
</g>
<g id="_x38_">
</g>
<g id="_x39_">
</g>
<g id="_x31_0">
</g>
<g id="_x31_1">
</g>
<g id="_x31_2">
</g>
<g id="_x31_3">
</g>
<g id="_x31_4">
</g>
<g id="_x31_5">
</g>
<g id="_x31_6">
</g>
<g id="_x31_7">
</g>
<g id="_x31_8">
</g>
<g id="_x31_9">
</g>
<g id="_x32_0">
</g>
<g id="_x32_1">
</g>
<g id="_x32_2">
</g>
<g id="_x32_3">
</g>
<g id="_x32_4">
</g>
<g id="_x32_5">
</g>
<g id="_x32_6">
</g>
<g id="_x32_7">
</g>
<g id="_x32_8">
</g>
<g id="_x32_9">
</g>
<g id="_x33_0">
</g>
<g id="_x33_1">
</g>
<g id="_x33_2">
</g>
<g id="_x33_3">
</g>
<g id="_x33_4">
</g>
<g id="_x33_5">
</g>
<g id="_x33_6">
</g>
<g id="_x33_7">
</g>
<g id="_x33_8">
</g>
<g id="_x33_9">
</g>
<g id="_x34_0">
</g>
<g id="_x34_1">
</g>
<g id="_x34_2">
</g>
<g id="_x34_3">
</g>
<g id="_x34_4">
</g>
<g id="_x34_5">
</g>
<g id="_x34_6">
</g>
<g id="_x34_7">
</g>
<g id="_x34_8">
</g>
<g id="_x34_9">
</g>
<g id="_x35_0">
</g>
<g id="_x35_1">
</g>
<g id="_x35_2">
</g>
<g id="_x35_3">
</g>
<g id="_x35_4">
</g>
<g id="_x35_5">
</g>
<g id="_x35_6">
</g>
<g id="_x35_7">
</g>
<g id="_x35_8">
</g>
<g id="_x35_9">
</g>
<g id="_x36_0">
</g>
<g id="_x36_1">
</g>
<g id="_x36_2">
</g>
<g id="_x36_3">
</g>
<g id="_x36_4">
</g>
<g id="_x36_5">
</g>
<g id="_x36_6">
</g>
<g id="_x36_7">
</g>
<g id="_x36_8">
</g>
<g id="_x36_9">
</g>
<g id="_x37_0">
</g>
</svg>
