%!PS-Adobe-3.0 EPSF-3.0
%%Creator: cairo 1.10.2 (http://cairographics.org)
%%CreationDate: Thu Jul 31 07:30:09 2014
%%Pages: 1
%%BoundingBox: 0 -1 330 390
%%DocumentData: Clean7Bit
%%LanguageLevel: 2
%%EndComments
%%BeginProlog
/cairo_eps_state save def
/dict_count countdictstack def
/op_count count 1 sub def
userdict begin
/q { gsave } bind def
/Q { grestore } bind def
/cm { 6 array astore concat } bind def
/w { setlinewidth } bind def
/J { setlinecap } bind def
/j { setlinejoin } bind def
/M { setmiterlimit } bind def
/d { setdash } bind def
/m { moveto } bind def
/l { lineto } bind def
/c { curveto } bind def
/h { closepath } bind def
/re { exch dup neg 3 1 roll 5 3 roll moveto 0 rlineto
      0 exch rlineto 0 rlineto closepath } bind def
/S { stroke } bind def
/f { fill } bind def
/f* { eofill } bind def
/n { newpath } bind def
/W { clip } bind def
/W* { eoclip } bind def
/BT { } bind def
/ET { } bind def
/pdfmark where { pop globaldict /?pdfmark /exec load put }
    { globaldict begin /?pdfmark /pop load def /pdfmark
    /cleartomark load def end } ifelse
/BDC { mark 3 1 roll /BDC pdfmark } bind def
/EMC { mark /EMC pdfmark } bind def
/cairo_store_point { /cairo_point_y exch def /cairo_point_x exch def } def
/Tj { show currentpoint cairo_store_point } bind def
/TJ {
  {
    dup
    type /stringtype eq
    { show } { -0.001 mul 0 cairo_font_matrix dtransform rmoveto } ifelse
  } forall
  currentpoint cairo_store_point
} bind def
/cairo_selectfont { cairo_font_matrix aload pop pop pop 0 0 6 array astore
    cairo_font exch selectfont cairo_point_x cairo_point_y moveto } bind def
/Tf { pop /cairo_font exch def /cairo_font_matrix where
      { pop cairo_selectfont } if } bind def
/Td { matrix translate cairo_font_matrix matrix concatmatrix dup
      /cairo_font_matrix exch def dup 4 get exch 5 get cairo_store_point
      /cairo_font where { pop cairo_selectfont } if } bind def
/Tm { 2 copy 8 2 roll 6 array astore /cairo_font_matrix exch def
      cairo_store_point /cairo_font where { pop cairo_selectfont } if } bind def
/g { setgray } bind def
/rg { setrgbcolor } bind def
/d1 { setcachedevice } bind def
%%EndProlog
%%Page: 1 1
%%BeginPageSetup
%%PageBoundingBox: 0 -1 330 390
%%EndPageSetup
q 0 -1 330 391 rectclip q
0 389.762 330 -390 re W n
0 g
258.391 153.708 m 236.613 161.645 222.301 168.958 213.445 177.895 c 
213.445 168.059 l 213.445 142.579 193.656 121.852 169.219 120.286 c 
169.219 67.469 l 168.672 51.657 180.074 39.993 194.152 39.993 c 208.227 
39.993 219.75 51.657 219.75 67.071 c 219.73 89.825 l 219.73 110.782 
235.684 127.821 255.309 127.821 c 274.93 127.821 290.887 110.782 
290.887 89.825 c 290.887 63.825 l 290.887 63.43 290.75 63.118 290.672 
62.743 c 298.09 60.212 303.465 53.243 303.465 44.985 c 303.465 34.602 
295.004 26.145 284.625 26.145 c 274.223 26.145 265.785 34.602 265.785 
44.985 c 265.785 54.098 272.289 61.723 280.918 63.45 c 280.898 63.587 
280.836 63.676 280.836 63.825 c 280.836 89.825 l 280.836 105.227 
269.375 117.774 255.305 117.774 c 241.234 117.774 229.777 105.227 
229.777 89.825 c 229.797 67.071 l 229.797 46.11 213.828 29.067 194.207 
29.067 c 174.582 29.067 158.625 46.11 158.625 67.071 c 158.625 120.133 
l 134.824 123.251 116.328 143.43 116.328 168.059 c 116.328 177.665 l 
107.461 168.833 93.203 161.575 71.613 153.708 c 28.203 137.887 0 
116.966 0 105.966 c 0 0.001 l 330 0.001 l 330 105.966 l 330 116.966 
301.797 137.887 258.391 153.708 c h
258.391 153.708 m f
93.391 283.958 m 95.621 254.305 107.293 267.083 109.699 254.094 c 
115.504 222.782 128.715 228.36 128.715 211.266 c 128.715 204.794 
126.379 200.141 126.379 194.001 c 126.379 168.059 l 126.379 146.829 
143.648 129.548 164.891 129.548 c 186.125 129.548 203.398 146.829 
203.398 168.059 c 203.398 194.7 l 203.398 199.594 201.285 205.091 
201.285 211.266 c 201.285 228.36 214.5 222.782 220.301 254.094 c 
222.707 267.083 234.379 254.305 236.617 283.958 c 236.617 295.778 
230.246 298.716 230.246 298.716 c 230.246 298.716 233.48 316.204 
234.746 329.665 c 236.32 346.434 225.059 389.762 165 389.762 c 104.945 
389.762 93.684 346.434 95.254 329.665 c 96.523 316.204 99.762 298.716 
99.762 298.716 c 99.762 298.716 93.391 295.778 93.391 283.958 c h
93.391 283.958 m f
284.625 36.192 m 289.465 36.192 293.418 40.157 293.418 44.985 c 293.418 
49.821 289.465 53.774 284.625 53.774 c 279.789 53.774 275.836 49.821 
275.836 44.985 c 275.836 40.157 279.789 36.192 284.625 36.192 c h
284.625 36.192 m f
Q Q
showpage
%%Trailer
count op_count sub {pop} repeat
countdictstack dict_count sub {end} repeat
cairo_eps_state restore
%%EOF
