%!PS-Adobe-3.0 EPSF-3.0
%%Creator: cairo 1.10.2 (http://cairographics.org)
%%CreationDate: Thu Jul 31 07:30:12 2014
%%Pages: 1
%%BoundingBox: 0 -1 390 245
%%DocumentData: Clean7Bit
%%LanguageLevel: 2
%%EndComments
%%BeginProlog
/cairo_eps_state save def
/dict_count countdictstack def
/op_count count 1 sub def
userdict begin
/q { gsave } bind def
/Q { grestore } bind def
/cm { 6 array astore concat } bind def
/w { setlinewidth } bind def
/J { setlinecap } bind def
/j { setlinejoin } bind def
/M { setmiterlimit } bind def
/d { setdash } bind def
/m { moveto } bind def
/l { lineto } bind def
/c { curveto } bind def
/h { closepath } bind def
/re { exch dup neg 3 1 roll 5 3 roll moveto 0 rlineto
      0 exch rlineto 0 rlineto closepath } bind def
/S { stroke } bind def
/f { fill } bind def
/f* { eofill } bind def
/n { newpath } bind def
/W { clip } bind def
/W* { eoclip } bind def
/BT { } bind def
/ET { } bind def
/pdfmark where { pop globaldict /?pdfmark /exec load put }
    { globaldict begin /?pdfmark /pop load def /pdfmark
    /cleartomark load def end } ifelse
/BDC { mark 3 1 roll /BDC pdfmark } bind def
/EMC { mark /EMC pdfmark } bind def
/cairo_store_point { /cairo_point_y exch def /cairo_point_x exch def } def
/Tj { show currentpoint cairo_store_point } bind def
/TJ {
  {
    dup
    type /stringtype eq
    { show } { -0.001 mul 0 cairo_font_matrix dtransform rmoveto } ifelse
  } forall
  currentpoint cairo_store_point
} bind def
/cairo_selectfont { cairo_font_matrix aload pop pop pop 0 0 6 array astore
    cairo_font exch selectfont cairo_point_x cairo_point_y moveto } bind def
/Tf { pop /cairo_font exch def /cairo_font_matrix where
      { pop cairo_selectfont } if } bind def
/Td { matrix translate cairo_font_matrix matrix concatmatrix dup
      /cairo_font_matrix exch def dup 4 get exch 5 get cairo_store_point
      /cairo_font where { pop cairo_selectfont } if } bind def
/Tm { 2 copy 8 2 roll 6 array astore /cairo_font_matrix exch def
      cairo_store_point /cairo_font where { pop cairo_selectfont } if } bind def
/g { setgray } bind def
/rg { setrgbcolor } bind def
/d1 { setcachedevice } bind def
%%EndProlog
%%Page: 1 1
%%BeginPageSetup
%%PageBoundingBox: 0 -1 390 245
%%EndPageSetup
q 0 -1 390 246 rectclip q
0 244.547 390 -245 re W n
0 g
387.859 83.602 m 385.262 97.133 377.051 107.676 364.766 114.828 c 
354.801 121.535 342.605 125.531 329.379 125.531 c 328.457 125.531 
308.09 125.527 306.156 125.527 c 269.34 90.148 l 261.273 82.438 251.758 
79.313 248.086 83.152 c 243.098 88.371 l 239.43 92.215 242.992 101.578 
251.059 109.285 c 280.723 137.621 l 276.109 140.883 271.379 144.676 
266.594 148.856 c 221.316 105.602 l 213.246 97.895 203.734 94.766 
200.062 98.606 c 195.074 103.828 l 191.406 107.672 194.969 117.035 
203.035 124.738 c 247.426 167.141 l 242.777 171.902 238.172 176.816 
233.664 181.762 c 203.5 152.949 l 176.07 126.75 l 168.004 119.039 
158.492 115.914 154.82 119.754 c 149.832 124.973 l 146.164 128.816 
149.727 138.18 157.793 145.887 c 157.793 145.887 178.238 168.313 
188.055 176.938 c 197.871 185.563 216.082 201.566 216.082 201.566 c 
201.461 218.383 189.172 233.047 182.062 239.172 c 160.535 257.715 
136.473 223.949 149.488 203.574 c 158.707 184.598 133.223 152.914 
93.094 159.965 c 52.965 167.012 46.461 204.43 37.781 212.02 c 29.105 
219.609 0 219.301 0 199.336 c 0 179.371 0.098 56.402 0.098 39.106 c 
-1.527 23.379 17.176 0 38.324 0 c 107.191 0 l 119.133 0 133.219 26.027 
153.281 26.027 c 173.344 26.027 193.953 0 206.426 0 c 324.094 0 l 
346.324 0 374.723 31.43 376.844 33.922 c 376.914 33.996 376.988 34.066 
377.059 34.137 c 377.086 34.188 377.109 34.238 377.137 34.293 c 385.156 
43.875 389.977 55.902 389.977 69 c 389.977 74.063 389.195 78.938 
387.859 83.602 c h
387.859 83.602 m f
Q Q
showpage
%%Trailer
count op_count sub {pop} repeat
countdictstack dict_count sub {end} repeat
cairo_eps_state restore
%%EOF
