<?xml version="1.0" encoding="iso-8859-1"?>
<!-- Generator: Adobe Illustrator 16.0.0, SVG Export Plug-In . SVG Version: 6.00 Build 0)  -->
<!DOCTYPE svg PUBLIC "-//W3C//DTD SVG 1.1//EN" "http://www.w3.org/Graphics/SVG/1.1/DTD/svg11.dtd">
<svg version="1.1" xmlns="http://www.w3.org/2000/svg" xmlns:xlink="http://www.w3.org/1999/xlink" x="0px" y="0px" width="512px"
	 height="512px" viewBox="0 0 512 512" style="enable-background:new 0 0 512 512;" xml:space="preserve">
<g id="Guides_For_Artboard">
</g>
<g id="_x30_">
</g>
<g id="_x31_">
</g>
<g id="_x32_">
</g>
<g id="_x33_">
</g>
<g id="_x34_">
</g>
<g id="_x35_">
</g>
<g id="_x36_">
</g>
<g id="_x37_">
</g>
<g id="_x38_">
</g>
<g id="_x39_">
</g>
<g id="_x31_0">
</g>
<g id="_x31_1">
</g>
<g id="_x31_2">
</g>
<g id="_x31_3">
</g>
<g id="_x31_4">
</g>
<g id="_x31_5">
</g>
<g id="_x31_6">
</g>
<g id="_x31_7">
</g>
<g id="_x31_8">
</g>
<g id="_x31_9">
</g>
<g id="_x32_0">
</g>
<g id="_x32_1">
</g>
<g id="_x32_2">
</g>
<g id="_x32_3">
</g>
<g id="_x32_4">
</g>
<g id="_x32_5">
</g>
<g id="_x32_6">
</g>
<g id="_x32_7">
</g>
<g id="_x32_8">
</g>
<g id="_x32_9">
</g>
<g id="_x33_0">
</g>
<g id="_x33_1">
</g>
<g id="_x33_2">
</g>
<g id="_x33_3">
</g>
<g id="_x33_4">
</g>
<g id="_x33_5">
</g>
<g id="_x33_6">
</g>
<g id="_x33_7">
</g>
<g id="_x33_8">
</g>
<g id="_x33_9">
</g>
<g id="_x34_0">
</g>
<g id="_x34_1">
</g>
<g id="_x34_2">
</g>
<g id="_x34_3">
</g>
<g id="_x34_4">
</g>
<g id="_x34_5">
</g>
<g id="_x34_6">
</g>
<g id="_x34_7">
</g>
<g id="_x34_8">
</g>
<g id="_x34_9">
</g>
<g id="_x35_0">
</g>
<g id="_x35_1">
</g>
<g id="_x35_2">
</g>
<g id="_x35_3">
</g>
<g id="_x35_4">
</g>
<g id="_x35_5">
	<g>
		<path d="M406.439,52.917h-24.461V34.446c0-11.473-9.303-20.778-20.779-20.778h-7.552c-11.476,0-20.778,9.306-20.778,20.778v18.471
			H187.514V34.446c0-11.473-9.303-20.778-20.779-20.778h-7.552c-11.476,0-20.777,9.306-20.777,20.778v18.471h-32.845
			c-30.932,0-56.096,25.165-56.096,56.097v333.222c0,30.932,25.164,56.097,56.096,56.097h300.879
			c30.932,0,56.096-25.165,56.096-56.097V109.014C462.535,78.082,437.371,52.917,406.439,52.917z M428.754,442.235
			c0,12.304-10.011,22.315-22.314,22.315H105.561c-12.304,0-22.314-10.012-22.314-22.315V109.014
			c0-12.305,10.011-22.315,22.314-22.315h32.845v26.537c0,11.474,9.302,20.779,20.777,20.779h7.552
			c11.477,0,20.779-9.306,20.779-20.779V86.698h145.355v26.537c0,11.474,9.303,20.779,20.778,20.779h7.552
			c11.477,0,20.779-9.306,20.779-20.779V86.698h24.461c12.304,0,22.314,10.011,22.314,22.315V442.235z"/>
		<path d="M370.333,179.865h-222c-9.328,0-16.891,7.563-16.891,16.891s7.563,16.891,16.891,16.891h222
			c9.328,0,16.891-7.563,16.891-16.891S379.661,179.865,370.333,179.865z"/>
		<path d="M369.144,246.865h-222c-9.328,0-16.891,7.563-16.891,16.891s7.563,16.891,16.891,16.891h222
			c9.328,0,16.891-7.563,16.891-16.891S378.472,246.865,369.144,246.865z"/>
		<path d="M367.954,313.865h-222c-9.328,0-16.891,7.563-16.891,16.891s7.563,16.891,16.891,16.891h222
			c9.328,0,16.891-7.563,16.891-16.891S377.282,313.865,367.954,313.865z"/>
		<path d="M366.765,380.865h-222c-9.328,0-16.891,7.563-16.891,16.891s7.563,16.891,16.891,16.891h222
			c9.328,0,16.891-7.563,16.891-16.891S376.093,380.865,366.765,380.865z"/>
	</g>
</g>
<g id="_x35_6">
</g>
<g id="_x35_7">
</g>
<g id="_x35_8">
</g>
<g id="_x35_9">
</g>
<g id="_x36_0">
</g>
<g id="_x36_1">
</g>
<g id="_x36_2">
</g>
<g id="_x36_3">
</g>
<g id="_x36_4">
</g>
<g id="_x36_5">
</g>
<g id="_x36_6">
</g>
<g id="_x36_7">
</g>
<g id="_x36_8">
</g>
<g id="_x36_9">
</g>
<g id="_x37_0">
</g>
</svg>
