%!PS-Adobe-3.0 EPSF-3.0
%%Creator: cairo 1.10.2 (http://cairographics.org)
%%CreationDate: Wed Jul 30 08:47:32 2014
%%Pages: 1
%%BoundingBox: 0 -1 386 330
%%DocumentData: Clean7Bit
%%LanguageLevel: 2
%%EndComments
%%BeginProlog
/cairo_eps_state save def
/dict_count countdictstack def
/op_count count 1 sub def
userdict begin
/q { gsave } bind def
/Q { grestore } bind def
/cm { 6 array astore concat } bind def
/w { setlinewidth } bind def
/J { setlinecap } bind def
/j { setlinejoin } bind def
/M { setmiterlimit } bind def
/d { setdash } bind def
/m { moveto } bind def
/l { lineto } bind def
/c { curveto } bind def
/h { closepath } bind def
/re { exch dup neg 3 1 roll 5 3 roll moveto 0 rlineto
      0 exch rlineto 0 rlineto closepath } bind def
/S { stroke } bind def
/f { fill } bind def
/f* { eofill } bind def
/n { newpath } bind def
/W { clip } bind def
/W* { eoclip } bind def
/BT { } bind def
/ET { } bind def
/pdfmark where { pop globaldict /?pdfmark /exec load put }
    { globaldict begin /?pdfmark /pop load def /pdfmark
    /cleartomark load def end } ifelse
/BDC { mark 3 1 roll /BDC pdfmark } bind def
/EMC { mark /EMC pdfmark } bind def
/cairo_store_point { /cairo_point_y exch def /cairo_point_x exch def } def
/Tj { show currentpoint cairo_store_point } bind def
/TJ {
  {
    dup
    type /stringtype eq
    { show } { -0.001 mul 0 cairo_font_matrix dtransform rmoveto } ifelse
  } forall
  currentpoint cairo_store_point
} bind def
/cairo_selectfont { cairo_font_matrix aload pop pop pop 0 0 6 array astore
    cairo_font exch selectfont cairo_point_x cairo_point_y moveto } bind def
/Tf { pop /cairo_font exch def /cairo_font_matrix where
      { pop cairo_selectfont } if } bind def
/Td { matrix translate cairo_font_matrix matrix concatmatrix dup
      /cairo_font_matrix exch def dup 4 get exch 5 get cairo_store_point
      /cairo_font where { pop cairo_selectfont } if } bind def
/Tm { 2 copy 8 2 roll 6 array astore /cairo_font_matrix exch def
      cairo_store_point /cairo_font where { pop cairo_selectfont } if } bind def
/g { setgray } bind def
/rg { setrgbcolor } bind def
/d1 { setcachedevice } bind def
%%EndProlog
%%Page: 1 1
%%BeginPageSetup
%%PageBoundingBox: 0 -1 386 330
%%EndPageSetup
q 0 -1 386 331 rectclip q
0 329.545 386 -330 re W n
0 g
125.422 121.252 m 119.277 121.252 114.293 116.272 114.293 110.124 c 
114.293 103.975 119.277 98.995 125.422 98.995 c 131.57 98.995 136.555 
103.975 136.555 110.124 c 136.551 116.272 131.57 121.252 125.422 
121.252 c h
125.422 121.252 m f
382.625 322.35 m 378.691 326.284 l 374.344 330.631 367.301 330.631 
362.953 326.284 c 333.414 296.749 l 268.93 296.749 l 262.781 296.749 
257.801 291.768 257.801 285.62 c 257.801 280.057 l 257.801 273.909 
262.781 268.928 268.93 268.928 c 293.848 268.928 l 239.066 137.428 l 
158.559 186.772 l 154.945 189.377 151.133 191.713 147.148 193.768 c 
146.91 193.893 l 140.012 197.42 132.59 200.057 124.812 201.733 c 
108.148 241.108 l 108.148 241.108 133.188 245.167 140.957 246.674 c 
148.723 248.182 152.082 251.655 152.082 257.803 c 152.082 274.03 l 
152.082 280.174 147.102 285.159 140.957 285.159 c 35.238 285.159 l 
29.094 285.159 24.109 280.174 24.109 274.03 c 24.109 252.237 l 24.109 
246.088 29.094 241.108 35.238 241.108 c 87.215 241.108 l 103.039 
203.713 l 54.387 202.249 15.387 162.377 15.387 113.37 c 15.387 73.659 
41 39.963 76.598 27.823 c 11.129 27.823 l 4.98 27.823 0 22.838 0 16.694 
c 0 11.127 l 0 4.983 4.98 -0.001 11.129 -0.001 c 308.805 -0.001 l 
314.949 -0.001 319.93 4.983 319.93 11.127 c 319.93 16.694 l 319.93 
22.838 314.949 27.823 308.805 27.823 c 261.664 27.823 l 279.684 36.124 
292.199 54.315 292.199 75.463 c 292.199 94.229 282.324 110.647 267.516 
119.936 c 267.531 119.987 l 255.707 127.233 l 314.738 268.928 l 339.867 
268.928 l 339.945 268.928 340.02 268.948 340.094 268.952 c 343.02 
268.889 345.965 269.956 348.199 272.19 c 382.625 306.612 l 386.973 
310.959 386.973 318.006 382.625 322.35 c h
169.008 38.139 m 101.312 38.139 l 97.086 38.139 93.66 41.565 93.66 
45.788 c 93.66 50.014 97.086 53.44 101.312 53.44 c 114.34 53.44 l 
114.34 80.362 l 102.266 84.862 93.66 96.479 93.66 110.124 c 93.66 
127.663 107.879 141.881 125.422 141.881 c 142.965 141.881 157.184 
127.663 157.184 110.124 c 157.184 96.495 148.594 84.893 136.539 80.393 
c 136.539 53.44 l 169.008 53.44 l 173.234 53.44 176.656 50.014 176.656 
45.788 c 176.656 41.565 173.234 38.139 169.008 38.139 c h
169.008 38.139 m f
Q Q
showpage
%%Trailer
count op_count sub {pop} repeat
countdictstack dict_count sub {end} repeat
cairo_eps_state restore
%%EOF
