%!PS-Adobe-3.0 EPSF-3.0
%%Creator: cairo 1.10.2 (http://cairographics.org)
%%CreationDate: Thu Jul 31 07:30:12 2014
%%Pages: 1
%%BoundingBox: 0 -1 333 388
%%DocumentData: Clean7Bit
%%LanguageLevel: 2
%%EndComments
%%BeginProlog
/cairo_eps_state save def
/dict_count countdictstack def
/op_count count 1 sub def
userdict begin
/q { gsave } bind def
/Q { grestore } bind def
/cm { 6 array astore concat } bind def
/w { setlinewidth } bind def
/J { setlinecap } bind def
/j { setlinejoin } bind def
/M { setmiterlimit } bind def
/d { setdash } bind def
/m { moveto } bind def
/l { lineto } bind def
/c { curveto } bind def
/h { closepath } bind def
/re { exch dup neg 3 1 roll 5 3 roll moveto 0 rlineto
      0 exch rlineto 0 rlineto closepath } bind def
/S { stroke } bind def
/f { fill } bind def
/f* { eofill } bind def
/n { newpath } bind def
/W { clip } bind def
/W* { eoclip } bind def
/BT { } bind def
/ET { } bind def
/pdfmark where { pop globaldict /?pdfmark /exec load put }
    { globaldict begin /?pdfmark /pop load def /pdfmark
    /cleartomark load def end } ifelse
/BDC { mark 3 1 roll /BDC pdfmark } bind def
/EMC { mark /EMC pdfmark } bind def
/cairo_store_point { /cairo_point_y exch def /cairo_point_x exch def } def
/Tj { show currentpoint cairo_store_point } bind def
/TJ {
  {
    dup
    type /stringtype eq
    { show } { -0.001 mul 0 cairo_font_matrix dtransform rmoveto } ifelse
  } forall
  currentpoint cairo_store_point
} bind def
/cairo_selectfont { cairo_font_matrix aload pop pop pop 0 0 6 array astore
    cairo_font exch selectfont cairo_point_x cairo_point_y moveto } bind def
/Tf { pop /cairo_font exch def /cairo_font_matrix where
      { pop cairo_selectfont } if } bind def
/Td { matrix translate cairo_font_matrix matrix concatmatrix dup
      /cairo_font_matrix exch def dup 4 get exch 5 get cairo_store_point
      /cairo_font where { pop cairo_selectfont } if } bind def
/Tm { 2 copy 8 2 roll 6 array astore /cairo_font_matrix exch def
      cairo_store_point /cairo_font where { pop cairo_selectfont } if } bind def
/g { setgray } bind def
/rg { setrgbcolor } bind def
/d1 { setcachedevice } bind def
%%EndProlog
%%Page: 1 1
%%BeginPageSetup
%%PageBoundingBox: 0 -1 333 388
%%EndPageSetup
q 0 -1 333 389 rectclip q
0 387.72 333 -388 re W n
0 g
166.953 264.704 m 167.023 264.704 167.09 264.708 167.16 264.708 c 
167.23 264.708 167.297 264.704 167.367 264.704 c 201.336 264.704 
228.875 292.24 228.875 326.212 c 228.875 360.181 201.336 387.72 167.367 
387.72 c 167.297 387.72 167.23 387.716 167.16 387.716 c 167.09 387.716 
167.023 387.72 166.953 387.72 c 132.98 387.72 105.445 360.181 105.445 
326.212 c 105.445 292.24 132.98 264.704 166.953 264.704 c h
166.953 264.704 m f
321.441 138.888 m 252.078 189.322 l 230.145 242.884 l 225.973 253.079 
216.031 259.154 205.637 258.927 c 205.633 258.95 l 126.469 258.95 l 
126.465 258.927 l 116.07 259.154 106.129 253.079 101.953 242.884 c 
80.02 189.322 l 10.656 138.888 l -0.898 130.49 -3.453 114.31 4.949 
102.755 c 10.012 95.794 17.898 92.099 25.891 92.099 c 31.168 92.099 
36.488 93.708 41.082 97.048 c 116.078 151.572 l 114.168 131.833 l 
43.258 59.962 l 33.418 49.728 30.645 34.603 36.211 21.54 c 41.773 8.478 
54.598 0.001 68.797 0.001 c 102.691 0.001 l 93.957 7.908 88.387 19.7 
88.387 32.876 c 88.387 56.622 106.445 75.947 128.641 75.947 c 167.246 
75.947 l 179.891 75.947 189.926 65.607 189.926 65.607 c 128.641 65.607 
l 111.773 65.607 98.047 50.923 98.047 32.876 c 98.047 14.825 111.773 
0.142 128.641 0.142 c 187.992 0.142 l 188.66 0.189 189.336 0.193 
189.992 0.271 c 261.738 0.271 l 275.938 0.271 288.762 8.751 294.328 
21.814 c 299.891 34.876 297.117 49.993 287.281 60.232 c 217.918 132.193 
l 217.898 132.193 l 216.02 151.572 l 291.016 97.048 l 295.605 93.708 
300.934 92.099 306.207 92.099 c 314.203 92.099 322.086 95.794 327.148 
102.755 c 335.551 114.31 332.996 130.49 321.441 138.888 c h
321.441 138.888 m f
Q Q
showpage
%%Trailer
count op_count sub {pop} repeat
countdictstack dict_count sub {end} repeat
cairo_eps_state restore
%%EOF
