%!PS-Adobe-3.0 EPSF-3.0
%%Creator: cairo 1.10.2 (http://cairographics.org)
%%CreationDate: Thu Jul 31 07:30:11 2014
%%Pages: 1
%%BoundingBox: 0 -1 386 343
%%DocumentData: Clean7Bit
%%LanguageLevel: 2
%%EndComments
%%BeginProlog
/cairo_eps_state save def
/dict_count countdictstack def
/op_count count 1 sub def
userdict begin
/q { gsave } bind def
/Q { grestore } bind def
/cm { 6 array astore concat } bind def
/w { setlinewidth } bind def
/J { setlinecap } bind def
/j { setlinejoin } bind def
/M { setmiterlimit } bind def
/d { setdash } bind def
/m { moveto } bind def
/l { lineto } bind def
/c { curveto } bind def
/h { closepath } bind def
/re { exch dup neg 3 1 roll 5 3 roll moveto 0 rlineto
      0 exch rlineto 0 rlineto closepath } bind def
/S { stroke } bind def
/f { fill } bind def
/f* { eofill } bind def
/n { newpath } bind def
/W { clip } bind def
/W* { eoclip } bind def
/BT { } bind def
/ET { } bind def
/pdfmark where { pop globaldict /?pdfmark /exec load put }
    { globaldict begin /?pdfmark /pop load def /pdfmark
    /cleartomark load def end } ifelse
/BDC { mark 3 1 roll /BDC pdfmark } bind def
/EMC { mark /EMC pdfmark } bind def
/cairo_store_point { /cairo_point_y exch def /cairo_point_x exch def } def
/Tj { show currentpoint cairo_store_point } bind def
/TJ {
  {
    dup
    type /stringtype eq
    { show } { -0.001 mul 0 cairo_font_matrix dtransform rmoveto } ifelse
  } forall
  currentpoint cairo_store_point
} bind def
/cairo_selectfont { cairo_font_matrix aload pop pop pop 0 0 6 array astore
    cairo_font exch selectfont cairo_point_x cairo_point_y moveto } bind def
/Tf { pop /cairo_font exch def /cairo_font_matrix where
      { pop cairo_selectfont } if } bind def
/Td { matrix translate cairo_font_matrix matrix concatmatrix dup
      /cairo_font_matrix exch def dup 4 get exch 5 get cairo_store_point
      /cairo_font where { pop cairo_selectfont } if } bind def
/Tm { 2 copy 8 2 roll 6 array astore /cairo_font_matrix exch def
      cairo_store_point /cairo_font where { pop cairo_selectfont } if } bind def
/g { setgray } bind def
/rg { setrgbcolor } bind def
/d1 { setcachedevice } bind def
%%EndProlog
%%Page: 1 1
%%BeginPageSetup
%%PageBoundingBox: 0 -1 386 343
%%EndPageSetup
q 0 -1 386 344 rectclip q
0 342.867 386 -343 re W n
0 g
149.906 274.07 m 168.906 274.07 184.309 289.473 184.309 308.469 c 
184.309 327.465 168.906 342.867 149.906 342.867 c 130.91 342.867 
115.508 327.465 115.508 308.469 c 115.508 289.473 130.91 274.07 149.906 
274.07 c h
149.906 274.07 m f
161.141 229.121 m 172.824 209.059 183.914 188.645 194.566 168.008 c 
178.82 159.957 160.188 145.848 150.688 138.145 c 141.191 130.441 123.48 
91.066 114.371 72.238 c 104.59 52.023 136.066 37.355 145.812 57.488 c 
153.844 74.082 167.371 107.105 175.246 113.59 c 183.121 120.07 208.969 
138.363 228.691 145.234 c 229.66 145.574 230.543 145.977 231.383 
146.426 c 255.523 115.789 302.805 101.316 343.133 124.883 c 364.383 
137.301 345.16 167.922 323.848 155.465 c 294.309 138.191 263.566 
160.277 249.645 187.934 c 235.727 215.59 225.859 235.059 214.578 
254.645 c 236.613 261.672 256.762 255.254 272.609 233.062 c 285.496 
215.008 315.637 232.32 302.605 250.586 c 271.934 293.535 226.203 
304.195 180.418 277.016 c 178.516 275.887 169.922 271.148 167.984 270 c 
139.523 253.102 113.074 256.305 93.324 283.973 c 80.43 302.031 50.293 
284.715 63.336 266.453 c 88.535 231.152 123.914 217.715 161.141 229.121 
c h
161.141 229.121 m f
369.59 31.191 m 58.32 31.191 l 33.781 171.441 l 95.566 171.441 l 104.18 
171.441 111.16 178.426 111.16 187.035 c 111.16 195.648 104.18 202.633 
95.566 202.633 c 15.594 202.633 l 6.98 202.633 0 195.648 0 187.035 c 0 
184.91 l 0 184.012 0.078 183.109 0.234 182.223 c 29.855 12.906 l 31.16 
5.445 37.641 0 45.219 0 c 369.59 0 l 378.203 0 385.188 6.98 385.188 
15.594 c 385.188 24.207 378.203 31.191 369.59 31.191 c h
369.59 31.191 m f
Q Q
showpage
%%Trailer
count op_count sub {pop} repeat
countdictstack dict_count sub {end} repeat
cairo_eps_state restore
%%EOF
