%!PS-Adobe-3.0 EPSF-3.0
%%Creator: cairo 1.10.2 (http://cairographics.org)
%%CreationDate: Thu Jul 31 07:30:16 2014
%%Pages: 1
%%BoundingBox: 0 -1 386 266
%%DocumentData: Clean7Bit
%%LanguageLevel: 2
%%EndComments
%%BeginProlog
/cairo_eps_state save def
/dict_count countdictstack def
/op_count count 1 sub def
userdict begin
/q { gsave } bind def
/Q { grestore } bind def
/cm { 6 array astore concat } bind def
/w { setlinewidth } bind def
/J { setlinecap } bind def
/j { setlinejoin } bind def
/M { setmiterlimit } bind def
/d { setdash } bind def
/m { moveto } bind def
/l { lineto } bind def
/c { curveto } bind def
/h { closepath } bind def
/re { exch dup neg 3 1 roll 5 3 roll moveto 0 rlineto
      0 exch rlineto 0 rlineto closepath } bind def
/S { stroke } bind def
/f { fill } bind def
/f* { eofill } bind def
/n { newpath } bind def
/W { clip } bind def
/W* { eoclip } bind def
/BT { } bind def
/ET { } bind def
/pdfmark where { pop globaldict /?pdfmark /exec load put }
    { globaldict begin /?pdfmark /pop load def /pdfmark
    /cleartomark load def end } ifelse
/BDC { mark 3 1 roll /BDC pdfmark } bind def
/EMC { mark /EMC pdfmark } bind def
/cairo_store_point { /cairo_point_y exch def /cairo_point_x exch def } def
/Tj { show currentpoint cairo_store_point } bind def
/TJ {
  {
    dup
    type /stringtype eq
    { show } { -0.001 mul 0 cairo_font_matrix dtransform rmoveto } ifelse
  } forall
  currentpoint cairo_store_point
} bind def
/cairo_selectfont { cairo_font_matrix aload pop pop pop 0 0 6 array astore
    cairo_font exch selectfont cairo_point_x cairo_point_y moveto } bind def
/Tf { pop /cairo_font exch def /cairo_font_matrix where
      { pop cairo_selectfont } if } bind def
/Td { matrix translate cairo_font_matrix matrix concatmatrix dup
      /cairo_font_matrix exch def dup 4 get exch 5 get cairo_store_point
      /cairo_font where { pop cairo_selectfont } if } bind def
/Tm { 2 copy 8 2 roll 6 array astore /cairo_font_matrix exch def
      cairo_store_point /cairo_font where { pop cairo_selectfont } if } bind def
/g { setgray } bind def
/rg { setrgbcolor } bind def
/d1 { setcachedevice } bind def
%%EndProlog
%%Page: 1 1
%%BeginPageSetup
%%PageBoundingBox: 0 -1 386 266
%%EndPageSetup
q 0 -1 386 267 rectclip q
0 265.081 386 -266 re W n
0 g
81.641 159.358 m 88.531 152.483 99.609 152.382 106.488 159.272 c 
113.312 166.089 113.363 177.132 106.371 184.124 c 81.891 208.608 l 
74.98 215.495 63.91 215.604 57.039 208.714 c 50.215 201.874 50.164 
190.854 57.156 183.862 c h
81.641 159.358 m f
193.098 195.124 m 202.766 195.124 210.586 202.885 210.586 212.784 c 
210.586 247.421 l 210.586 257.175 202.836 265.081 193.098 265.081 c 
183.434 265.081 175.609 257.319 175.609 247.421 c 175.609 212.784 l 
175.609 203.03 183.371 195.124 193.098 195.124 c h
193.098 195.124 m f
304.559 159.358 m 329.047 183.862 l 335.945 190.768 336.031 201.815 
329.168 208.714 c 322.316 215.534 311.316 215.581 304.316 208.593 c 
279.824 184.108 l 272.922 177.218 272.824 166.124 279.703 159.257 c 
286.555 152.432 297.555 152.385 304.559 159.358 c h
304.559 159.358 m f
367.887 90.135 m 296.562 90.135 l 288.258 139.784 245.117 177.635 
193.098 177.635 c 141.094 177.635 97.945 139.784 89.633 90.135 c 17.68 
90.135 l 7.906 90.135 0 82.37 0 72.647 c 0 62.983 7.789 55.159 17.68 
55.159 c 367.887 55.159 l 377.621 55.159 385.527 62.917 385.527 72.647 
c 385.527 82.3 377.758 90.135 367.887 90.135 c h
367.887 90.135 m f
329.402 34.975 m 71.559 34.975 l 61.785 34.975 53.879 27.21 53.879 
17.487 c 53.879 7.823 61.664 -0.001 71.559 -0.001 c 329.402 -0.001 l 
339.133 -0.001 347.043 7.757 347.043 17.487 c 347.043 27.139 339.273 
34.975 329.402 34.975 c h
329.402 34.975 m f
Q Q
showpage
%%Trailer
count op_count sub {pop} repeat
countdictstack dict_count sub {end} repeat
cairo_eps_state restore
%%EOF
