%!PS-Adobe-3.0 EPSF-3.0
%%Creator: cairo 1.10.2 (http://cairographics.org)
%%CreationDate: Thu Jul 31 07:30:14 2014
%%Pages: 1
%%BoundingBox: 0 -1 352 373
%%DocumentData: Clean7Bit
%%LanguageLevel: 2
%%EndComments
%%BeginProlog
/cairo_eps_state save def
/dict_count countdictstack def
/op_count count 1 sub def
userdict begin
/q { gsave } bind def
/Q { grestore } bind def
/cm { 6 array astore concat } bind def
/w { setlinewidth } bind def
/J { setlinecap } bind def
/j { setlinejoin } bind def
/M { setmiterlimit } bind def
/d { setdash } bind def
/m { moveto } bind def
/l { lineto } bind def
/c { curveto } bind def
/h { closepath } bind def
/re { exch dup neg 3 1 roll 5 3 roll moveto 0 rlineto
      0 exch rlineto 0 rlineto closepath } bind def
/S { stroke } bind def
/f { fill } bind def
/f* { eofill } bind def
/n { newpath } bind def
/W { clip } bind def
/W* { eoclip } bind def
/BT { } bind def
/ET { } bind def
/pdfmark where { pop globaldict /?pdfmark /exec load put }
    { globaldict begin /?pdfmark /pop load def /pdfmark
    /cleartomark load def end } ifelse
/BDC { mark 3 1 roll /BDC pdfmark } bind def
/EMC { mark /EMC pdfmark } bind def
/cairo_store_point { /cairo_point_y exch def /cairo_point_x exch def } def
/Tj { show currentpoint cairo_store_point } bind def
/TJ {
  {
    dup
    type /stringtype eq
    { show } { -0.001 mul 0 cairo_font_matrix dtransform rmoveto } ifelse
  } forall
  currentpoint cairo_store_point
} bind def
/cairo_selectfont { cairo_font_matrix aload pop pop pop 0 0 6 array astore
    cairo_font exch selectfont cairo_point_x cairo_point_y moveto } bind def
/Tf { pop /cairo_font exch def /cairo_font_matrix where
      { pop cairo_selectfont } if } bind def
/Td { matrix translate cairo_font_matrix matrix concatmatrix dup
      /cairo_font_matrix exch def dup 4 get exch 5 get cairo_store_point
      /cairo_font where { pop cairo_selectfont } if } bind def
/Tm { 2 copy 8 2 roll 6 array astore /cairo_font_matrix exch def
      cairo_store_point /cairo_font where { pop cairo_selectfont } if } bind def
/g { setgray } bind def
/rg { setrgbcolor } bind def
/d1 { setcachedevice } bind def
%%EndProlog
%%Page: 1 1
%%BeginPageSetup
%%PageBoundingBox: 0 -1 352 373
%%EndPageSetup
q 0 -1 352 374 rectclip q
0 372.74 352 -373 re W n
0 g
59.801 237.017 m 43.273 234.564 36.898 231.017 23.77 216.959 c 9.059 
201.201 -0.406 176.045 0.012 152.088 c 0.012 125.338 8.723 101.478 
22.332 85.912 c 22.305 85.681 22.285 85.447 22.285 85.209 c 22.285 
38.513 l 22.285 35.217 24.961 32.541 28.258 32.541 c 85.539 32.541 l 
88.836 32.541 91.508 35.217 91.508 38.513 c 91.508 85.209 l 91.508 
85.822 91.418 86.408 91.246 86.963 c 105.512 105.81 113.84 132.502 
113.121 140.935 c 112.234 151.365 101.418 167.537 88.309 163.635 c 
77.602 160.443 71.215 145.556 64.551 146.345 c 58.91 147.013 60.984 
157.377 67.059 167.463 c 76.91 183.81 116.156 160.732 119.852 191.615 c 
123.551 222.498 97.152 242.56 59.801 237.017 c h
79.566 44.482 m 34.23 44.482 l 34.23 79.24 l 79.566 79.24 l h
79.566 44.482 m f
327.668 216.959 m 314.539 231.017 308.164 234.564 291.637 237.017 c 
254.285 242.56 227.887 222.498 231.582 191.615 c 235.277 160.728 
274.527 183.81 284.375 167.463 c 290.453 157.377 292.523 147.013 
286.883 146.345 c 280.223 145.56 273.836 160.443 263.129 163.635 c 
250.02 167.537 239.203 151.365 238.316 140.935 c 237.598 132.502 
245.926 105.81 260.191 86.967 c 260.02 86.408 259.93 85.822 259.93 
85.209 c 259.93 38.513 l 259.93 35.217 262.602 32.541 265.898 32.541 c 
323.18 32.541 l 326.477 32.541 329.152 35.217 329.152 38.513 c 329.152 
85.209 l 329.152 85.447 329.133 85.681 329.105 85.912 c 342.715 101.478 
351.426 125.334 351.426 152.088 c 351.84 176.045 342.379 201.201 
327.668 216.959 c h
317.207 44.482 m 271.871 44.482 l 271.871 79.24 l 317.207 79.24 l h
317.207 44.482 m f
215.82 199.142 m 215.805 199.24 215.801 199.338 215.773 199.435 c 
215.754 199.521 l 215.637 200.052 215.492 200.576 215.336 201.095 c 
182.492 324.92 l 192.785 327.763 200.367 337.205 200.367 348.388 c 
200.367 361.818 189.441 372.74 176.016 372.74 c 162.586 372.74 151.664 
361.818 151.664 348.388 c 151.664 337.17 159.293 327.705 169.637 
324.892 c 138.688 203.279 l 137.602 200.771 137.012 198.115 137.012 
195.365 c 137.012 195.095 137.031 194.83 137.043 194.56 c 137.012 
194.56 l 137.012 25.095 l 137.172 25.095 l 138.914 11.033 155.898 0.002 
176.609 0.002 c 197.316 0.002 214.301 11.033 216.047 25.095 c 216.203 
25.095 l 216.203 194.56 l 216.176 194.56 l 216.184 194.83 216.203 
195.095 216.203 195.365 c 216.203 196.646 216.066 197.908 215.82 
199.142 c h
150.027 215.732 m 172.055 302.287 l 172.055 222.658 l 163.625 221.986 
155.996 219.486 150.027 215.732 c h
203.273 215.677 m 197.016 219.638 188.914 222.217 179.973 222.74 c 
179.973 303.529 l h
159.582 348.388 m 159.582 357.451 166.953 364.822 176.016 364.822 c 
185.074 364.822 192.445 357.451 192.445 348.388 c 192.445 340.873 
187.363 334.533 180.461 332.584 c 179.934 334.572 l 179.656 336.49 
178.008 337.963 176.016 337.963 c 174.012 337.963 172.355 336.474 
172.09 334.541 c 171.59 332.58 l 164.676 334.517 159.582 340.861 
159.582 348.388 c h
159.582 348.388 m f
Q Q
showpage
%%Trailer
count op_count sub {pop} repeat
countdictstack dict_count sub {end} repeat
cairo_eps_state restore
%%EOF
