%!PS-Adobe-3.0 EPSF-3.0
%%Creator: cairo 1.10.2 (http://cairographics.org)
%%CreationDate: Wed Jul 30 08:47:41 2014
%%Pages: 1
%%BoundingBox: 0 -1 389 284
%%DocumentData: Clean7Bit
%%LanguageLevel: 2
%%EndComments
%%BeginProlog
/cairo_eps_state save def
/dict_count countdictstack def
/op_count count 1 sub def
userdict begin
/q { gsave } bind def
/Q { grestore } bind def
/cm { 6 array astore concat } bind def
/w { setlinewidth } bind def
/J { setlinecap } bind def
/j { setlinejoin } bind def
/M { setmiterlimit } bind def
/d { setdash } bind def
/m { moveto } bind def
/l { lineto } bind def
/c { curveto } bind def
/h { closepath } bind def
/re { exch dup neg 3 1 roll 5 3 roll moveto 0 rlineto
      0 exch rlineto 0 rlineto closepath } bind def
/S { stroke } bind def
/f { fill } bind def
/f* { eofill } bind def
/n { newpath } bind def
/W { clip } bind def
/W* { eoclip } bind def
/BT { } bind def
/ET { } bind def
/pdfmark where { pop globaldict /?pdfmark /exec load put }
    { globaldict begin /?pdfmark /pop load def /pdfmark
    /cleartomark load def end } ifelse
/BDC { mark 3 1 roll /BDC pdfmark } bind def
/EMC { mark /EMC pdfmark } bind def
/cairo_store_point { /cairo_point_y exch def /cairo_point_x exch def } def
/Tj { show currentpoint cairo_store_point } bind def
/TJ {
  {
    dup
    type /stringtype eq
    { show } { -0.001 mul 0 cairo_font_matrix dtransform rmoveto } ifelse
  } forall
  currentpoint cairo_store_point
} bind def
/cairo_selectfont { cairo_font_matrix aload pop pop pop 0 0 6 array astore
    cairo_font exch selectfont cairo_point_x cairo_point_y moveto } bind def
/Tf { pop /cairo_font exch def /cairo_font_matrix where
      { pop cairo_selectfont } if } bind def
/Td { matrix translate cairo_font_matrix matrix concatmatrix dup
      /cairo_font_matrix exch def dup 4 get exch 5 get cairo_store_point
      /cairo_font where { pop cairo_selectfont } if } bind def
/Tm { 2 copy 8 2 roll 6 array astore /cairo_font_matrix exch def
      cairo_store_point /cairo_font where { pop cairo_selectfont } if } bind def
/g { setgray } bind def
/rg { setrgbcolor } bind def
/d1 { setcachedevice } bind def
%%EndProlog
%%Page: 1 1
%%BeginPageSetup
%%PageBoundingBox: 0 -1 389 284
%%EndPageSetup
q 0 -1 389 285 rectclip q
0 283.982 389 -284 re W n
0 g
44.371 237.623 m 31.934 237.623 21.844 227.537 21.844 215.092 c 21.844 
169.756 l 9.324 166.678 0 155.463 0 141.994 c 0 128.521 9.32 117.307 
21.844 114.228 c 21.844 68.896 l 21.844 56.451 31.934 46.365 44.371 
46.365 c 56.809 46.365 66.898 56.451 66.898 68.896 c 66.898 215.092 l 
66.898 227.537 56.809 237.623 44.371 237.623 c h
44.371 237.623 m f
267.598 283.982 m 249.125 283.982 234.148 269.006 234.148 250.533 c 
234.148 175.443 l 159.742 175.443 l 154.277 175.572 l 154.277 250.533 l 
154.277 269.006 139.305 283.982 120.828 283.982 c 102.355 283.982 
87.379 269.006 87.379 250.533 c 87.379 33.447 l 87.379 14.975 102.355 
0.002 120.828 0.002 c 139.305 0.002 154.277 14.975 154.277 33.447 c 
154.277 108.373 l 154.277 108.373 157.879 108.541 159.742 108.541 c 
234.148 108.541 l 234.148 33.447 l 234.148 14.975 249.125 0.002 267.598 
0.002 c 286.074 0.002 301.047 14.975 301.047 33.447 c 301.047 250.533 l 
301.047 269.006 286.074 283.982 267.598 283.982 c h
267.598 283.982 m f
366.582 169.756 m 366.582 215.092 l 366.582 227.537 356.492 237.623 
344.055 237.623 c 331.617 237.623 321.527 227.537 321.527 215.092 c 
321.527 68.896 l 321.527 56.451 331.617 46.365 344.055 46.365 c 356.492 
46.365 366.582 56.451 366.582 68.896 c 366.582 114.228 l 379.105 
117.307 388.43 128.521 388.43 141.994 c 388.43 155.463 379.105 166.678 
366.582 169.756 c h
366.582 169.756 m f
Q Q
showpage
%%Trailer
count op_count sub {pop} repeat
countdictstack dict_count sub {end} repeat
cairo_eps_state restore
%%EOF
