%!PS-Adobe-3.0 EPSF-3.0
%%Creator: cairo 1.10.2 (http://cairographics.org)
%%CreationDate: Thu Jul 31 07:30:20 2014
%%Pages: 1
%%BoundingBox: 0 -1 389 323
%%DocumentData: Clean7Bit
%%LanguageLevel: 2
%%EndComments
%%BeginProlog
/cairo_eps_state save def
/dict_count countdictstack def
/op_count count 1 sub def
userdict begin
/q { gsave } bind def
/Q { grestore } bind def
/cm { 6 array astore concat } bind def
/w { setlinewidth } bind def
/J { setlinecap } bind def
/j { setlinejoin } bind def
/M { setmiterlimit } bind def
/d { setdash } bind def
/m { moveto } bind def
/l { lineto } bind def
/c { curveto } bind def
/h { closepath } bind def
/re { exch dup neg 3 1 roll 5 3 roll moveto 0 rlineto
      0 exch rlineto 0 rlineto closepath } bind def
/S { stroke } bind def
/f { fill } bind def
/f* { eofill } bind def
/n { newpath } bind def
/W { clip } bind def
/W* { eoclip } bind def
/BT { } bind def
/ET { } bind def
/pdfmark where { pop globaldict /?pdfmark /exec load put }
    { globaldict begin /?pdfmark /pop load def /pdfmark
    /cleartomark load def end } ifelse
/BDC { mark 3 1 roll /BDC pdfmark } bind def
/EMC { mark /EMC pdfmark } bind def
/cairo_store_point { /cairo_point_y exch def /cairo_point_x exch def } def
/Tj { show currentpoint cairo_store_point } bind def
/TJ {
  {
    dup
    type /stringtype eq
    { show } { -0.001 mul 0 cairo_font_matrix dtransform rmoveto } ifelse
  } forall
  currentpoint cairo_store_point
} bind def
/cairo_selectfont { cairo_font_matrix aload pop pop pop 0 0 6 array astore
    cairo_font exch selectfont cairo_point_x cairo_point_y moveto } bind def
/Tf { pop /cairo_font exch def /cairo_font_matrix where
      { pop cairo_selectfont } if } bind def
/Td { matrix translate cairo_font_matrix matrix concatmatrix dup
      /cairo_font_matrix exch def dup 4 get exch 5 get cairo_store_point
      /cairo_font where { pop cairo_selectfont } if } bind def
/Tm { 2 copy 8 2 roll 6 array astore /cairo_font_matrix exch def
      cairo_store_point /cairo_font where { pop cairo_selectfont } if } bind def
/g { setgray } bind def
/rg { setrgbcolor } bind def
/d1 { setcachedevice } bind def
%%EndProlog
%%Page: 1 1
%%BeginPageSetup
%%PageBoundingBox: 0 -1 389 323
%%EndPageSetup
q 0 -1 389 324 rectclip q
0 322.255 389 -323 re W n
0 g
388.199 230.673 m 388.199 256.392 371.004 280.021 339.781 297.205 c 
310.434 313.357 270.852 322.255 228.336 322.255 c 176.652 322.255 
144.629 308.466 126.871 296.9 c 103.949 281.97 90.262 261.091 90.262 
241.048 c 90.262 221.431 101.441 202.755 120.926 189.81 c 141.496 
176.146 170.871 168.919 205.875 168.919 c 264.406 168.919 300.195 
177.759 318.504 196.728 c 327.641 206.197 332.215 218.314 331.734 
231.759 c 331.156 247.982 316.527 260.025 288.258 267.564 c 268.445 
272.849 243.113 275.666 218.762 275.291 c 206.242 275.099 188.234 
273.931 173.559 269.447 c 150.75 262.482 144.562 250.193 144.52 241.115 
c 144.477 232.865 149.141 225.548 155.469 219.943 c 164.98 211.509 
181.18 207.287 204.984 207.033 c 220.805 206.865 234.359 208.548 234.93 
208.619 c 242.785 209.611 248.348 216.779 247.359 224.634 c 246.375 
232.49 239.199 238.06 231.352 237.076 c 231.215 237.06 217.742 235.4 
203.07 235.748 c 187.488 236.119 176.695 236.748 176.695 240.064 c 
176.695 243.384 187.457 245.99 199.449 247.38 c 214.27 249.099 234.023 
249.08 251.582 247.248 c 306.172 240.349 303.836 225.185 296.25 218.583 
c 287.145 210.658 266.715 197.599 205.875 197.599 c 148.805 197.599 
118.941 219.458 118.941 241.048 c 118.941 259.365 151.031 293.576 
228.336 293.576 c 306.805 293.576 359.52 261.052 359.52 230.673 c 
359.52 211.583 352.301 196.498 336.578 183.673 c 324.844 174.103 
307.848 152.513 224.785 152.513 c 219.203 152.548 l 218.633 152.548 
218.109 152.49 217.539 152.486 c 8.465 152.486 l 3.785 152.486 0 
148.701 0 144.029 c 0 8.462 l 0 3.787 3.785 0.001 8.465 0.001 c 69.93 
0.001 l 69.93 91.841 l 69.93 99.001 75.738 104.806 82.891 104.806 c 
90.055 104.806 95.863 99.001 95.863 91.841 c 95.863 0.001 l 128.27 
0.001 l 128.27 72.103 l 128.27 76.404 131.75 79.884 136.059 79.884 c 
140.344 79.884 143.836 76.408 143.836 72.103 c 143.836 0.001 l 170.375 
0.001 l 170.375 72.103 l 170.375 76.404 173.855 79.884 178.16 79.884 c 
182.449 79.884 185.941 76.408 185.941 72.103 c 185.941 0.001 l 212.602 
0.001 l 212.602 72.103 l 212.602 76.404 216.082 79.884 220.387 79.884 c 
224.676 79.884 228.164 76.408 228.164 72.103 c 228.164 0.001 l 231.066 
0.001 l 240.355 -0.014 249 0.669 257.352 1.638 c 257.352 91.841 l 
257.352 99.001 263.168 104.806 270.32 104.806 c 277.473 104.806 283.293 
99.001 283.293 91.841 c 283.293 6.345 l 293.207 8.869 302.285 12.06 
310.656 15.763 c 310.656 76.185 l 310.656 80.486 314.145 83.966 318.441 
83.966 c 322.738 83.966 326.223 80.486 326.223 76.185 c 326.223 23.634 
l 336.379 29.529 345.273 36.068 352.762 42.958 c 352.762 101.373 l 
352.762 105.673 356.25 109.154 360.547 109.154 c 364.844 109.154 
368.324 105.673 368.324 101.373 c 368.324 59.794 l 382 77.349 388.109 
94.33 388.109 103.658 c 388.109 125.439 388.199 229.626 388.199 230.673 
c h
388.199 230.673 m f
Q Q
showpage
%%Trailer
count op_count sub {pop} repeat
countdictstack dict_count sub {end} repeat
cairo_eps_state restore
%%EOF
