%!PS-Adobe-3.0 EPSF-3.0
%%Creator: cairo 1.10.2 (http://cairographics.org)
%%CreationDate: Thu Jul 31 07:30:21 2014
%%Pages: 1
%%BoundingBox: 0 -1 383 379
%%DocumentData: Clean7Bit
%%LanguageLevel: 2
%%EndComments
%%BeginProlog
/cairo_eps_state save def
/dict_count countdictstack def
/op_count count 1 sub def
userdict begin
/q { gsave } bind def
/Q { grestore } bind def
/cm { 6 array astore concat } bind def
/w { setlinewidth } bind def
/J { setlinecap } bind def
/j { setlinejoin } bind def
/M { setmiterlimit } bind def
/d { setdash } bind def
/m { moveto } bind def
/l { lineto } bind def
/c { curveto } bind def
/h { closepath } bind def
/re { exch dup neg 3 1 roll 5 3 roll moveto 0 rlineto
      0 exch rlineto 0 rlineto closepath } bind def
/S { stroke } bind def
/f { fill } bind def
/f* { eofill } bind def
/n { newpath } bind def
/W { clip } bind def
/W* { eoclip } bind def
/BT { } bind def
/ET { } bind def
/pdfmark where { pop globaldict /?pdfmark /exec load put }
    { globaldict begin /?pdfmark /pop load def /pdfmark
    /cleartomark load def end } ifelse
/BDC { mark 3 1 roll /BDC pdfmark } bind def
/EMC { mark /EMC pdfmark } bind def
/cairo_store_point { /cairo_point_y exch def /cairo_point_x exch def } def
/Tj { show currentpoint cairo_store_point } bind def
/TJ {
  {
    dup
    type /stringtype eq
    { show } { -0.001 mul 0 cairo_font_matrix dtransform rmoveto } ifelse
  } forall
  currentpoint cairo_store_point
} bind def
/cairo_selectfont { cairo_font_matrix aload pop pop pop 0 0 6 array astore
    cairo_font exch selectfont cairo_point_x cairo_point_y moveto } bind def
/Tf { pop /cairo_font exch def /cairo_font_matrix where
      { pop cairo_selectfont } if } bind def
/Td { matrix translate cairo_font_matrix matrix concatmatrix dup
      /cairo_font_matrix exch def dup 4 get exch 5 get cairo_store_point
      /cairo_font where { pop cairo_selectfont } if } bind def
/Tm { 2 copy 8 2 roll 6 array astore /cairo_font_matrix exch def
      cairo_store_point /cairo_font where { pop cairo_selectfont } if } bind def
/g { setgray } bind def
/rg { setrgbcolor } bind def
/d1 { setcachedevice } bind def
%%EndProlog
%%Page: 1 1
%%BeginPageSetup
%%PageBoundingBox: 0 -1 383 379
%%EndPageSetup
q 0 -1 383 380 rectclip q
0 378.566 383 -379 re W n
0 g
359.57 122.363 m 346.742 122.363 336.34 111.965 336.34 99.132 c 336.34 
97.66 336.484 96.218 336.746 94.816 c 326.75 94.105 313.863 97.144 
308.152 100.394 c 295.723 107.465 290.84 124.754 286.531 140.004 c 
285.883 142.289 l 283.262 151.504 280.516 160.949 277.859 170.086 c 
274.91 180.222 271.859 190.707 268.98 200.886 c 265.633 212.73 263.785 
225.379 262 237.613 c 260.695 246.531 259.348 255.754 257.422 264.746 c 
256.023 271.281 254.121 277.84 251.746 284.343 c 250.434 294.238 
247.945 304 243.496 313.605 c 235.043 331.843 220 349.742 198.781 
366.793 c 178.703 382.929 145.098 381.015 121.82 369.863 c 105.527 
363.308 92.707 347.297 84.402 335.679 c 84.16 335.343 83.914 335.023 
83.672 334.703 c 27.484 334.703 l 12.305 334.703 0 322.398 0 307.218 c 
0 68.117 l 0 52.937 12.305 40.632 27.484 40.632 c 161.625 40.632 l 
176.805 40.632 189.109 52.937 189.109 68.117 c 189.109 307.222 l 
189.109 322.402 176.805 334.703 161.625 334.703 c 105.383 334.703 l 
111.07 341.984 118 349.687 125.07 353.699 c 126.078 354.273 127.125 
354.82 128.199 355.347 c 128.34 355.398 128.484 355.453 128.625 355.504 
c 140.727 359.922 157.965 362.554 169.207 358.472 c 191.426 350.414 
211.156 324.601 218.605 313.875 c 225.977 303.269 231.945 291.961 
236.281 280.48 c 237.531 269.781 237.312 258.609 236.844 246.781 c 
236.02 225.863 229.953 205.726 223.531 184.41 c 216.688 161.691 209.609 
138.199 209.371 113.507 c 209.164 91.824 208.672 41.05 231.793 19.98 c 
238.742 13.648 247.102 10.457 256.703 10.457 c 257.559 10.457 258.43 
10.488 259.305 10.539 c 263.453 4.195 270.613 -0 278.758 -0 c 291.586 
-0 301.988 10.402 301.988 23.23 c 301.988 36.058 291.586 46.461 278.758 
46.461 c 266.98 46.461 257.258 37.695 255.738 26.336 c 250.555 26.543 
246.184 28.308 242.469 31.695 c 224.59 47.988 225.047 95.476 225.219 
113.355 c 225.434 135.793 231.879 157.187 238.703 179.84 c 242.461 
192.304 246.289 205.019 249.004 218.011 c 250.246 210.851 251.73 203.66 
253.734 196.574 c 256.625 186.34 259.684 175.824 262.641 165.66 c 
265.293 156.547 268.031 147.125 270.641 137.953 c 271.277 135.695 l 
276.16 118.414 282.238 96.906 300.312 86.621 c 309.516 81.386 330.691 
76.324 345.984 80.297 c 349.805 77.539 354.496 75.906 359.57 75.906 c 
372.398 75.906 382.797 86.308 382.797 99.136 c 382.797 111.965 372.398 
122.363 359.57 122.363 c h
96.008 64.418 m 73.613 64.418 55.395 82.629 55.395 105.023 c 55.395 
127.418 73.613 145.636 96.008 145.636 c 118.402 145.636 136.625 127.418 
136.625 105.023 c 136.625 82.629 118.402 64.418 96.008 64.418 c h
159.453 302.476 m 161.262 302.476 162.727 301.011 162.727 299.207 c 
162.727 174.511 l 162.727 172.703 161.262 171.238 159.453 171.238 c 
29.629 171.238 l 27.824 171.238 26.355 172.703 26.355 174.511 c 26.355 
299.207 l 26.355 301.011 27.824 302.476 29.629 302.476 c h
159.453 302.476 m f
96.008 138.808 m 77.391 138.808 62.227 123.656 62.227 105.023 c 62.227 
86.402 77.387 71.254 96.008 71.254 c 114.629 71.254 129.793 86.402 
129.793 105.023 c 129.793 123.656 114.629 138.808 96.008 138.808 c h
111.43 103.711 m 91.363 89.132 l 90.844 88.832 90.199 88.832 89.68 
89.132 c 89.16 89.433 88.836 89.988 88.836 90.59 c 88.836 119.75 l 
88.836 120.351 89.156 120.906 89.68 121.207 c 89.938 121.355 90.23 
121.433 90.52 121.433 c 90.812 121.433 91.102 121.355 91.363 121.207 c 
111.43 106.625 l 111.949 106.324 112.27 105.769 112.27 105.168 c 112.27 
104.566 111.949 104.011 111.43 103.711 c h
111.43 103.711 m f
Q Q
showpage
%%Trailer
count op_count sub {pop} repeat
countdictstack dict_count sub {end} repeat
cairo_eps_state restore
%%EOF
