%!PS-Adobe-3.0 EPSF-3.0
%%Creator: cairo 1.10.2 (http://cairographics.org)
%%CreationDate: Thu Jul 31 07:30:19 2014
%%Pages: 1
%%BoundingBox: 0 -1 366 366
%%DocumentData: Clean7Bit
%%LanguageLevel: 2
%%EndComments
%%BeginProlog
/cairo_eps_state save def
/dict_count countdictstack def
/op_count count 1 sub def
userdict begin
/q { gsave } bind def
/Q { grestore } bind def
/cm { 6 array astore concat } bind def
/w { setlinewidth } bind def
/J { setlinecap } bind def
/j { setlinejoin } bind def
/M { setmiterlimit } bind def
/d { setdash } bind def
/m { moveto } bind def
/l { lineto } bind def
/c { curveto } bind def
/h { closepath } bind def
/re { exch dup neg 3 1 roll 5 3 roll moveto 0 rlineto
      0 exch rlineto 0 rlineto closepath } bind def
/S { stroke } bind def
/f { fill } bind def
/f* { eofill } bind def
/n { newpath } bind def
/W { clip } bind def
/W* { eoclip } bind def
/BT { } bind def
/ET { } bind def
/pdfmark where { pop globaldict /?pdfmark /exec load put }
    { globaldict begin /?pdfmark /pop load def /pdfmark
    /cleartomark load def end } ifelse
/BDC { mark 3 1 roll /BDC pdfmark } bind def
/EMC { mark /EMC pdfmark } bind def
/cairo_store_point { /cairo_point_y exch def /cairo_point_x exch def } def
/Tj { show currentpoint cairo_store_point } bind def
/TJ {
  {
    dup
    type /stringtype eq
    { show } { -0.001 mul 0 cairo_font_matrix dtransform rmoveto } ifelse
  } forall
  currentpoint cairo_store_point
} bind def
/cairo_selectfont { cairo_font_matrix aload pop pop pop 0 0 6 array astore
    cairo_font exch selectfont cairo_point_x cairo_point_y moveto } bind def
/Tf { pop /cairo_font exch def /cairo_font_matrix where
      { pop cairo_selectfont } if } bind def
/Td { matrix translate cairo_font_matrix matrix concatmatrix dup
      /cairo_font_matrix exch def dup 4 get exch 5 get cairo_store_point
      /cairo_font where { pop cairo_selectfont } if } bind def
/Tm { 2 copy 8 2 roll 6 array astore /cairo_font_matrix exch def
      cairo_store_point /cairo_font where { pop cairo_selectfont } if } bind def
/g { setgray } bind def
/rg { setrgbcolor } bind def
/d1 { setcachedevice } bind def
%%EndProlog
%%Page: 1 1
%%BeginPageSetup
%%PageBoundingBox: 0 -1 366 366
%%EndPageSetup
q 0 -1 366 367 rectclip q
0 365.438 366 -366 re W n
0.0588235 0.0627451 0.0666667 rg
217.738 244.965 m 219.391 243.313 221.316 242.008 223.52 241.051 c 
225.723 240.094 228.098 239.617 230.652 239.617 c 236.734 239.617 l 
239.227 239.617 241.594 240.094 243.824 241.051 c 246.055 242.008 248 
243.313 249.648 244.965 c 251.301 246.617 252.605 248.543 253.562 
250.746 c 254.52 252.949 255 255.328 255 257.875 c 255 282.227 l 255 
284.715 254.52 287.078 253.562 289.313 c 252.605 291.543 251.301 
293.488 249.648 295.137 c 248 296.789 246.055 298.094 243.824 299.051 c 
241.594 300.008 239.227 300.484 236.734 300.484 c 230.652 300.484 l 
228.098 300.484 225.723 300.008 223.52 299.051 c 221.316 298.094 
219.391 296.789 217.738 295.137 c 216.086 293.488 214.781 291.543 
213.824 289.313 c 212.867 287.078 212.391 284.715 212.391 282.227 c 
212.391 257.875 l 212.391 255.324 212.867 252.949 213.824 250.746 c 
214.781 248.543 216.086 246.617 217.738 244.965 c h
224.562 282.223 m 224.562 283.906 225.156 285.34 226.348 286.527 c 
227.531 287.715 228.969 288.313 230.652 288.313 c 236.734 288.313 l 
238.418 288.313 239.852 287.715 241.043 286.527 c 242.23 285.34 242.824 
283.906 242.824 282.223 c 242.824 257.875 l 242.824 256.195 242.23 
254.758 241.043 253.57 c 239.855 252.383 238.418 251.789 236.734 
251.789 c 230.652 251.789 l 228.969 251.789 227.535 252.383 226.348 
253.57 c 225.156 254.758 224.562 256.195 224.562 257.875 c h
224.562 282.223 m f
341.398 365.438 m 24.043 365.438 l 10.766 365.438 0 354.672 0 341.395 c 
0 24.039 l 0 10.762 10.766 0 24.043 0 c 341.398 0 l 354.676 0 365.438 
10.762 365.438 24.039 c 365.438 341.395 l 365.438 354.672 354.676 
365.438 341.398 365.438 c h
88.957 290.328 m 88.957 303.609 99.719 314.371 113 314.371 c 247.633 
314.371 l 260.91 314.371 271.676 303.609 271.676 290.328 c 271.676 
249.774 l 271.676 236.496 260.91 225.731 247.633 225.731 c 113 225.731 
l 99.719 225.731 88.957 236.496 88.957 249.774 c h
72.129 176.106 m 290.91 176.106 l 293.898 176.106 296.32 173.688 296.32 
170.695 c 296.32 167.711 293.898 165.285 290.91 165.285 c 72.129 
165.285 l 69.141 165.285 66.719 167.707 66.719 170.695 c 66.719 173.688 
69.137 176.106 72.129 176.106 c h
73.328 126.82 m 292.113 126.82 l 295.098 126.82 297.523 124.399 297.523 
121.41 c 297.523 118.422 295.102 116 292.113 116 c 73.328 116 l 70.34 
116 67.918 118.422 67.918 121.41 c 67.918 124.399 70.34 126.82 73.328 
126.82 c h
293.312 66.715 m 74.531 66.715 l 71.543 66.715 69.121 69.137 69.121 
72.125 c 69.121 75.113 71.543 77.535 74.531 77.535 c 293.312 77.535 l 
296.301 77.535 298.723 75.113 298.723 72.125 c 298.723 69.137 296.301 
66.715 293.312 66.715 c h
293.312 66.715 m f
Q Q
showpage
%%Trailer
count op_count sub {pop} repeat
countdictstack dict_count sub {end} repeat
cairo_eps_state restore
%%EOF
