%!PS-Adobe-3.0 EPSF-3.0
%%Creator: cairo 1.10.2 (http://cairographics.org)
%%CreationDate: Fri Aug  1 07:20:09 2014
%%Pages: 1
%%BoundingBox: 0 -1 389 274
%%DocumentData: Clean7Bit
%%LanguageLevel: 2
%%EndComments
%%BeginProlog
/cairo_eps_state save def
/dict_count countdictstack def
/op_count count 1 sub def
userdict begin
/q { gsave } bind def
/Q { grestore } bind def
/cm { 6 array astore concat } bind def
/w { setlinewidth } bind def
/J { setlinecap } bind def
/j { setlinejoin } bind def
/M { setmiterlimit } bind def
/d { setdash } bind def
/m { moveto } bind def
/l { lineto } bind def
/c { curveto } bind def
/h { closepath } bind def
/re { exch dup neg 3 1 roll 5 3 roll moveto 0 rlineto
      0 exch rlineto 0 rlineto closepath } bind def
/S { stroke } bind def
/f { fill } bind def
/f* { eofill } bind def
/n { newpath } bind def
/W { clip } bind def
/W* { eoclip } bind def
/BT { } bind def
/ET { } bind def
/pdfmark where { pop globaldict /?pdfmark /exec load put }
    { globaldict begin /?pdfmark /pop load def /pdfmark
    /cleartomark load def end } ifelse
/BDC { mark 3 1 roll /BDC pdfmark } bind def
/EMC { mark /EMC pdfmark } bind def
/cairo_store_point { /cairo_point_y exch def /cairo_point_x exch def } def
/Tj { show currentpoint cairo_store_point } bind def
/TJ {
  {
    dup
    type /stringtype eq
    { show } { -0.001 mul 0 cairo_font_matrix dtransform rmoveto } ifelse
  } forall
  currentpoint cairo_store_point
} bind def
/cairo_selectfont { cairo_font_matrix aload pop pop pop 0 0 6 array astore
    cairo_font exch selectfont cairo_point_x cairo_point_y moveto } bind def
/Tf { pop /cairo_font exch def /cairo_font_matrix where
      { pop cairo_selectfont } if } bind def
/Td { matrix translate cairo_font_matrix matrix concatmatrix dup
      /cairo_font_matrix exch def dup 4 get exch 5 get cairo_store_point
      /cairo_font where { pop cairo_selectfont } if } bind def
/Tm { 2 copy 8 2 roll 6 array astore /cairo_font_matrix exch def
      cairo_store_point /cairo_font where { pop cairo_selectfont } if } bind def
/g { setgray } bind def
/rg { setrgbcolor } bind def
/d1 { setcachedevice } bind def
%%EndProlog
%%Page: 1 1
%%BeginPageSetup
%%PageBoundingBox: 0 -1 389 274
%%EndPageSetup
q 0 -1 389 275 rectclip q
0 273.331 389 -274 re W n
0 g
112.668 69.062 m 93.598 69.062 78.137 53.601 78.137 34.53 c 78.137 
15.46 93.598 -0.001 112.668 -0.001 c 131.738 -0.001 147.195 15.46 
147.195 34.53 c 147.195 53.601 131.738 69.062 112.668 69.062 c h
112.668 17.265 m 103.129 17.265 95.402 24.995 95.402 34.53 c 95.402 
44.066 103.133 51.796 112.668 51.796 c 122.203 51.796 129.93 44.066 
129.93 34.53 c 129.93 24.995 122.203 17.265 112.668 17.265 c h
112.668 17.265 m f
82.926 69.062 m 5.551 69.062 l 2.484 69.062 0 66.573 0 63.511 c 0 
46.675 l 0 43.609 2.484 41.124 5.551 41.124 c 67.57 41.124 l 69.191 
52.234 74.797 62.05 82.926 69.062 c h
82.926 69.062 m f
293.336 69.062 m 274.266 69.062 258.805 53.601 258.805 34.53 c 258.805 
15.46 274.266 -0.001 293.336 -0.001 c 312.406 -0.001 327.863 15.46 
327.863 34.53 c 327.863 53.601 312.406 69.062 293.336 69.062 c h
293.336 17.265 m 283.801 17.265 276.07 24.995 276.07 34.53 c 276.07 
44.066 283.797 51.796 293.336 51.796 c 302.871 51.796 310.602 44.066 
310.602 34.53 c 310.602 24.995 302.867 17.265 293.336 17.265 c h
293.336 17.265 m f
19.195 85.663 m 206.773 85.663 l 209.84 85.663 212.324 88.152 212.324 
91.214 c 212.324 256.683 l 212.324 265.874 204.871 273.331 195.676 
273.331 c 30.297 273.331 l 21.098 273.331 13.645 265.878 13.645 256.683 
c 13.645 91.214 l 13.645 88.152 16.133 85.667 19.195 85.663 c h
60.844 191.874 m 68.609 214.523 l 69.039 215.777 69.953 216.816 71.148 
217.398 c 72.344 217.984 73.719 218.069 74.977 217.636 c 95.293 210.644 
l 95.293 232.089 l 95.293 234.855 97.539 237.101 100.305 237.101 c 
124.027 237.101 l 126.793 237.101 129.035 234.855 129.035 232.089 c 
129.035 210.722 l 148.441 217.62 l 151.039 218.542 153.895 217.194 
154.832 214.601 c 163.027 191.956 l 163.488 190.675 163.41 189.265 
162.809 188.042 c 162.207 186.819 161.137 185.894 159.844 185.484 c 
138.996 178.804 l 151.949 161.804 l 153.605 159.628 153.211 156.527 
151.066 154.831 c 131.656 139.523 l 130.766 138.819 129.672 138.444 
128.551 138.444 c 128.305 138.444 128.059 138.464 127.812 138.499 c 
126.445 138.702 125.223 139.464 124.434 140.601 c 111.492 159.28 l 
98.367 140.577 l 97.574 139.448 96.355 138.694 94.992 138.499 c 93.625 
138.296 92.242 138.667 91.16 139.523 c 71.754 154.831 l 70.699 155.663 
70.023 156.878 69.875 158.21 c 69.727 159.542 70.117 160.878 70.961 
161.917 c 84.684 178.87 l 64.055 185.48 l 62.77 185.894 61.707 186.8 
61.105 188.003 c 60.504 189.206 60.41 190.601 60.844 191.874 c h
48.141 120.054 m 179.223 120.054 l 179.223 114.714 l 48.141 114.714 l h
48.141 120.054 m f
383.359 69.062 m 369.855 69.062 l 369.855 144.472 l 369.855 153.327 
367.207 161.98 362.254 169.316 c 328.477 219.343 l 322.316 228.468 
313.066 234.862 302.641 237.519 c 302.641 254.573 l 302.641 264.402 
293.633 272.37 282.523 272.37 c 248.324 272.37 l 237.211 272.37 228.203 
264.402 228.203 254.573 c 228.203 229.073 l 228.203 228.847 228.215 
228.624 228.223 228.402 c 228.211 228.198 228.195 227.999 228.195 
227.796 c 228.195 69.062 l 142.406 69.062 l 150.535 62.05 156.145 
52.234 157.762 41.124 c 248.238 41.124 l 251.449 63.163 270.422 80.159 
293.336 80.159 c 316.246 80.159 335.215 63.163 338.43 41.124 c 383.359 
41.124 l 386.426 41.124 388.91 43.609 388.91 46.675 c 388.91 63.511 l 
388.91 66.573 386.426 69.062 383.359 69.062 c h
333.434 114.714 m 252.77 114.714 l 252.77 120.054 l 333.434 120.054 l h
328.074 159.292 m 258.934 159.292 l 255.871 159.292 253.387 161.777 
253.387 164.843 c 253.387 203.218 l 253.387 206.284 255.871 208.769 
258.934 208.769 c 301.066 208.769 l 302.871 208.769 304.566 207.89 
305.605 206.413 c 332.613 168.034 l 335.199 164.359 332.57 159.292 
328.074 159.292 c h
328.074 159.292 m f
Q Q
showpage
%%Trailer
count op_count sub {pop} repeat
countdictstack dict_count sub {end} repeat
cairo_eps_state restore
%%EOF
