<?xml version="1.0" encoding="iso-8859-1"?>
<!-- Generator: Adobe Illustrator 16.0.0, SVG Export Plug-In . SVG Version: 6.00 Build 0)  -->
<!DOCTYPE svg PUBLIC "-//W3C//DTD SVG 1.1//EN" "http://www.w3.org/Graphics/SVG/1.1/DTD/svg11.dtd">
<svg version="1.1" xmlns="http://www.w3.org/2000/svg" xmlns:xlink="http://www.w3.org/1999/xlink" x="0px" y="0px" width="512px"
	 height="512px" viewBox="0 0 512 512" style="enable-background:new 0 0 512 512;" xml:space="preserve">
<g id="Guides_For_Artboard">
</g>
<g id="_x30_">
</g>
<g id="_x31_">
</g>
<g id="_x32_">
</g>
<g id="_x33_">
</g>
<g id="_x34_">
</g>
<g id="_x35_">
</g>
<g id="_x36_">
</g>
<g id="_x37_">
</g>
<g id="_x38_">
</g>
<g id="_x39_">
	<g>
		<path d="M397.071,361.558c0-7.792-5.267-14.295-12.399-16.329c0-5.22,0-10.439,0-15.598c7.665-1.67,13.406-8.476,13.406-16.638
			s-5.741-14.968-13.406-16.639c0-27.324,0-2.975,0-31.668c0-46.501-70.793-36.424-70.793-146.197
			c0-7.581-2.059-11.813-10.063-11.813c-3.523,0-21.409,0.031-39.271,0.067c-17.861-0.036-35.748-0.067-39.271-0.067
			c-8.005,0-10.063,3.845-10.063,11.813c0,112.873-70.794,99.696-70.794,146.197c0,28.693,0,4.344,0,31.668
			c-7.665,1.671-13.405,8.477-13.405,16.639s5.74,14.968,13.405,16.638c0,5.159,0,10.378,0,15.598
			c-7.132,2.034-12.399,8.537-12.399,16.329c0,7.793,5.268,14.295,12.399,16.33c0,5.535,0,10.948,0,16.222
			c-6.623,2.342-11.395,8.591-11.395,16.015s4.771,13.672,11.395,16.016c0,20.343,0,33.913,0,33.913
			c0,20.646,16.748,37.393,37.395,37.393h82.733h82.732c20.646,0,37.395-16.747,37.395-37.393c0,0,0-13.57,0-33.913
			c6.624-2.344,11.395-8.592,11.395-16.016s-4.771-13.672-11.395-16.015c0-5.273,0-10.687,0-16.222
			C391.805,375.854,397.071,369.351,397.071,361.558z"/>
		<path d="M214.544,88.36c2.664,0,97.337,0,100.001,0c7.423,0,9.93-4.245,9.93-11.243c0-8.09,0-7.448,0-20.526
			c0-24.396-19.774-44.176-44.163-44.176h-9.337h-12.859h-9.338c-24.388,0-44.163,19.78-44.163,44.176c0,13.078,0,12.436,0,20.526
			C204.614,84.115,207.109,88.36,214.544,88.36z"/>
	</g>
</g>
<g id="_x31_0">
</g>
<g id="_x31_1">
</g>
<g id="_x31_2">
</g>
<g id="_x31_3">
</g>
<g id="_x31_4">
</g>
<g id="_x31_5">
</g>
<g id="_x31_6">
</g>
<g id="_x31_7">
</g>
<g id="_x31_8">
</g>
<g id="_x31_9">
</g>
<g id="_x32_0">
</g>
<g id="_x32_1">
</g>
<g id="_x32_2">
</g>
<g id="_x32_3">
</g>
<g id="_x32_4">
</g>
<g id="_x32_5">
</g>
<g id="_x32_6">
</g>
<g id="_x32_7">
</g>
<g id="_x32_8">
</g>
<g id="_x32_9">
</g>
<g id="_x33_0">
</g>
<g id="_x33_1">
</g>
<g id="_x33_2">
</g>
<g id="_x33_3">
</g>
<g id="_x33_4">
</g>
<g id="_x33_5">
</g>
<g id="_x33_6">
</g>
<g id="_x33_7">
</g>
<g id="_x33_8">
</g>
<g id="_x33_9">
</g>
<g id="_x34_0">
</g>
<g id="_x34_1">
</g>
<g id="_x34_2">
</g>
<g id="_x34_3">
</g>
<g id="_x34_4">
</g>
<g id="_x34_5">
</g>
<g id="_x34_6">
</g>
<g id="_x34_7">
</g>
<g id="_x34_8">
</g>
<g id="_x34_9">
</g>
<g id="_x35_0">
</g>
<g id="_x35_1">
</g>
<g id="_x35_2">
</g>
<g id="_x35_3">
</g>
<g id="_x35_4">
</g>
<g id="_x35_5">
</g>
<g id="_x35_6">
</g>
<g id="_x35_7">
</g>
<g id="_x35_8">
</g>
<g id="_x35_9">
</g>
<g id="_x36_0">
</g>
<g id="_x36_1">
</g>
<g id="_x36_2">
</g>
<g id="_x36_3">
</g>
<g id="_x36_4">
</g>
<g id="_x36_5">
</g>
<g id="_x36_6">
</g>
<g id="_x36_7">
</g>
<g id="_x36_8">
</g>
<g id="_x36_9">
</g>
<g id="_x37_0">
</g>
</svg>
