%!PS-Adobe-3.0 EPSF-3.0
%%Creator: cairo 1.10.2 (http://cairographics.org)
%%CreationDate: Thu Jul 31 07:30:18 2014
%%Pages: 1
%%BoundingBox: 0 -1 343 387
%%DocumentData: Clean7Bit
%%LanguageLevel: 2
%%EndComments
%%BeginProlog
/cairo_eps_state save def
/dict_count countdictstack def
/op_count count 1 sub def
userdict begin
/q { gsave } bind def
/Q { grestore } bind def
/cm { 6 array astore concat } bind def
/w { setlinewidth } bind def
/J { setlinecap } bind def
/j { setlinejoin } bind def
/M { setmiterlimit } bind def
/d { setdash } bind def
/m { moveto } bind def
/l { lineto } bind def
/c { curveto } bind def
/h { closepath } bind def
/re { exch dup neg 3 1 roll 5 3 roll moveto 0 rlineto
      0 exch rlineto 0 rlineto closepath } bind def
/S { stroke } bind def
/f { fill } bind def
/f* { eofill } bind def
/n { newpath } bind def
/W { clip } bind def
/W* { eoclip } bind def
/BT { } bind def
/ET { } bind def
/pdfmark where { pop globaldict /?pdfmark /exec load put }
    { globaldict begin /?pdfmark /pop load def /pdfmark
    /cleartomark load def end } ifelse
/BDC { mark 3 1 roll /BDC pdfmark } bind def
/EMC { mark /EMC pdfmark } bind def
/cairo_store_point { /cairo_point_y exch def /cairo_point_x exch def } def
/Tj { show currentpoint cairo_store_point } bind def
/TJ {
  {
    dup
    type /stringtype eq
    { show } { -0.001 mul 0 cairo_font_matrix dtransform rmoveto } ifelse
  } forall
  currentpoint cairo_store_point
} bind def
/cairo_selectfont { cairo_font_matrix aload pop pop pop 0 0 6 array astore
    cairo_font exch selectfont cairo_point_x cairo_point_y moveto } bind def
/Tf { pop /cairo_font exch def /cairo_font_matrix where
      { pop cairo_selectfont } if } bind def
/Td { matrix translate cairo_font_matrix matrix concatmatrix dup
      /cairo_font_matrix exch def dup 4 get exch 5 get cairo_store_point
      /cairo_font where { pop cairo_selectfont } if } bind def
/Tm { 2 copy 8 2 roll 6 array astore /cairo_font_matrix exch def
      cairo_store_point /cairo_font where { pop cairo_selectfont } if } bind def
/g { setgray } bind def
/rg { setrgbcolor } bind def
/d1 { setcachedevice } bind def
%%EndProlog
%%Page: 1 1
%%BeginPageSetup
%%PageBoundingBox: 0 -1 343 387
%%EndPageSetup
q 0 -1 343 388 rectclip q
0 386.646 343 -387 re W n
0 g
342.633 152.626 m 343.348 165.357 337.98 178.185 328.98 185.29 c 317.09 
194.275 302.012 195.072 288.691 195.736 c 286.594 195.853 284.527 
195.962 282.492 196.095 c 280.977 196.322 279.043 196.529 277.086 
196.767 c 259.203 198.822 244.188 200.333 242.52 214.595 c 241.719 
221.337 242.203 229.22 243.574 235.947 c 243.57 235.95 243.562 235.95 
243.559 235.95 c 246.875 250.681 253.355 265.7 265.566 286.06 c 283.328 
315.661 286.852 341.173 262.746 371.2 c 238.645 401.224 200.441 380.642 
196.215 366.689 c 191.988 352.732 209.746 337.65 199.598 310.587 c 
193.855 295.267 158.207 270.908 128.836 245.462 c 108.445 227.798 
91.449 205.142 88.059 203.177 c 79.781 198.388 15.309 203.177 15.309 
203.177 c 6.855 203.177 0 195.603 0 186.263 c 0 38.536 l 0 29.193 8.062 
21.056 15.309 21.622 c 58.258 21.622 80.492 19.575 94.68 16.806 c 
109.332 13.947 115.402 10.322 126.863 7.384 c 126.863 7.384 155.723 
1.263 189.449 0.197 c 222.527 -0.85 260.164 2.29 277.816 9.212 c 
278.613 9.431 279.41 9.654 280.176 9.896 c 294.777 15.904 302.977 
29.224 301.387 43.267 c 308.695 47.193 314.82 54.376 318.223 63.068 c 
321.254 70.837 321.656 78.825 319.465 85.615 c 332.934 96.79 338.414 
115.509 332.617 130.368 c 338.539 135.525 342.129 143.439 342.633 
152.626 c h
342.633 152.626 m f
Q Q
showpage
%%Trailer
count op_count sub {pop} repeat
countdictstack dict_count sub {end} repeat
cairo_eps_state restore
%%EOF
