%!PS-Adobe-3.0 EPSF-3.0
%%Creator: cairo 1.10.2 (http://cairographics.org)
%%CreationDate: Wed Jul 30 08:47:44 2014
%%Pages: 1
%%BoundingBox: 0 -1 389 296
%%DocumentData: Clean7Bit
%%LanguageLevel: 2
%%EndComments
%%BeginProlog
/cairo_eps_state save def
/dict_count countdictstack def
/op_count count 1 sub def
userdict begin
/q { gsave } bind def
/Q { grestore } bind def
/cm { 6 array astore concat } bind def
/w { setlinewidth } bind def
/J { setlinecap } bind def
/j { setlinejoin } bind def
/M { setmiterlimit } bind def
/d { setdash } bind def
/m { moveto } bind def
/l { lineto } bind def
/c { curveto } bind def
/h { closepath } bind def
/re { exch dup neg 3 1 roll 5 3 roll moveto 0 rlineto
      0 exch rlineto 0 rlineto closepath } bind def
/S { stroke } bind def
/f { fill } bind def
/f* { eofill } bind def
/n { newpath } bind def
/W { clip } bind def
/W* { eoclip } bind def
/BT { } bind def
/ET { } bind def
/pdfmark where { pop globaldict /?pdfmark /exec load put }
    { globaldict begin /?pdfmark /pop load def /pdfmark
    /cleartomark load def end } ifelse
/BDC { mark 3 1 roll /BDC pdfmark } bind def
/EMC { mark /EMC pdfmark } bind def
/cairo_store_point { /cairo_point_y exch def /cairo_point_x exch def } def
/Tj { show currentpoint cairo_store_point } bind def
/TJ {
  {
    dup
    type /stringtype eq
    { show } { -0.001 mul 0 cairo_font_matrix dtransform rmoveto } ifelse
  } forall
  currentpoint cairo_store_point
} bind def
/cairo_selectfont { cairo_font_matrix aload pop pop pop 0 0 6 array astore
    cairo_font exch selectfont cairo_point_x cairo_point_y moveto } bind def
/Tf { pop /cairo_font exch def /cairo_font_matrix where
      { pop cairo_selectfont } if } bind def
/Td { matrix translate cairo_font_matrix matrix concatmatrix dup
      /cairo_font_matrix exch def dup 4 get exch 5 get cairo_store_point
      /cairo_font where { pop cairo_selectfont } if } bind def
/Tm { 2 copy 8 2 roll 6 array astore /cairo_font_matrix exch def
      cairo_store_point /cairo_font where { pop cairo_selectfont } if } bind def
/g { setgray } bind def
/rg { setrgbcolor } bind def
/d1 { setcachedevice } bind def
%%EndProlog
%%Page: 1 1
%%BeginPageSetup
%%PageBoundingBox: 0 -1 389 296
%%EndPageSetup
q 0 -1 389 297 rectclip q
0 295.148 389 -296 re W n
0 g
374.984 225.222 m 324.887 225.222 l 338.562 234.949 l 344.863 239.433 
346.336 248.171 341.855 254.472 c 337.375 260.773 328.633 262.25 
322.332 257.769 c 274.727 223.906 l 271.137 221.351 268.957 217.257 
268.848 212.855 c 268.734 208.449 270.703 204.25 274.16 201.515 c 
321.766 163.875 l 324.336 161.843 327.398 160.855 330.438 160.855 c 
334.57 160.855 338.668 162.679 341.43 166.175 c 346.227 172.238 345.195 
181.043 339.129 185.839 c 324.734 197.222 l 374.98 197.222 l 382.715 
197.222 388.98 203.488 388.98 211.222 c 388.98 218.953 382.715 225.222 
374.984 225.222 c h
374.984 225.222 m f
121.445 209.539 m 121.559 213.945 119.59 218.144 116.133 220.878 c 
68.527 258.519 l 62.461 263.312 53.66 262.285 48.863 256.218 c 44.066 
250.152 45.094 241.351 51.16 236.554 c 65.559 225.171 l 14 225.171 l 
6.27 225.171 0 218.902 0 211.171 c 0 203.437 6.27 197.171 14 197.171 c 
65.406 197.171 l 51.73 187.441 l 45.43 182.961 43.953 174.222 48.434 
167.921 c 51.168 164.082 55.477 162.035 59.855 162.035 c 62.664 162.035 
65.496 162.875 67.957 164.625 c 115.566 198.488 l 119.156 201.043 
121.336 205.136 121.445 209.539 c h
121.445 209.539 m f
95.52 102.152 m 95.508 101.742 95.496 101.336 95.488 100.914 c 94.684 
52.941 106.402 20.711 127.113 -0 c 185.531 -0 l 185.641 12.015 185.824 
37.632 185.465 50.64 c 184.93 69.937 126.004 92.011 95.52 102.152 c h
95.52 102.152 m f
254.016 194.234 m 240.555 227.886 256.188 295.148 252.18 295.148 c 
137.473 295.148 l 133.469 295.148 149.102 227.89 135.641 194.234 c 
120.551 156.511 101.977 150.101 96.84 117.582 c 131.715 111.148 165.293 
109.078 194.828 109.261 c 224.359 109.078 257.941 111.148 292.812 
117.582 c 287.68 150.101 269.105 156.511 254.016 194.234 c h
254.016 194.234 m f
294.137 102.152 m 263.652 92.011 204.727 69.937 204.191 50.64 c 203.832 
37.632 204.012 12.015 204.125 -0 c 262.539 -0 l 283.25 20.711 294.973 
52.941 294.164 100.914 c 294.16 101.336 294.145 101.742 294.137 102.152 
c h
294.137 102.152 m f
Q Q
showpage
%%Trailer
count op_count sub {pop} repeat
countdictstack dict_count sub {end} repeat
cairo_eps_state restore
%%EOF
