%!PS-Adobe-3.0 EPSF-3.0
%%Creator: cairo 1.10.2 (http://cairographics.org)
%%CreationDate: Thu Jul 31 07:30:12 2014
%%Pages: 1
%%BoundingBox: 0 -1 298 383
%%DocumentData: Clean7Bit
%%LanguageLevel: 2
%%EndComments
%%BeginProlog
/cairo_eps_state save def
/dict_count countdictstack def
/op_count count 1 sub def
userdict begin
/q { gsave } bind def
/Q { grestore } bind def
/cm { 6 array astore concat } bind def
/w { setlinewidth } bind def
/J { setlinecap } bind def
/j { setlinejoin } bind def
/M { setmiterlimit } bind def
/d { setdash } bind def
/m { moveto } bind def
/l { lineto } bind def
/c { curveto } bind def
/h { closepath } bind def
/re { exch dup neg 3 1 roll 5 3 roll moveto 0 rlineto
      0 exch rlineto 0 rlineto closepath } bind def
/S { stroke } bind def
/f { fill } bind def
/f* { eofill } bind def
/n { newpath } bind def
/W { clip } bind def
/W* { eoclip } bind def
/BT { } bind def
/ET { } bind def
/pdfmark where { pop globaldict /?pdfmark /exec load put }
    { globaldict begin /?pdfmark /pop load def /pdfmark
    /cleartomark load def end } ifelse
/BDC { mark 3 1 roll /BDC pdfmark } bind def
/EMC { mark /EMC pdfmark } bind def
/cairo_store_point { /cairo_point_y exch def /cairo_point_x exch def } def
/Tj { show currentpoint cairo_store_point } bind def
/TJ {
  {
    dup
    type /stringtype eq
    { show } { -0.001 mul 0 cairo_font_matrix dtransform rmoveto } ifelse
  } forall
  currentpoint cairo_store_point
} bind def
/cairo_selectfont { cairo_font_matrix aload pop pop pop 0 0 6 array astore
    cairo_font exch selectfont cairo_point_x cairo_point_y moveto } bind def
/Tf { pop /cairo_font exch def /cairo_font_matrix where
      { pop cairo_selectfont } if } bind def
/Td { matrix translate cairo_font_matrix matrix concatmatrix dup
      /cairo_font_matrix exch def dup 4 get exch 5 get cairo_store_point
      /cairo_font where { pop cairo_selectfont } if } bind def
/Tm { 2 copy 8 2 roll 6 array astore /cairo_font_matrix exch def
      cairo_store_point /cairo_font where { pop cairo_selectfont } if } bind def
/g { setgray } bind def
/rg { setrgbcolor } bind def
/d1 { setcachedevice } bind def
%%EndProlog
%%Page: 1 1
%%BeginPageSetup
%%PageBoundingBox: 0 -1 298 383
%%EndPageSetup
q 0 -1 298 384 rectclip q
0 382.297 298 -383 re W n
0 g
151.637 249.082 m 168.473 255.594 261.977 339.399 201.246 376.387 c 
145.742 410.195 130.109 289.336 138.973 256.57 c 139.406 252.93 146.004 
248.438 151.637 249.082 c h
151.637 249.082 m f
270.906 245.918 m 211.004 288.477 161.348 231.731 149.527 231.731 c 
147.949 231.731 l 136.129 231.731 86.469 288.481 26.566 245.918 c 
-33.336 203.356 11.59 0 125.879 0 c 171.598 0 l 285.883 0 330.812 
203.356 270.906 245.918 c h
219.672 143.047 m 216.52 123.68 191.629 100.07 171.629 81.102 c 166.23 
75.996 160.766 70.817 157.398 67.168 c 157.055 66.758 153.281 62.465 
149.023 62.465 c 144.797 62.465 140.938 66.692 140.508 67.172 c 137.34 
70.582 132.477 75.16 126.84 80.469 c 126.379 80.902 l 106.156 99.926 
80.98 123.598 77.793 143.039 c 75.609 156.438 77.602 167.289 83.703 
175.297 c 89.855 183.375 99.531 188.02 113.281 189.496 c 114.418 189.61 
115.59 189.68 116.797 189.68 c 129 189.68 141.16 183.949 148.738 
174.848 c 156.309 183.949 168.473 189.68 180.684 189.68 c 181.895 
189.68 183.07 189.61 184.188 189.496 c 197.957 188.02 207.633 183.375 
213.785 175.293 c 219.891 167.285 221.867 156.434 219.672 143.047 c h
219.672 143.047 m f
Q Q
showpage
%%Trailer
count op_count sub {pop} repeat
countdictstack dict_count sub {end} repeat
cairo_eps_state restore
%%EOF
