%!PS-Adobe-3.0 EPSF-3.0
%%Creator: cairo 1.10.2 (http://cairographics.org)
%%CreationDate: Thu Jul 31 07:30:08 2014
%%Pages: 1
%%BoundingBox: 0 -1 381 381
%%DocumentData: Clean7Bit
%%LanguageLevel: 2
%%EndComments
%%BeginProlog
/cairo_eps_state save def
/dict_count countdictstack def
/op_count count 1 sub def
userdict begin
/q { gsave } bind def
/Q { grestore } bind def
/cm { 6 array astore concat } bind def
/w { setlinewidth } bind def
/J { setlinecap } bind def
/j { setlinejoin } bind def
/M { setmiterlimit } bind def
/d { setdash } bind def
/m { moveto } bind def
/l { lineto } bind def
/c { curveto } bind def
/h { closepath } bind def
/re { exch dup neg 3 1 roll 5 3 roll moveto 0 rlineto
      0 exch rlineto 0 rlineto closepath } bind def
/S { stroke } bind def
/f { fill } bind def
/f* { eofill } bind def
/n { newpath } bind def
/W { clip } bind def
/W* { eoclip } bind def
/BT { } bind def
/ET { } bind def
/pdfmark where { pop globaldict /?pdfmark /exec load put }
    { globaldict begin /?pdfmark /pop load def /pdfmark
    /cleartomark load def end } ifelse
/BDC { mark 3 1 roll /BDC pdfmark } bind def
/EMC { mark /EMC pdfmark } bind def
/cairo_store_point { /cairo_point_y exch def /cairo_point_x exch def } def
/Tj { show currentpoint cairo_store_point } bind def
/TJ {
  {
    dup
    type /stringtype eq
    { show } { -0.001 mul 0 cairo_font_matrix dtransform rmoveto } ifelse
  } forall
  currentpoint cairo_store_point
} bind def
/cairo_selectfont { cairo_font_matrix aload pop pop pop 0 0 6 array astore
    cairo_font exch selectfont cairo_point_x cairo_point_y moveto } bind def
/Tf { pop /cairo_font exch def /cairo_font_matrix where
      { pop cairo_selectfont } if } bind def
/Td { matrix translate cairo_font_matrix matrix concatmatrix dup
      /cairo_font_matrix exch def dup 4 get exch 5 get cairo_store_point
      /cairo_font where { pop cairo_selectfont } if } bind def
/Tm { 2 copy 8 2 roll 6 array astore /cairo_font_matrix exch def
      cairo_store_point /cairo_font where { pop cairo_selectfont } if } bind def
/g { setgray } bind def
/rg { setrgbcolor } bind def
/d1 { setcachedevice } bind def
%%EndProlog
%%Page: 1 1
%%BeginPageSetup
%%PageBoundingBox: 0 -1 381 381
%%EndPageSetup
q 0 -1 381 382 rectclip q
0 380.754 381 -381 re W n
0 g
259.277 359.914 m 20.84 121.476 l -6.945 93.687 -6.945 48.633 20.844 
20.844 c 48.629 -6.949 93.688 -6.946 121.477 20.844 c 240.633 140 l 
240.754 140.117 l 359.91 259.277 l 387.695 287.066 387.699 332.121 
359.91 359.914 c 332.121 387.703 287.062 387.699 259.277 359.914 c h
328.332 368.496 m 329.738 369.898 332.016 369.898 333.414 368.496 c 
334.82 367.09 334.82 364.816 333.414 363.414 c 332.012 362.012 329.738 
362.012 328.332 363.414 c 326.93 364.816 326.93 367.09 328.332 368.496 
c h
269.148 267.742 m 270.555 269.148 272.828 269.148 274.23 267.742 c 
275.633 266.34 275.633 264.066 274.23 262.66 c 272.828 261.258 270.551 
261.258 269.148 262.66 c 267.746 264.066 267.746 266.344 269.148 
267.742 c h
253.855 275.84 m 252.453 277.242 252.453 279.515 253.855 280.922 c 
255.258 282.324 257.535 282.324 258.938 280.922 c 260.34 279.519 260.34 
277.242 258.938 275.836 c 257.535 274.433 255.258 274.437 253.855 
275.84 c h
252.633 287.711 m 251.23 289.113 251.23 291.39 252.633 292.793 c 
254.035 294.199 256.312 294.199 257.715 292.793 c 259.121 291.39 
259.117 289.117 257.715 287.711 c 256.312 286.312 254.035 286.308 
252.633 287.711 c h
284.465 253.16 m 285.871 254.562 288.145 254.562 289.547 253.16 c 
290.953 251.758 290.953 249.48 289.547 248.078 c 288.145 246.672 
285.871 246.672 284.465 248.078 c 283.062 249.48 283.062 251.758 
284.465 253.16 c h
267.926 274.664 m 266.523 276.07 266.523 278.344 267.926 279.75 c 
269.332 281.152 271.605 281.152 273.008 279.746 c 274.414 278.344 
274.414 276.07 273.008 274.668 c 271.605 273.262 269.328 273.262 
267.926 274.664 c h
285.047 278.558 m 286.449 277.156 286.449 274.879 285.047 273.476 c 
283.641 272.074 281.367 272.074 279.965 273.476 c 278.559 274.883 
278.559 277.156 279.965 278.558 c 281.363 279.961 283.645 279.961 
285.047 278.558 c h
263.449 298.527 m 262.047 299.929 262.047 302.203 263.449 303.609 c 
264.852 305.012 267.125 305.012 268.531 303.609 c 269.934 302.203 
269.934 299.929 268.531 298.527 c 267.125 297.125 264.852 297.125 
263.449 298.527 c h
269.75 286.652 m 268.348 285.25 266.074 285.25 264.668 286.652 c 
263.266 288.054 263.266 290.332 264.668 291.734 c 266.074 293.137 
268.348 293.137 269.75 291.734 c 271.156 290.332 271.156 288.058 269.75 
286.652 c h
283.219 266.57 m 284.625 267.972 286.898 267.972 288.305 266.57 c 
289.707 265.168 289.707 262.89 288.301 261.488 c 286.898 260.086 
284.625 260.086 283.219 261.488 c 281.816 262.894 281.816 265.168 
283.219 266.57 c h
295.281 263.972 m 296.684 265.379 298.961 265.375 300.363 263.972 c 
301.766 262.57 301.766 260.297 300.363 258.89 c 298.961 257.488 296.684 
257.488 295.281 258.89 c 293.879 260.293 293.879 262.57 295.281 263.972 
c h
278.742 285.48 m 277.34 286.883 277.34 289.16 278.738 290.562 c 280.145 
291.965 282.422 291.965 283.824 290.562 c 285.227 289.16 285.227 
286.883 283.824 285.48 c 282.422 284.078 280.145 284.078 278.742 285.48 
c h
295.859 289.371 m 297.262 287.969 297.262 285.695 295.859 284.293 c 
294.457 282.89 292.18 282.887 290.777 284.289 c 289.375 285.695 289.375 
287.969 290.777 289.371 c 292.18 290.777 294.457 290.777 295.859 
289.371 c h
274.262 309.34 m 272.859 310.746 272.859 313.019 274.262 314.422 c 
275.664 315.828 277.941 315.828 279.344 314.422 c 280.75 313.019 280.75 
310.746 279.344 309.344 c 277.941 307.937 275.664 307.937 274.262 
309.34 c h
280.566 297.469 m 279.164 296.062 276.887 296.066 275.484 297.469 c 
274.082 298.871 274.082 301.144 275.484 302.551 c 276.887 303.953 
279.16 303.953 280.566 302.551 c 281.969 301.144 281.969 298.871 
280.566 297.469 c h
294.035 277.387 m 295.438 278.789 297.711 278.789 299.117 277.387 c 
300.52 275.984 300.523 273.707 299.117 272.304 c 297.711 270.898 
295.438 270.898 294.035 272.304 c 292.629 273.707 292.629 275.98 
294.035 277.387 c h
306.094 274.789 m 307.5 276.191 309.773 276.191 311.18 274.789 c 
312.582 273.387 312.582 271.109 311.176 269.707 c 309.773 268.304 307.5 
268.304 306.094 269.707 c 304.691 271.109 304.691 273.387 306.094 
274.789 c h
289.555 296.293 m 288.152 297.699 288.152 299.972 289.555 301.379 c 
290.961 302.781 293.234 302.781 294.641 301.379 c 296.039 299.972 
296.039 297.699 294.637 296.293 c 293.234 294.89 290.961 294.89 289.555 
296.293 c h
306.672 300.187 m 308.078 298.785 308.078 296.508 306.672 295.105 c 
305.27 293.703 302.996 293.703 301.59 295.105 c 300.188 296.508 300.188 
298.785 301.59 300.187 c 302.996 301.59 305.27 301.59 306.672 300.187 c 
h
285.078 320.156 m 283.672 321.558 283.672 323.836 285.078 325.238 c 
286.48 326.64 288.754 326.64 290.156 325.238 c 291.562 323.836 291.562 
321.558 290.16 320.156 c 288.754 318.754 286.48 318.754 285.078 320.156 
c h
291.379 308.281 m 289.977 306.879 287.699 306.879 286.297 308.281 c 
284.895 309.683 284.895 311.961 286.297 313.363 c 287.703 314.765 
289.977 314.765 291.383 313.363 c 292.785 311.961 292.785 309.687 
291.379 308.281 c h
304.852 288.199 m 306.254 289.601 308.527 289.601 309.934 288.199 c 
311.336 286.797 311.336 284.519 309.934 283.117 c 308.527 281.715 
306.254 281.715 304.852 283.117 c 303.445 284.523 303.445 286.797 
304.852 288.199 c h
316.91 285.601 m 318.312 287.008 320.59 287.004 321.992 285.601 c 
323.398 284.199 323.398 281.926 321.992 280.519 c 320.586 279.117 
318.312 279.117 316.91 280.519 c 315.504 281.922 315.504 284.199 316.91 
285.601 c h
300.371 307.109 m 298.965 308.515 298.965 310.789 300.371 312.191 c 
301.773 313.594 304.047 313.594 305.453 312.191 c 306.855 310.789 
306.855 308.512 305.453 307.109 c 304.051 305.707 301.773 305.707 
300.371 307.109 c h
317.492 311 m 318.891 309.597 318.891 307.324 317.488 305.918 c 316.086 
304.515 313.812 304.515 312.406 305.918 c 311.004 307.324 311.004 
309.597 312.406 311 c 313.812 312.406 316.086 312.406 317.492 311 c h
295.891 330.969 m 294.488 332.375 294.488 334.648 295.891 336.054 c 
297.297 337.457 299.57 337.457 300.973 336.054 c 302.379 334.648 
302.379 332.375 300.977 330.972 c 299.566 329.566 297.293 329.566 
295.891 330.969 c h
302.195 319.097 m 300.793 317.695 298.516 317.695 297.113 319.097 c 
295.711 320.5 295.711 322.773 297.113 324.179 c 298.516 325.582 300.793 
325.582 302.195 324.179 c 303.598 322.777 303.598 320.5 302.195 319.097 
c h
315.664 299.015 m 317.066 300.418 319.344 300.418 320.746 299.015 c 
322.148 297.609 322.148 295.336 320.746 293.929 c 319.344 292.527 
317.066 292.527 315.664 293.933 c 314.258 295.336 314.262 297.609 
315.664 299.015 c h
327.723 296.418 m 329.129 297.82 331.402 297.82 332.805 296.418 c 
334.211 295.012 334.211 292.738 332.805 291.336 c 331.402 289.933 
329.129 289.929 327.727 291.336 c 326.32 292.738 326.32 295.015 327.723 
296.418 c h
311.188 317.922 m 309.781 319.328 309.781 321.601 311.184 323.004 c 
312.59 324.41 314.863 324.41 316.266 323.004 c 317.672 321.601 317.672 
319.328 316.266 317.922 c 314.863 316.519 312.59 316.519 311.188 
317.922 c h
328.305 321.816 m 329.707 320.414 329.707 318.137 328.301 316.734 c 
326.898 315.332 324.625 315.332 323.223 316.734 c 321.816 318.137 
321.816 320.414 323.219 321.816 c 324.625 323.219 326.898 323.219 
328.305 321.816 c h
306.703 341.785 m 305.301 343.187 305.301 345.465 306.707 346.867 c 
308.105 348.269 310.383 348.269 311.789 346.867 c 313.191 345.461 
313.191 343.187 311.789 341.785 c 310.383 340.383 308.105 340.379 
306.703 341.785 c h
313.008 329.91 m 311.605 328.508 309.332 328.508 307.926 329.91 c 
306.523 331.316 306.523 333.59 307.926 334.992 c 309.332 336.398 
311.605 336.398 313.012 334.992 c 314.414 333.59 314.414 331.316 
313.008 329.91 c h
326.48 309.828 m 327.883 311.23 330.156 311.234 331.562 309.828 c 
332.965 308.426 332.965 306.148 331.562 304.746 c 330.156 303.344 
327.883 303.344 326.48 304.746 c 325.074 306.152 325.078 308.426 326.48 
309.828 c h
338.539 307.23 m 339.945 308.637 342.219 308.633 343.621 307.23 c 
345.023 305.828 345.023 303.554 343.621 302.148 c 342.219 300.746 
339.945 300.746 338.539 302.148 c 337.137 303.554 337.133 305.828 
338.539 307.23 c h
322 328.738 m 320.598 330.144 320.598 332.418 322 333.82 c 323.402 
335.222 325.68 335.222 327.082 333.82 c 328.484 332.418 328.484 330.144 
327.082 328.738 c 325.68 327.336 323.402 327.336 322 328.738 c h
323.824 340.726 m 322.422 339.32 320.145 339.324 318.742 340.726 c 
317.34 342.129 317.34 344.402 318.742 345.808 c 320.148 347.211 322.422 
347.211 323.824 345.808 c 325.227 344.402 325.227 342.129 323.824 
340.726 c h
339.117 332.633 m 340.52 331.23 340.523 328.953 339.117 327.551 c 
337.715 326.144 335.438 326.148 334.035 327.551 c 332.633 328.953 
332.633 331.226 334.035 332.629 c 335.438 334.035 337.715 334.035 
339.117 332.633 c h
337.293 320.644 m 338.699 322.047 340.973 322.047 342.375 320.644 c 
343.781 319.242 343.781 316.965 342.375 315.562 c 340.973 314.156 
338.695 314.16 337.293 315.562 c 335.891 316.965 335.891 319.238 
337.293 320.644 c h
349.352 318.047 m 350.758 319.449 353.031 319.449 354.438 318.047 c 
355.84 316.64 355.84 314.367 354.438 312.965 c 353.031 311.562 350.758 
311.558 349.355 312.965 c 347.949 314.367 347.949 316.644 349.352 
318.047 c h
332.812 339.554 m 331.41 340.957 331.41 343.23 332.812 344.637 c 
334.219 346.039 336.492 346.039 337.895 344.633 c 339.297 343.23 
339.301 340.957 337.895 339.554 c 336.492 338.148 334.219 338.148 
332.812 339.554 c h
348.109 331.457 m 349.512 332.863 351.785 332.863 353.188 331.457 c 
354.594 330.054 354.594 327.781 353.191 326.379 c 351.785 324.972 
349.512 324.972 348.105 326.375 c 346.703 327.781 346.703 330.054 
348.109 331.457 c h
344.852 338.363 m 343.445 339.765 343.445 342.043 344.848 343.445 c 
346.254 344.847 348.531 344.847 349.934 343.445 c 351.336 342.043 
351.336 339.765 349.93 338.363 c 348.527 336.961 346.254 336.961 
344.852 338.363 c h
334.637 356.621 m 336.039 355.219 336.039 352.941 334.637 351.539 c 
333.234 350.137 330.957 350.137 329.555 351.539 c 328.152 352.945 
328.152 355.219 329.555 356.621 c 330.961 358.023 333.234 358.023 
334.637 356.621 c h
314.262 369.668 m 315.668 371.07 317.941 371.07 319.344 369.668 c 
320.75 368.262 320.75 365.988 319.344 364.586 c 317.941 363.183 315.668 
363.183 314.262 364.586 c 312.859 365.988 312.859 368.265 314.262 
369.668 c h
322.602 357.683 m 324.004 356.277 324.004 354.004 322.602 352.597 c 
321.199 351.195 318.926 351.195 317.52 352.597 c 316.117 354.004 
316.113 356.277 317.52 357.679 c 318.922 359.086 321.199 359.086 
322.602 357.683 c h
301.504 371.449 m 302.91 372.851 305.184 372.851 306.586 371.449 c 
307.992 370.047 307.992 367.769 306.586 366.367 c 305.184 364.965 
302.906 364.965 301.504 366.367 c 300.102 367.769 300.102 370.047 
301.504 371.449 c h
308.531 358.855 m 309.934 357.449 309.934 355.176 308.531 353.769 c 
307.125 352.367 304.852 352.367 303.449 353.769 c 302.043 355.176 
302.043 357.449 303.449 358.855 c 304.852 360.258 307.125 360.258 
308.531 358.855 c h
287.434 372.621 m 288.836 374.023 291.109 374.023 292.516 372.621 c 
293.918 371.219 293.918 368.945 292.516 367.539 c 291.113 366.137 
288.836 366.137 287.434 367.539 c 286.027 368.945 286.027 371.219 
287.434 372.621 c h
290.691 360.633 m 292.094 362.039 294.367 362.039 295.773 360.633 c 
297.176 359.23 297.176 356.957 295.773 355.554 c 294.371 354.148 
292.094 354.148 290.688 355.551 c 289.285 356.957 289.289 359.23 
290.691 360.633 c h
297.715 348.039 m 299.121 346.637 299.121 344.359 297.715 342.957 c 
296.312 341.554 294.035 341.554 292.633 342.957 c 291.23 344.359 291.23 
346.637 292.633 348.039 c 294.039 349.445 296.312 349.441 297.715 
348.039 c h
276.617 361.804 m 278.023 363.211 280.297 363.211 281.699 361.808 c 
283.102 360.402 283.102 358.129 281.699 356.722 c 280.297 355.32 
278.023 355.32 276.617 356.726 c 275.215 358.129 275.215 360.402 
276.617 361.804 c h
279.875 349.82 m 281.281 351.222 283.555 351.222 284.957 349.82 c 
286.359 348.418 286.359 346.144 284.957 344.738 c 283.555 343.336 
281.281 343.336 279.875 344.738 c 278.469 346.14 278.473 348.418 
279.875 349.82 c h
286.898 337.222 m 288.305 335.82 288.305 333.547 286.902 332.144 c 
285.496 330.738 283.223 330.738 281.82 332.144 c 280.418 333.547 
280.418 335.82 281.816 337.226 c 283.223 338.629 285.496 338.629 
286.898 337.222 c h
265.805 350.992 m 267.207 352.394 269.48 352.394 270.887 350.992 c 
272.289 349.59 272.289 347.312 270.887 345.91 c 269.484 344.508 267.207 
344.508 265.805 345.91 c 264.402 347.316 264.402 349.59 265.805 350.992 
c h
269.059 339.004 m 270.465 340.41 272.738 340.41 274.145 339.008 c 
275.547 337.601 275.547 335.328 274.145 333.922 c 272.738 332.519 
270.465 332.519 269.062 333.926 c 267.656 335.328 267.656 337.601 
269.059 339.004 c h
276.086 326.41 m 277.492 325.008 277.492 322.73 276.086 321.328 c 
274.684 319.922 272.406 319.926 271.004 321.328 c 269.602 322.73 
269.602 325.008 271.004 326.41 c 272.41 327.812 274.684 327.812 276.086 
326.41 c h
254.992 340.179 m 256.391 341.582 258.668 341.582 260.07 340.179 c 
261.477 338.773 261.477 336.5 260.07 335.097 c 258.668 333.691 256.391 
333.691 254.988 335.097 c 253.586 336.5 253.586 338.773 254.992 340.179 
c h
258.246 328.191 m 259.652 329.594 261.922 329.594 263.328 328.191 c 
264.734 326.789 264.734 324.512 263.328 323.109 c 261.926 321.707 
259.648 321.703 258.246 323.109 c 256.844 324.512 256.844 326.789 
258.246 328.191 c h
265.27 315.594 m 266.676 314.191 266.676 311.918 265.27 310.512 c 
263.871 309.109 261.594 309.109 260.191 310.515 c 258.785 311.918 
258.785 314.191 260.191 315.594 c 261.594 316.996 263.867 316.996 
265.27 315.594 c h
244.176 329.363 m 245.578 330.769 247.855 330.769 249.258 329.363 c 
250.66 327.961 250.66 325.687 249.258 324.281 c 247.855 322.879 245.578 
322.879 244.176 324.281 c 242.77 325.687 242.77 327.961 244.176 329.363 
c h
247.434 317.379 m 248.836 318.781 251.109 318.781 252.516 317.379 c 
253.918 315.972 253.918 313.699 252.516 312.297 c 251.109 310.89 
248.836 310.89 247.43 312.293 c 246.027 313.699 246.027 315.972 247.434 
317.379 c h
254.457 304.781 m 255.859 303.379 255.859 301.101 254.461 299.699 c 
253.055 298.297 250.781 298.297 249.379 299.699 c 247.973 301.101 
247.973 303.379 249.375 304.781 c 250.781 306.183 253.055 306.183 
254.457 304.781 c h
233.359 318.551 m 234.762 319.953 237.035 319.953 238.441 318.551 c 
239.844 317.144 239.844 314.871 238.445 313.469 c 237.039 312.062 
234.762 312.062 233.363 313.469 c 231.957 314.871 231.957 317.144 
233.359 318.551 c h
236.617 306.562 m 238.02 307.965 240.297 307.965 241.699 306.562 c 
243.105 305.16 243.102 302.883 241.699 301.48 c 240.297 300.078 238.02 
300.074 236.617 301.48 c 235.211 302.883 235.215 305.16 236.617 306.562 
c h
243.645 293.969 m 245.047 292.562 245.047 290.289 243.645 288.883 c 
242.238 287.48 239.965 287.48 238.559 288.887 c 237.16 290.289 237.16 
292.562 238.559 293.965 c 239.965 295.371 242.238 295.371 243.645 
293.969 c h
222.547 307.734 m 223.949 309.137 226.223 309.14 227.629 307.734 c 
229.031 306.332 229.031 304.054 227.629 302.652 c 226.223 301.25 
223.949 301.25 222.547 302.652 c 221.141 304.058 221.141 306.332 
222.547 307.734 c h
73.02 158.207 m 74.422 159.613 76.695 159.613 78.102 158.207 c 79.504 
156.804 79.504 154.531 78.102 153.125 c 76.695 151.722 74.422 151.722 
73.02 153.125 c 71.613 154.527 71.613 156.804 73.02 158.207 c h
86.789 142.191 m 88.191 143.594 90.465 143.594 91.867 142.191 c 93.273 
140.789 93.273 138.515 91.867 137.109 c 90.465 135.707 88.188 135.707 
86.785 137.109 c 85.383 138.512 85.383 140.789 86.789 142.191 c h
49.297 32.644 m 50.699 34.051 52.973 34.051 54.379 32.644 c 55.781 
31.242 55.781 28.965 54.379 27.562 c 52.973 26.16 50.699 26.16 49.297 
27.562 c 47.891 28.969 47.891 31.242 49.297 32.644 c h
42.391 30.82 m 40.984 29.418 38.711 29.418 37.309 30.82 c 35.902 32.226 
35.902 34.5 37.309 35.906 c 38.711 37.304 40.984 37.304 42.391 35.902 c 
43.793 34.5 43.793 32.222 42.391 30.82 c h
41.199 42.859 m 39.793 41.453 37.523 41.453 36.117 42.859 c 34.715 
44.262 34.715 46.535 36.117 47.937 c 37.523 49.344 39.797 49.344 41.199 
47.937 c 42.605 46.535 42.605 44.262 41.199 42.859 c h
62.707 31.398 m 64.109 32.804 66.387 32.801 67.789 31.398 c 69.195 
29.996 69.191 27.722 67.789 26.316 c 66.387 24.914 64.109 24.914 62.707 
26.316 c 61.305 27.722 61.305 29.996 62.707 31.398 c h
48.121 46.719 m 49.527 48.121 51.801 48.121 53.207 46.719 c 54.605 
45.316 54.605 43.039 53.203 41.637 c 51.801 40.23 49.527 40.23 48.121 
41.633 c 46.719 43.039 46.719 45.312 48.121 46.719 c h
34.945 56.929 m 33.543 58.332 33.543 60.609 34.945 62.012 c 36.348 
63.414 38.625 63.414 40.027 62.012 c 41.43 60.609 41.43 58.332 40.027 
56.929 c 38.625 55.527 36.348 55.527 34.945 56.929 c h
60.109 38.379 m 58.707 39.781 58.707 42.054 60.109 43.461 c 61.512 
44.863 63.789 44.863 65.191 43.461 c 66.594 42.058 66.594 39.781 65.191 
38.379 c 63.789 36.972 61.512 36.972 60.109 38.379 c h
52.016 53.672 m 50.613 52.269 48.336 52.269 46.934 53.672 c 45.527 
55.074 45.527 57.351 46.934 58.754 c 48.336 60.156 50.609 60.156 52.016 
58.754 c 53.418 57.347 53.418 55.074 52.016 53.672 c h
58.938 57.531 m 60.34 58.933 62.617 58.933 64.02 57.531 c 65.422 56.129 
65.422 53.851 64.02 52.449 c 62.617 51.047 60.344 51.047 58.938 52.449 
c 57.535 53.855 57.531 56.129 58.938 57.531 c h
45.758 67.742 m 44.355 69.148 44.355 71.422 45.758 72.824 c 47.164 
74.23 49.438 74.23 50.844 72.824 c 52.246 71.422 52.246 69.148 50.844 
67.746 c 49.438 66.34 47.164 66.34 45.758 67.742 c h
38.969 68.965 m 37.566 67.562 35.289 67.562 33.887 68.965 c 32.484 
70.371 32.484 72.644 33.887 74.047 c 35.289 75.453 37.566 75.453 38.969 
74.047 c 40.371 72.644 40.371 70.367 38.969 68.965 c h
73.523 42.215 m 74.926 43.617 77.199 43.617 78.605 42.215 c 80.008 
40.812 80.008 38.535 78.605 37.133 c 77.199 35.73 74.926 35.73 73.523 
37.133 c 72.117 38.535 72.117 40.812 73.523 42.215 c h
70.926 49.191 m 69.52 50.594 69.523 52.871 70.926 54.273 c 72.328 
55.679 74.602 55.679 76.008 54.273 c 77.41 52.871 77.41 50.594 76.008 
49.191 c 74.602 47.789 72.328 47.789 70.926 49.191 c h
62.828 64.488 m 61.426 63.082 59.152 63.082 57.746 64.484 c 56.344 
65.89 56.344 68.164 57.746 69.566 c 59.152 70.972 61.426 70.972 62.828 
69.566 c 64.23 68.164 64.23 65.89 62.828 64.488 c h
69.75 68.347 m 71.156 69.75 73.43 69.75 74.836 68.344 c 76.234 66.941 
76.234 64.668 74.836 63.265 c 73.43 61.859 71.156 61.859 69.754 63.262 
c 68.348 64.668 68.348 66.945 69.75 68.347 c h
56.574 78.558 m 55.168 79.961 55.168 82.238 56.574 83.64 c 57.977 
85.043 60.25 85.043 61.656 83.64 c 63.059 82.238 63.062 79.961 61.656 
78.558 c 60.254 77.156 57.977 77.156 56.574 78.558 c h
49.781 79.781 m 48.379 78.379 46.105 78.379 44.699 79.781 c 43.297 
81.183 43.297 83.457 44.699 84.863 c 46.105 86.265 48.379 86.265 49.781 
84.863 c 51.188 83.457 51.188 81.183 49.781 79.781 c h
84.336 53.027 m 85.738 54.433 88.016 54.429 89.418 53.027 c 90.82 
51.625 90.82 49.351 89.418 47.949 c 88.016 46.543 85.738 46.543 84.336 
47.945 c 82.934 49.351 82.934 51.625 84.336 53.027 c h
81.738 60.008 m 80.336 61.41 80.336 63.687 81.738 65.09 c 83.141 66.492 
85.418 66.492 86.82 65.09 c 88.223 63.687 88.223 61.41 86.82 60.008 c 
85.418 58.601 83.141 58.605 81.738 60.008 c h
73.645 75.301 m 72.242 73.898 69.965 73.898 68.562 75.301 c 67.156 
76.703 67.16 78.98 68.562 80.383 c 69.965 81.785 72.238 81.785 73.645 
80.383 c 75.047 78.98 75.047 76.703 73.645 75.301 c h
80.566 79.16 m 81.969 80.562 84.246 80.562 85.648 79.16 c 87.051 77.758 
87.051 75.48 85.648 74.078 c 84.246 72.676 81.969 72.676 80.566 74.078 
c 79.164 75.484 79.16 77.758 80.566 79.16 c h
67.391 89.371 m 65.984 90.777 65.984 93.051 67.391 94.457 c 68.793 
95.859 71.066 95.859 72.473 94.453 c 73.875 93.051 73.875 90.777 72.473 
89.375 c 71.066 87.969 68.793 87.969 67.391 89.371 c h
60.598 90.594 m 59.191 89.191 56.918 89.191 55.516 90.594 c 54.113 
91.996 54.113 94.273 55.516 95.676 c 56.918 97.082 59.191 97.078 60.598 
95.676 c 62 94.273 62 92 60.598 90.594 c h
95.152 63.844 m 96.555 65.246 98.828 65.246 100.234 63.844 c 101.637 
62.437 101.637 60.164 100.234 58.762 c 98.828 57.359 96.555 57.359 
95.152 58.762 c 93.75 60.164 93.746 62.441 95.152 63.844 c h
92.555 70.82 m 91.148 72.222 91.148 74.5 92.555 75.902 c 93.957 77.304 
96.23 77.304 97.633 75.902 c 99.039 74.5 99.039 72.222 97.637 70.82 c 
96.23 69.418 93.957 69.418 92.555 70.82 c h
84.457 86.117 m 83.055 84.715 80.781 84.711 79.375 86.113 c 77.973 
87.519 77.973 89.793 79.375 91.199 c 80.781 92.601 83.055 92.601 84.457 
91.195 c 85.859 89.793 85.863 87.519 84.457 86.117 c h
91.383 89.976 m 92.781 91.379 95.059 91.379 96.461 89.976 c 97.867 
88.574 97.867 86.297 96.461 84.894 c 95.059 83.492 92.785 83.492 91.383 
84.894 c 89.977 86.297 89.977 88.57 91.383 89.976 c h
78.203 100.187 m 76.801 101.59 76.801 103.867 78.203 105.269 c 79.605 
106.672 81.883 106.672 83.285 105.269 c 84.688 103.867 84.688 101.59 
83.289 100.187 c 81.883 98.785 79.605 98.785 78.203 100.187 c h
71.414 101.41 m 70.008 100.004 67.734 100.004 66.332 101.41 c 64.926 
102.812 64.926 105.09 66.328 106.492 c 67.73 107.894 70.008 107.894 
71.414 106.492 c 72.816 105.086 72.812 102.812 71.414 101.41 c h
105.965 74.656 m 107.367 76.062 109.645 76.062 111.047 74.656 c 112.449 
73.254 112.449 70.98 111.047 69.574 c 109.645 68.172 107.367 68.172 
105.965 69.574 c 104.562 70.98 104.559 73.254 105.965 74.656 c h
103.367 81.637 m 101.965 83.039 101.965 85.312 103.367 86.719 c 104.77 
88.121 107.047 88.121 108.449 86.719 c 109.852 85.316 109.852 83.039 
108.449 81.637 c 107.047 80.23 104.77 80.234 103.367 81.637 c h
95.27 96.929 m 93.871 95.527 91.594 95.527 90.191 96.929 c 88.785 
98.332 88.785 100.605 90.191 102.012 c 91.594 103.414 93.871 103.414 
95.273 102.012 c 96.676 100.609 96.676 98.332 95.27 96.929 c h
102.195 100.793 m 103.598 102.195 105.871 102.195 107.277 100.789 c 
108.68 99.387 108.68 97.113 107.277 95.707 c 105.871 94.304 103.598 
94.304 102.195 95.707 c 100.793 97.113 100.793 99.387 102.195 100.793 c 
h
89.02 111 m 87.613 112.402 87.617 114.679 89.02 116.086 c 90.422 
117.488 92.695 117.488 94.102 116.082 c 95.504 114.679 95.504 112.406 
94.102 111 c 92.699 109.597 90.422 109.597 89.02 111 c h
82.227 112.222 m 80.82 110.82 78.547 110.82 77.145 112.222 c 75.738 
113.625 75.738 115.902 77.145 117.304 c 78.547 118.711 80.824 118.711 
82.227 117.304 c 83.629 115.902 83.629 113.629 82.227 112.222 c h
116.781 85.472 m 118.184 86.875 120.461 86.875 121.863 85.472 c 123.266 
84.07 123.266 81.793 121.859 80.39 c 120.457 78.988 118.184 78.984 
116.777 80.39 c 115.375 81.793 115.375 84.07 116.781 85.472 c h
114.18 92.449 m 112.777 93.855 112.777 96.129 114.184 97.531 c 115.586 
98.933 117.859 98.937 119.266 97.531 c 120.668 96.129 120.668 93.855 
119.266 92.453 c 117.859 91.047 115.586 91.047 114.18 92.449 c h
106.086 107.746 m 104.684 106.34 102.41 106.34 101.004 107.742 c 99.602 
109.148 99.602 111.422 101.004 112.824 c 102.406 114.23 104.684 114.23 
106.086 112.824 c 107.492 111.422 107.492 109.148 106.086 107.746 c h
87.957 123.039 m 86.555 124.441 86.555 126.719 87.961 128.121 c 89.363 
129.523 91.641 129.523 93.039 128.121 c 94.445 126.719 94.445 124.441 
93.039 123.039 c 91.637 121.633 89.363 121.633 87.957 123.039 c h
127.594 96.289 m 128.996 97.691 131.273 97.687 132.676 96.285 c 134.078 
94.883 134.078 92.609 132.676 91.203 c 131.27 89.801 128.996 89.801 
127.594 91.203 c 126.191 92.609 126.191 94.883 127.594 96.289 c h
118.09 106.523 m 116.688 105.121 114.414 105.121 113.008 106.523 c 
111.605 107.926 111.605 110.203 113.008 111.605 c 114.414 113.008 
116.688 113.008 118.094 111.605 c 119.492 110.199 119.492 107.926 
118.09 106.523 c h
104.914 121.816 m 103.512 120.414 101.234 120.414 99.832 121.816 c 
98.43 123.219 98.43 125.496 99.832 126.898 c 101.238 128.301 103.512 
128.301 104.914 126.898 c 106.32 125.496 106.32 123.219 104.914 121.816 
c h
74.191 144.137 m 75.594 145.539 77.871 145.539 79.273 144.137 c 80.676 
142.734 80.676 140.457 79.273 139.054 c 77.871 137.648 75.594 137.648 
74.191 139.054 c 72.785 140.457 72.789 142.73 74.191 144.137 c h
62.203 147.39 m 63.605 148.797 65.883 148.797 67.285 147.394 c 68.688 
145.988 68.688 143.715 67.285 142.312 c 65.883 140.91 63.605 140.91 
62.203 142.312 c 60.801 143.715 60.801 145.992 62.203 147.39 c h
75.973 131.379 m 77.375 132.781 79.648 132.781 81.055 131.379 c 82.457 
129.972 82.457 127.699 81.055 126.293 c 79.652 124.89 77.375 124.89 
75.973 126.297 c 74.566 127.699 74.57 129.972 75.973 131.379 c h
63.375 133.32 m 64.781 134.722 67.055 134.726 68.461 133.32 c 69.863 
131.918 69.863 129.64 68.461 128.238 c 67.055 126.836 64.781 126.836 
63.375 128.238 c 61.973 129.644 61.973 131.918 63.375 133.32 c h
51.391 136.578 m 52.793 137.98 55.066 137.984 56.473 136.578 c 57.879 
135.176 57.879 132.902 56.473 131.496 c 55.066 130.094 52.793 130.094 
51.391 131.496 c 49.984 132.898 49.984 135.176 51.391 136.578 c h
65.156 120.562 m 66.562 121.965 68.836 121.965 70.238 120.562 c 71.645 
119.16 71.645 116.883 70.242 115.48 c 68.836 114.078 66.562 114.078 
65.156 115.48 c 63.758 116.887 63.758 119.16 65.156 120.562 c h
52.562 122.504 m 53.965 123.91 56.238 123.91 57.645 122.508 c 59.047 
121.105 59.047 118.828 57.645 117.422 c 56.242 116.019 53.965 116.019 
52.562 117.426 c 51.156 118.828 51.16 121.105 52.562 122.504 c h
40.574 125.762 m 41.977 127.168 44.254 127.168 45.656 125.765 c 47.062 
124.359 47.062 122.086 45.656 120.683 c 44.254 119.277 41.977 119.277 
40.574 120.683 c 39.172 122.086 39.172 124.359 40.574 125.762 c h
54.344 109.746 m 55.746 111.152 58.023 111.152 59.426 109.746 c 60.828 
108.344 60.828 106.066 59.426 104.664 c 58.023 103.262 55.746 103.262 
54.344 104.664 c 52.941 106.07 52.941 108.344 54.344 109.746 c h
41.746 111.691 m 43.152 113.097 45.426 113.097 46.828 111.691 c 48.234 
110.289 48.234 108.015 46.828 106.609 c 45.426 105.207 43.152 105.207 
41.746 106.609 c 40.344 108.015 40.344 110.289 41.746 111.691 c h
29.758 114.949 m 31.164 116.351 33.438 116.351 34.844 114.949 c 36.246 
113.547 36.246 111.269 34.844 109.867 c 33.438 108.465 31.164 108.465 
29.762 109.867 c 28.359 111.273 28.359 113.547 29.758 114.949 c h
43.527 98.933 m 44.934 100.336 47.207 100.336 48.609 98.933 c 50.016 
97.531 50.016 95.254 48.609 93.851 c 47.207 92.449 44.934 92.449 43.527 
93.851 c 42.125 95.254 42.125 97.531 43.527 98.933 c h
30.934 100.879 m 32.336 102.281 34.609 102.281 36.016 100.879 c 37.418 
99.472 37.422 97.199 36.016 95.797 c 34.613 94.394 32.336 94.394 30.934 
95.797 c 29.527 97.199 29.527 99.472 30.934 100.879 c h
18.945 104.137 m 20.352 105.539 22.625 105.539 24.027 104.137 c 25.43 
102.73 25.434 100.457 24.027 99.054 c 22.625 97.648 20.348 97.652 
18.945 99.054 c 17.543 100.457 17.543 102.73 18.945 104.137 c h
32.715 88.121 m 34.117 89.523 36.395 89.523 37.797 88.121 c 39.199 
86.715 39.199 84.441 37.797 83.035 c 36.395 81.633 34.117 81.633 32.715 
83.035 c 31.312 84.441 31.312 86.715 32.715 88.121 c h
20.117 90.062 m 21.523 91.465 23.797 91.469 25.203 90.062 c 26.605 
88.66 26.605 86.383 25.199 84.98 c 23.797 83.578 21.523 83.578 20.117 
84.98 c 18.715 86.387 18.715 88.66 20.117 90.062 c h
8.129 93.32 m 9.535 94.722 11.809 94.722 13.211 93.32 c 14.617 91.918 
14.617 89.64 13.211 88.238 c 11.812 86.836 9.535 86.836 8.129 88.238 c 
6.727 89.644 6.73 91.918 8.129 93.32 c h
21.898 77.304 m 23.305 78.707 25.578 78.707 26.98 77.304 c 28.383 
75.902 28.387 73.629 26.984 72.222 c 25.578 70.82 23.301 70.82 21.898 
72.222 c 20.496 73.625 20.496 75.902 21.898 77.304 c h
9.301 79.25 m 10.707 80.652 12.984 80.652 14.387 79.25 c 15.789 77.847 
15.789 75.57 14.387 74.164 c 12.98 72.762 10.707 72.762 9.301 74.168 c 
7.898 75.57 7.902 77.844 9.301 79.25 c h
23.074 63.234 m 24.477 64.637 26.75 64.637 28.156 63.234 c 29.559 
61.828 29.559 59.554 28.156 58.152 c 26.75 56.75 24.477 56.746 23.074 
58.152 c 21.668 59.554 21.668 61.828 23.074 63.234 c h
11.086 66.492 m 12.492 67.894 14.766 67.894 16.168 66.492 c 17.57 
65.086 17.57 62.812 16.168 61.41 c 14.766 60.004 12.492 60.004 11.086 
61.41 c 9.68 62.812 9.68 65.086 11.086 66.492 c h
24.129 51.195 m 25.535 52.597 27.809 52.597 29.211 51.195 c 30.617 
49.793 30.617 47.519 29.215 46.113 c 27.809 44.711 25.535 44.711 24.129 
46.113 c 22.727 47.519 22.727 49.793 24.129 51.195 c h
12.258 52.418 m 13.66 53.82 15.938 53.82 17.34 52.418 c 18.746 51.015 
18.742 48.742 17.34 47.336 c 15.938 45.933 13.66 45.933 12.258 47.336 c 
10.855 48.738 10.855 51.015 12.258 52.418 c h
43.562 16.75 m 42.16 15.347 39.883 15.347 38.48 16.75 c 37.074 18.152 
37.078 20.429 38.48 21.832 c 39.883 23.234 42.16 23.234 43.562 21.832 c 
44.965 20.426 44.965 18.152 43.562 16.75 c h
30.387 32.043 m 28.984 30.64 26.707 30.637 25.301 32.043 c 23.898 
33.445 23.902 35.722 25.301 37.125 c 26.707 38.527 28.984 38.527 30.387 
37.125 c 31.789 35.722 31.789 33.445 30.387 32.043 c h
56.973 15.504 m 55.57 14.101 53.297 14.097 51.895 15.504 c 50.488 
16.906 50.488 19.183 51.895 20.586 c 53.297 21.988 55.57 21.988 56.973 
20.586 c 58.379 19.183 58.379 16.906 56.973 15.504 c h
68.961 12.246 m 67.559 10.844 65.285 10.844 63.879 12.246 c 62.477 
13.648 62.477 15.926 63.879 17.328 c 65.285 18.73 67.559 18.73 68.961 
17.328 c 70.367 15.926 70.363 13.648 68.961 12.246 c h
80.965 11.023 m 79.562 9.621 77.285 9.621 75.883 11.023 c 74.48 12.426 
74.48 14.703 75.883 16.105 c 77.285 17.512 79.562 17.512 80.965 16.105 
c 82.371 14.703 82.367 12.426 80.965 11.023 c h
92.953 7.765 m 91.551 6.363 89.273 6.363 87.871 7.765 c 86.469 9.172 
86.469 11.445 87.871 12.851 c 89.273 14.254 91.551 14.254 92.953 12.847 
c 94.355 11.445 94.355 9.168 92.953 7.765 c h
79.777 23.058 m 78.371 21.656 76.098 21.656 74.695 23.058 c 73.289 
24.465 73.289 26.738 74.695 28.144 c 76.098 29.547 78.371 29.547 79.777 
28.14 c 81.18 26.738 81.18 24.465 79.777 23.058 c h
91.781 21.84 m 90.379 20.437 88.102 20.433 86.699 21.84 c 85.293 23.242 
85.297 25.519 86.699 26.922 c 88.102 28.324 90.375 28.324 91.781 26.922 
c 93.184 25.515 93.184 23.242 91.781 21.84 c h
103.77 18.582 m 102.363 17.179 100.09 17.176 98.684 18.582 c 97.281 
19.984 97.281 22.262 98.688 23.664 c 100.09 25.066 102.363 25.066 
103.77 23.664 c 105.168 22.258 105.168 19.984 103.77 18.582 c h
90.594 33.875 m 89.188 32.472 86.914 32.469 85.508 33.875 c 84.105 
35.277 84.105 37.554 85.512 38.957 c 86.914 40.359 89.191 40.359 90.594 
38.957 c 91.996 37.554 91.996 35.277 90.594 33.875 c h
102.594 32.652 m 101.191 31.25 98.918 31.25 97.512 32.652 c 96.109 
34.054 96.109 36.332 97.512 37.734 c 98.918 39.137 101.191 39.14 
102.594 37.734 c 103.996 36.332 104 34.058 102.594 32.652 c h
114.582 29.394 m 113.18 27.992 110.902 27.992 109.5 29.394 c 108.098 
30.797 108.098 33.074 109.5 34.476 c 110.902 35.883 113.18 35.883 
114.582 34.476 c 115.984 33.074 115.984 30.797 114.582 29.394 c h
101.406 44.687 m 100 43.285 97.727 43.285 96.324 44.687 c 94.918 46.094 
94.918 48.367 96.324 49.769 c 97.727 51.176 100.004 51.176 101.406 
49.769 c 102.809 48.367 102.809 46.094 101.406 44.687 c h
113.41 43.469 m 112.004 42.062 109.73 42.062 108.328 43.469 c 106.922 
44.871 106.926 47.148 108.328 48.551 c 109.73 49.953 112.008 49.953 
113.41 48.551 c 114.812 47.144 114.812 44.871 113.41 43.469 c h
125.395 40.211 m 123.992 38.804 121.715 38.804 120.316 40.211 c 118.91 
41.613 118.91 43.89 120.316 45.293 c 121.715 46.695 123.992 46.695 
125.395 45.293 c 126.801 43.89 126.801 41.613 125.395 40.211 c h
112.219 55.504 m 110.816 54.101 108.543 54.097 107.137 55.504 c 105.734 
56.906 105.734 59.183 107.137 60.586 c 108.539 61.988 110.82 61.988 
112.219 60.586 c 113.625 59.183 113.625 56.906 112.219 55.504 c h
124.227 54.281 m 122.82 52.879 120.547 52.879 119.141 54.281 c 117.738 
55.683 117.738 57.961 119.141 59.363 c 120.547 60.765 122.82 60.765 
124.227 59.363 c 125.629 57.961 125.629 55.687 124.227 54.281 c h
136.211 51.023 m 134.809 49.621 132.531 49.621 131.129 51.023 c 129.723 
52.426 129.727 54.703 131.129 56.105 c 132.531 57.512 134.809 57.508 
136.211 56.105 c 137.613 54.703 137.613 52.426 136.211 51.023 c h
123.035 66.32 m 121.629 64.914 119.355 64.914 117.949 66.316 c 116.547 
67.722 116.551 69.996 117.953 71.398 c 119.355 72.801 121.629 72.801 
123.035 71.398 c 124.438 69.996 124.438 67.722 123.035 66.32 c h
135.039 65.097 m 133.633 63.691 131.359 63.691 129.957 65.097 c 128.551 
66.5 128.551 68.773 129.957 70.179 c 131.359 71.582 133.637 71.582 
135.039 70.179 c 136.441 68.777 136.441 66.5 135.039 65.097 c h
147.023 61.84 m 145.621 60.433 143.348 60.433 141.945 61.84 c 140.539 
63.242 140.539 65.519 141.945 66.922 c 143.348 68.324 145.621 68.324 
147.027 66.922 c 148.43 65.515 148.43 63.242 147.023 61.84 c h
133.848 77.133 m 132.445 75.73 130.168 75.73 128.766 77.133 c 127.363 
78.535 127.363 80.812 128.766 82.215 c 130.168 83.617 132.445 83.617 
133.848 82.215 c 135.25 80.812 135.25 78.535 133.848 77.133 c h
145.852 75.91 m 144.449 74.508 142.176 74.508 140.77 75.91 c 139.367 
77.312 139.367 79.59 140.77 80.992 c 142.176 82.398 144.449 82.398 
145.852 80.992 c 147.258 79.59 147.258 77.312 145.852 75.91 c h
157.84 72.652 m 156.434 71.25 154.16 71.25 152.758 72.652 c 151.355 
74.054 151.355 76.332 152.758 77.734 c 154.16 79.137 156.434 79.137 
157.84 77.734 c 159.242 76.332 159.242 74.054 157.84 72.652 c h
144.664 87.949 m 143.262 86.543 140.984 86.543 139.582 87.945 c 138.176 
89.351 138.176 91.625 139.582 93.031 c 140.984 94.433 143.262 94.433 
144.66 93.027 c 146.066 91.625 146.066 89.351 144.664 87.949 c h
130.078 103.265 m 128.676 101.859 126.398 101.859 124.996 103.265 c 
123.59 104.668 123.59 106.941 124.996 108.347 c 126.398 109.75 128.676 
109.75 130.078 108.347 c 131.48 106.941 131.48 104.668 130.078 103.265 
c h
116.902 118.558 m 115.496 117.156 113.223 117.156 111.82 118.558 c 
110.418 119.961 110.418 122.238 111.816 123.64 c 113.223 125.043 
115.496 125.043 116.902 123.64 c 118.305 122.238 118.305 119.961 
116.902 118.558 c h
103.855 133.851 m 102.453 132.449 100.18 132.449 98.773 133.851 c 
97.371 135.258 97.371 137.531 98.77 138.933 c 100.176 140.34 102.453 
140.336 103.852 138.933 c 105.258 137.527 105.258 135.258 103.855 
133.851 c h
90.086 149.867 m 88.684 148.465 86.41 148.465 85.004 149.867 c 83.602 
151.273 83.602 153.547 85.004 154.949 c 86.41 156.355 88.684 156.355 
90.086 154.949 c 91.492 153.547 91.492 151.269 90.086 149.867 c h
290.758 215.734 m 227.945 152.926 l 227.828 152.808 l 165.02 89.996 l 
89.996 165.023 l 152.922 227.949 l 215.734 290.758 l h
225.801 290.668 m 224.398 292.07 224.398 294.344 225.801 295.75 c 
227.207 297.152 229.48 297.152 230.883 295.75 c 232.289 294.344 232.289 
292.07 230.887 290.668 c 229.48 289.262 227.207 289.262 225.801 290.668 
c h
241.82 276.898 m 240.418 278.301 240.414 280.578 241.82 281.98 c 
243.223 283.383 245.5 283.383 246.902 281.98 c 248.305 280.578 248.305 
278.301 246.902 276.898 c 245.496 275.492 243.223 275.496 241.82 
276.898 c h
257.113 263.851 m 255.711 265.254 255.711 267.531 257.113 268.933 c 
258.516 270.336 260.793 270.336 262.195 268.933 c 263.598 267.531 
263.598 265.258 262.195 263.851 c 260.793 262.449 258.516 262.449 
257.113 263.851 c h
272.406 255.758 m 273.809 257.16 276.086 257.16 277.488 255.758 c 
278.895 254.355 278.891 252.078 277.488 250.676 c 276.086 249.273 
273.809 249.273 272.406 250.676 c 271.004 252.078 271.004 254.355 
272.406 255.758 c h
287.727 236.09 m 286.32 237.492 286.32 239.769 287.723 241.172 c 
289.129 242.578 291.406 242.574 292.805 241.172 c 294.211 239.769 
294.211 237.492 292.805 236.09 c 291.402 234.687 289.129 234.687 
287.727 236.09 c h
308.098 222.914 m 306.695 221.512 304.422 221.512 303.02 222.914 c 
301.613 224.316 301.613 226.59 303.016 227.996 c 304.418 229.398 
306.699 229.398 308.102 227.996 c 309.504 226.594 309.504 224.316 
308.098 222.914 c h
304.844 234.902 m 303.441 233.496 301.164 233.496 299.762 234.902 c 
298.355 236.304 298.355 238.578 299.762 239.984 c 301.164 241.387 
303.441 241.387 304.844 239.984 c 306.246 238.578 306.246 236.304 
304.844 234.902 c h
298.539 246.906 m 297.137 248.308 297.137 250.582 298.539 251.988 c 
299.941 253.39 302.219 253.39 303.621 251.988 c 305.023 250.582 305.023 
248.308 303.621 246.906 c 302.219 245.5 299.945 245.5 298.539 246.906 c 
h
318.914 233.726 m 317.512 232.324 315.234 232.324 313.832 233.726 c 
312.426 235.129 312.426 237.406 313.832 238.808 c 315.238 240.215 
317.512 240.211 318.914 238.808 c 320.32 237.406 320.32 235.133 318.914 
233.726 c h
315.656 245.715 m 314.254 244.312 311.98 244.312 310.578 245.715 c 
309.172 247.117 309.172 249.394 310.574 250.797 c 311.98 252.199 
314.254 252.199 315.656 250.797 c 317.059 249.394 317.059 247.117 
315.656 245.715 c h
309.352 257.719 m 307.953 259.121 307.949 261.398 309.352 262.801 c 
310.758 264.203 313.031 264.203 314.438 262.801 c 315.84 261.398 315.84 
259.121 314.434 257.719 c 313.031 256.316 310.758 256.316 309.352 
257.719 c h
329.73 244.543 m 328.324 243.14 326.051 243.14 324.648 244.543 c 
323.246 245.945 323.242 248.222 324.645 249.625 c 326.051 251.027 
328.328 251.027 329.73 249.625 c 331.133 248.222 331.133 245.945 329.73 
244.543 c h
326.473 256.531 m 325.066 255.125 322.793 255.125 321.387 256.527 c 
319.984 257.929 319.984 260.207 321.391 261.613 c 322.793 263.015 
325.066 263.015 326.473 261.609 c 327.875 260.207 327.875 257.933 
326.473 256.531 c h
320.168 268.531 m 318.762 269.933 318.762 272.211 320.168 273.617 c 
321.57 275.019 323.848 275.019 325.25 273.617 c 326.652 272.211 326.652 
269.937 325.25 268.535 c 323.848 267.129 321.57 267.129 320.168 268.531 
c h
340.543 255.355 m 339.141 253.953 336.863 253.953 335.461 255.355 c 
334.059 256.758 334.059 259.035 335.461 260.437 c 336.863 261.844 
339.141 261.844 340.543 260.437 c 341.945 259.035 341.949 256.762 
340.543 255.355 c h
337.285 267.344 m 335.883 265.941 333.605 265.941 332.203 267.344 c 
330.801 268.746 330.801 271.023 332.203 272.426 c 333.605 273.828 
335.883 273.828 337.285 272.426 c 338.688 271.023 338.688 268.746 
337.285 267.344 c h
330.984 279.347 m 329.578 280.75 329.578 283.027 330.98 284.429 c 
332.387 285.836 334.664 285.832 336.062 284.429 c 337.469 283.027 
337.469 280.754 336.062 279.347 c 334.66 277.945 332.387 277.945 
330.984 279.347 c h
351.359 266.172 m 349.957 264.769 347.68 264.765 346.277 266.168 c 
344.871 267.574 344.871 269.851 346.277 271.254 c 347.68 272.656 
349.957 272.656 351.359 271.254 c 352.762 269.851 352.762 267.574 
351.359 266.172 c h
348.098 278.16 m 346.695 276.754 344.422 276.754 343.02 278.156 c 
341.613 279.562 341.613 281.836 343.02 283.242 c 344.422 284.644 
346.695 284.644 348.098 283.238 c 349.504 281.836 349.504 279.562 
348.098 278.16 c h
341.793 290.16 m 340.395 291.566 340.395 293.84 341.793 295.242 c 
343.199 296.648 345.473 296.648 346.879 295.246 c 348.281 293.84 
348.281 291.566 346.875 290.16 c 345.473 288.758 343.199 288.758 
341.793 290.16 c h
362.172 276.984 m 360.77 275.582 358.492 275.582 357.09 276.984 c 
355.688 278.387 355.688 280.664 357.09 282.066 c 358.492 283.469 360.77 
283.469 362.172 282.066 c 363.578 280.664 363.574 278.387 362.172 
276.984 c h
358.914 288.972 m 357.512 287.57 355.238 287.57 353.832 288.972 c 
352.43 290.379 352.43 292.652 353.832 294.054 c 355.234 295.457 357.512 
295.457 358.914 294.054 c 360.316 292.652 360.316 290.375 358.914 
288.972 c h
352.609 300.976 m 351.207 302.379 351.207 304.656 352.609 306.058 c 
354.016 307.461 356.289 307.461 357.691 306.058 c 359.098 304.656 
359.098 302.379 357.695 300.976 c 356.289 299.574 354.016 299.574 
352.609 300.976 c h
372.984 287.797 m 371.586 286.398 369.309 286.394 367.902 287.797 c 
366.504 289.203 366.504 291.48 367.902 292.883 c 369.309 294.285 
371.586 294.285 372.988 292.883 c 374.391 291.48 374.391 289.203 
372.984 287.797 c h
369.727 299.785 m 368.324 298.383 366.051 298.383 364.645 299.785 c 
363.242 301.191 363.242 303.465 364.645 304.867 c 366.051 306.273 
368.324 306.273 369.73 304.867 c 371.133 303.465 371.133 301.191 
369.727 299.785 c h
368.508 311.793 m 367.102 310.387 364.828 310.387 363.426 311.793 c 
362.02 313.195 362.02 315.469 363.426 316.871 c 364.828 318.277 367.105 
318.277 368.508 316.871 c 369.914 315.469 369.914 313.195 368.508 
311.793 c h
365.25 323.777 m 363.848 322.375 361.574 322.375 360.168 323.777 c 
358.766 325.183 358.766 327.457 360.168 328.859 c 361.57 330.262 
363.848 330.262 365.25 328.859 c 366.656 327.457 366.652 325.179 365.25 
323.777 c h
343.629 350.367 m 342.223 351.769 342.223 354.047 343.629 355.449 c 
345.031 356.851 347.305 356.851 348.711 355.449 c 350.113 354.047 
350.113 351.769 348.711 350.367 c 347.305 348.965 345.031 348.965 
343.629 350.367 c h
364.004 337.191 m 362.602 335.789 360.324 335.789 358.922 337.191 c 
357.52 338.594 357.52 340.867 358.922 342.273 c 360.324 343.676 362.598 
343.676 364.004 342.273 c 365.406 340.867 365.406 338.594 364.004 
337.191 c h
364.004 337.191 m f
Q Q
showpage
%%Trailer
count op_count sub {pop} repeat
countdictstack dict_count sub {end} repeat
cairo_eps_state restore
%%EOF
