%!PS-Adobe-3.0 EPSF-3.0
%%Creator: cairo 1.10.2 (http://cairographics.org)
%%CreationDate: Thu Jul 31 07:30:15 2014
%%Pages: 1
%%BoundingBox: 0 -1 385 385
%%DocumentData: Clean7Bit
%%LanguageLevel: 2
%%EndComments
%%BeginProlog
/cairo_eps_state save def
/dict_count countdictstack def
/op_count count 1 sub def
userdict begin
/q { gsave } bind def
/Q { grestore } bind def
/cm { 6 array astore concat } bind def
/w { setlinewidth } bind def
/J { setlinecap } bind def
/j { setlinejoin } bind def
/M { setmiterlimit } bind def
/d { setdash } bind def
/m { moveto } bind def
/l { lineto } bind def
/c { curveto } bind def
/h { closepath } bind def
/re { exch dup neg 3 1 roll 5 3 roll moveto 0 rlineto
      0 exch rlineto 0 rlineto closepath } bind def
/S { stroke } bind def
/f { fill } bind def
/f* { eofill } bind def
/n { newpath } bind def
/W { clip } bind def
/W* { eoclip } bind def
/BT { } bind def
/ET { } bind def
/pdfmark where { pop globaldict /?pdfmark /exec load put }
    { globaldict begin /?pdfmark /pop load def /pdfmark
    /cleartomark load def end } ifelse
/BDC { mark 3 1 roll /BDC pdfmark } bind def
/EMC { mark /EMC pdfmark } bind def
/cairo_store_point { /cairo_point_y exch def /cairo_point_x exch def } def
/Tj { show currentpoint cairo_store_point } bind def
/TJ {
  {
    dup
    type /stringtype eq
    { show } { -0.001 mul 0 cairo_font_matrix dtransform rmoveto } ifelse
  } forall
  currentpoint cairo_store_point
} bind def
/cairo_selectfont { cairo_font_matrix aload pop pop pop 0 0 6 array astore
    cairo_font exch selectfont cairo_point_x cairo_point_y moveto } bind def
/Tf { pop /cairo_font exch def /cairo_font_matrix where
      { pop cairo_selectfont } if } bind def
/Td { matrix translate cairo_font_matrix matrix concatmatrix dup
      /cairo_font_matrix exch def dup 4 get exch 5 get cairo_store_point
      /cairo_font where { pop cairo_selectfont } if } bind def
/Tm { 2 copy 8 2 roll 6 array astore /cairo_font_matrix exch def
      cairo_store_point /cairo_font where { pop cairo_selectfont } if } bind def
/g { setgray } bind def
/rg { setrgbcolor } bind def
/d1 { setcachedevice } bind def
%%EndProlog
%%Page: 1 1
%%BeginPageSetup
%%PageBoundingBox: 0 -1 385 385
%%EndPageSetup
q 0 -1 385 386 rectclip q
0 384.213 385 -385 re W n
0 g
327.945 327.947 m 291.664 364.232 243.422 384.213 192.105 384.213 c 
140.793 384.213 92.551 364.232 56.266 327.947 c 19.984 291.662 0 243.42 
0 192.107 c 0 140.791 19.984 92.553 56.266 56.267 c 92.551 19.982 
140.793 0.002 192.105 0.002 c 243.422 0.002 291.664 19.982 327.945 
56.267 c 364.23 92.549 384.215 140.791 384.215 192.107 c 384.215 243.42 
364.23 291.662 327.945 327.947 c h
297.957 66.81 m 297.953 75.139 297.945 81.314 297.938 83.326 c 297.977 
91.35 297.719 283.963 297.719 283.963 c 293.324 283.982 l 293.324 
283.982 257.469 263.748 257.469 113.701 c 285.023 106.135 273.43 76.033 
271.332 72.217 c 271.332 69.803 271.391 60.338 271.473 48.51 c 256.34 
40.115 239.754 34.041 222.191 30.775 c 222.199 65.201 222.203 107.92 
222.203 113.197 c 222.188 121.314 207.414 155.232 232.102 180.424 c 
232.117 180.463 232.176 180.529 232.211 180.58 c 238.234 186.287 
242.211 194.154 242.809 202.986 c 242.848 203.611 242.828 205.178 
242.828 205.178 c 234.379 278.432 l 226.594 278.439 l 228.902 196.807 l 
219.539 196.826 l 219.539 278.451 l 212.691 278.432 l 212.691 196.299 l 
204.934 196.299 l 204.926 278.439 l 197.387 278.432 l 197.375 196.299 l 
188.191 196.299 l 190.812 278.459 l 183.707 278.459 l 175.062 208.971 l 
175.062 208.971 174.848 206.353 174.848 205.361 c 174.848 194.646 
179.816 185.06 187.586 178.826 c 213.191 149.928 195.711 120.451 
195.711 113.443 c 195.727 108.76 195.73 63.275 195.73 28.045 c 194.523 
28.017 193.316 27.998 192.105 27.998 c 170.293 27.998 149.465 32.287 
130.406 40.049 c 130.406 114.033 l 124.301 130.537 118.613 159.158 
127.242 171.264 c 143.023 176.037 161.098 197.506 161.109 227.588 c 
161.109 257.428 144.953 284.877 116.277 285.342 c 116.277 285.361 l 
115.527 285.361 l 115.527 285.342 l 86.855 284.877 70.703 257.428 
70.703 227.588 c 70.695 197.506 88.789 176.037 104.559 171.264 c 
113.203 159.158 107.508 130.537 101.402 114.033 c 101.402 55.412 l 
57.195 84.846 28 135.127 28 192.107 c 28 282.596 101.617 356.213 
192.105 356.213 c 282.594 356.213 356.215 282.596 356.215 192.107 c 
356.215 141.924 333.562 96.939 297.957 66.81 c h
89.695 215.709 m 89.945 213.674 90.668 211.373 91.367 209.307 c 92.02 
207.15 92.805 205.021 93.652 202.978 c 95.266 198.857 97.008 195.037 
98.504 191.74 c 100.023 188.475 101.371 185.74 102.422 183.904 c 
103.426 182.017 104.336 181.213 104.402 181.287 c 104.422 181.193 
103.062 181.49 101.312 182.92 c 99.523 184.303 97.238 186.51 94.844 
189.416 c 92.414 192.314 89.898 195.912 87.527 200.045 c 86.379 202.123 
85.289 204.342 84.277 206.685 c 83.312 209.139 82.52 211.498 81.977 
214.287 c 80.984 219.658 81.152 224.791 81.711 229.514 c 82.234 234.232 
83.238 238.541 84.355 242.123 c 85.445 245.732 86.699 248.635 87.738 
250.611 c 88.754 252.627 89.578 253.58 89.578 253.58 c 89.578 253.58 
89.402 252.299 89.312 250.174 c 89.25 248.049 89.141 244.994 89.031 
241.35 c 88.945 234.162 88.352 224.389 89.695 215.709 c h
89.695 215.709 m f
Q Q
showpage
%%Trailer
count op_count sub {pop} repeat
countdictstack dict_count sub {end} repeat
cairo_eps_state restore
%%EOF
