%!PS-Adobe-3.0 EPSF-3.0
%%Creator: cairo 1.10.2 (http://cairographics.org)
%%CreationDate: Thu Jul 31 07:30:17 2014
%%Pages: 1
%%BoundingBox: 0 -1 388 388
%%DocumentData: Clean7Bit
%%LanguageLevel: 2
%%EndComments
%%BeginProlog
/cairo_eps_state save def
/dict_count countdictstack def
/op_count count 1 sub def
userdict begin
/q { gsave } bind def
/Q { grestore } bind def
/cm { 6 array astore concat } bind def
/w { setlinewidth } bind def
/J { setlinecap } bind def
/j { setlinejoin } bind def
/M { setmiterlimit } bind def
/d { setdash } bind def
/m { moveto } bind def
/l { lineto } bind def
/c { curveto } bind def
/h { closepath } bind def
/re { exch dup neg 3 1 roll 5 3 roll moveto 0 rlineto
      0 exch rlineto 0 rlineto closepath } bind def
/S { stroke } bind def
/f { fill } bind def
/f* { eofill } bind def
/n { newpath } bind def
/W { clip } bind def
/W* { eoclip } bind def
/BT { } bind def
/ET { } bind def
/pdfmark where { pop globaldict /?pdfmark /exec load put }
    { globaldict begin /?pdfmark /pop load def /pdfmark
    /cleartomark load def end } ifelse
/BDC { mark 3 1 roll /BDC pdfmark } bind def
/EMC { mark /EMC pdfmark } bind def
/cairo_store_point { /cairo_point_y exch def /cairo_point_x exch def } def
/Tj { show currentpoint cairo_store_point } bind def
/TJ {
  {
    dup
    type /stringtype eq
    { show } { -0.001 mul 0 cairo_font_matrix dtransform rmoveto } ifelse
  } forall
  currentpoint cairo_store_point
} bind def
/cairo_selectfont { cairo_font_matrix aload pop pop pop 0 0 6 array astore
    cairo_font exch selectfont cairo_point_x cairo_point_y moveto } bind def
/Tf { pop /cairo_font exch def /cairo_font_matrix where
      { pop cairo_selectfont } if } bind def
/Td { matrix translate cairo_font_matrix matrix concatmatrix dup
      /cairo_font_matrix exch def dup 4 get exch 5 get cairo_store_point
      /cairo_font where { pop cairo_selectfont } if } bind def
/Tm { 2 copy 8 2 roll 6 array astore /cairo_font_matrix exch def
      cairo_store_point /cairo_font where { pop cairo_selectfont } if } bind def
/g { setgray } bind def
/rg { setrgbcolor } bind def
/d1 { setcachedevice } bind def
%%EndProlog
%%Page: 1 1
%%BeginPageSetup
%%PageBoundingBox: 0 -1 388 388
%%EndPageSetup
q 0 -1 388 389 rectclip q
0 387.198 388 -388 re W n
0 g
193.602 387.198 m 86.68 387.198 0 300.523 0 193.597 c 0 86.679 86.68 
-0.001 193.602 -0.001 c 300.523 -0.001 387.203 86.679 387.203 193.597 c 
387.203 300.523 300.523 387.198 193.602 387.198 c h
241.117 160.405 m 246.578 154.941 302.234 98.456 302.234 98.456 c 
302.156 98.425 l 302.234 98.374 302.305 98.343 302.367 98.269 c 307.539 
93.144 307.539 84.796 302.367 79.694 c 297.273 74.558 288.895 74.558 
283.793 79.694 c 283.723 79.722 283.652 79.8 283.652 79.87 c 283.574 
79.87 l 283.574 79.87 220.426 143.027 214.156 149.323 c 213.141 150.343 
207.977 155.507 200.238 163.257 c 185.477 148.503 113.812 76.859 
113.812 76.859 c 113.797 76.874 l 113.75 76.827 113.727 76.741 113.648 
76.667 c 108.555 71.569 100.242 71.569 95.137 76.683 c 90.035 81.792 
90.016 90.077 95.129 95.194 c 95.203 95.273 95.281 95.296 95.348 95.359 
c 95.336 95.374 l 95.336 95.374 166.906 166.944 181.754 181.808 c 
139.441 224.202 70.961 292.874 70.961 292.874 c 74.004 295.956 l 74.004 
295.956 112.41 306.609 214.246 206.984 c 219.457 213.999 223.477 
223.222 224.234 235.648 c 223.156 245.437 226.379 255.612 233.875 
263.101 c 234.562 263.796 236.547 265.464 236.547 265.464 c 291.172 
308.023 l 296.148 303.042 l 236.871 247.437 l 243.301 241.015 l 300.734 
298.433 l 306.02 293.167 l 248.59 235.734 l 254.02 230.3 l 311.438 
287.73 l 316.238 282.964 l 259.152 225.878 l 265.699 219.319 l 321.16 
278.034 l 326.605 272.573 l 281.273 215.433 l 281.273 215.433 280.188 
214.331 279.727 213.929 c 273.137 208.163 264.852 205.441 256.641 
205.663 c 256.594 205.663 256.5 205.659 256.469 205.64 c 238.324 
205.456 226.035 196.155 217.586 186.476 c 217.934 170.112 237.734 
161.398 241.117 160.405 c h
241.117 160.405 m f
Q Q
showpage
%%Trailer
count op_count sub {pop} repeat
countdictstack dict_count sub {end} repeat
cairo_eps_state restore
%%EOF
