%!PS-Adobe-3.0 EPSF-3.0
%%Creator: cairo 1.10.2 (http://cairographics.org)
%%CreationDate: Thu Jul 31 07:30:18 2014
%%Pages: 1
%%BoundingBox: 0 -1 382 338
%%DocumentData: Clean7Bit
%%LanguageLevel: 2
%%EndComments
%%BeginProlog
/cairo_eps_state save def
/dict_count countdictstack def
/op_count count 1 sub def
userdict begin
/q { gsave } bind def
/Q { grestore } bind def
/cm { 6 array astore concat } bind def
/w { setlinewidth } bind def
/J { setlinecap } bind def
/j { setlinejoin } bind def
/M { setmiterlimit } bind def
/d { setdash } bind def
/m { moveto } bind def
/l { lineto } bind def
/c { curveto } bind def
/h { closepath } bind def
/re { exch dup neg 3 1 roll 5 3 roll moveto 0 rlineto
      0 exch rlineto 0 rlineto closepath } bind def
/S { stroke } bind def
/f { fill } bind def
/f* { eofill } bind def
/n { newpath } bind def
/W { clip } bind def
/W* { eoclip } bind def
/BT { } bind def
/ET { } bind def
/pdfmark where { pop globaldict /?pdfmark /exec load put }
    { globaldict begin /?pdfmark /pop load def /pdfmark
    /cleartomark load def end } ifelse
/BDC { mark 3 1 roll /BDC pdfmark } bind def
/EMC { mark /EMC pdfmark } bind def
/cairo_store_point { /cairo_point_y exch def /cairo_point_x exch def } def
/Tj { show currentpoint cairo_store_point } bind def
/TJ {
  {
    dup
    type /stringtype eq
    { show } { -0.001 mul 0 cairo_font_matrix dtransform rmoveto } ifelse
  } forall
  currentpoint cairo_store_point
} bind def
/cairo_selectfont { cairo_font_matrix aload pop pop pop 0 0 6 array astore
    cairo_font exch selectfont cairo_point_x cairo_point_y moveto } bind def
/Tf { pop /cairo_font exch def /cairo_font_matrix where
      { pop cairo_selectfont } if } bind def
/Td { matrix translate cairo_font_matrix matrix concatmatrix dup
      /cairo_font_matrix exch def dup 4 get exch 5 get cairo_store_point
      /cairo_font where { pop cairo_selectfont } if } bind def
/Tm { 2 copy 8 2 roll 6 array astore /cairo_font_matrix exch def
      cairo_store_point /cairo_font where { pop cairo_selectfont } if } bind def
/g { setgray } bind def
/rg { setrgbcolor } bind def
/d1 { setcachedevice } bind def
%%EndProlog
%%Page: 1 1
%%BeginPageSetup
%%PageBoundingBox: 0 -1 382 338
%%EndPageSetup
q 0 -1 382 339 rectclip q
0 337.548 382 -338 re W n
0 g
363.113 299.384 m 346.797 320.825 321.121 333.146 284.578 337.064 c 
281.617 337.368 278.496 337.548 275.285 337.548 c 242.887 337.548 
210.609 322.349 190.52 298.2 c 170.418 322.349 138.152 337.548 105.77 
337.548 c 102.559 337.548 99.453 337.364 96.438 337.064 c 59.949 
333.146 34.281 320.818 17.953 299.388 c 1.762 278.146 -3.516 249.345 
2.277 213.79 c 10.738 162.212 77.535 99.396 131.195 48.915 c 132.422 
47.763 l 147.367 33.681 160.277 21.536 168.684 12.486 c 169.82 11.216 
180.066 0.001 191.281 0.001 c 202.57 0.001 212.594 11.384 213.5 12.474 
c 222.441 22.165 236.938 35.9 251.262 49.443 c 304.324 99.782 370.371 
162.427 378.742 213.81 c 384.562 249.337 379.316 278.126 363.113 
299.384 c h
217.867 265.247 m 249.496 245.982 200.797 202.337 192.031 198.946 c 
189.098 198.611 185.66 200.946 185.434 202.845 c 180.82 219.907 188.957 
282.853 217.867 265.247 c h
202.426 69.224 m 178.617 69.224 l 119.098 69.224 95.699 175.13 126.895 
197.294 c 158.094 219.462 183.953 189.907 190.109 189.907 c 190.934 
189.907 l 197.09 189.907 222.949 219.462 254.148 197.294 c 285.344 
175.13 261.945 69.224 202.426 69.224 c h
202.426 69.224 m f
Q Q
showpage
%%Trailer
count op_count sub {pop} repeat
countdictstack dict_count sub {end} repeat
cairo_eps_state restore
%%EOF
