%!PS-Adobe-3.0 EPSF-3.0
%%Creator: cairo 1.10.2 (http://cairographics.org)
%%CreationDate: Thu Jul 31 07:30:23 2014
%%Pages: 1
%%BoundingBox: 0 -1 391 371
%%DocumentData: Clean7Bit
%%LanguageLevel: 2
%%EndComments
%%BeginProlog
/cairo_eps_state save def
/dict_count countdictstack def
/op_count count 1 sub def
userdict begin
/q { gsave } bind def
/Q { grestore } bind def
/cm { 6 array astore concat } bind def
/w { setlinewidth } bind def
/J { setlinecap } bind def
/j { setlinejoin } bind def
/M { setmiterlimit } bind def
/d { setdash } bind def
/m { moveto } bind def
/l { lineto } bind def
/c { curveto } bind def
/h { closepath } bind def
/re { exch dup neg 3 1 roll 5 3 roll moveto 0 rlineto
      0 exch rlineto 0 rlineto closepath } bind def
/S { stroke } bind def
/f { fill } bind def
/f* { eofill } bind def
/n { newpath } bind def
/W { clip } bind def
/W* { eoclip } bind def
/BT { } bind def
/ET { } bind def
/pdfmark where { pop globaldict /?pdfmark /exec load put }
    { globaldict begin /?pdfmark /pop load def /pdfmark
    /cleartomark load def end } ifelse
/BDC { mark 3 1 roll /BDC pdfmark } bind def
/EMC { mark /EMC pdfmark } bind def
/cairo_store_point { /cairo_point_y exch def /cairo_point_x exch def } def
/Tj { show currentpoint cairo_store_point } bind def
/TJ {
  {
    dup
    type /stringtype eq
    { show } { -0.001 mul 0 cairo_font_matrix dtransform rmoveto } ifelse
  } forall
  currentpoint cairo_store_point
} bind def
/cairo_selectfont { cairo_font_matrix aload pop pop pop 0 0 6 array astore
    cairo_font exch selectfont cairo_point_x cairo_point_y moveto } bind def
/Tf { pop /cairo_font exch def /cairo_font_matrix where
      { pop cairo_selectfont } if } bind def
/Td { matrix translate cairo_font_matrix matrix concatmatrix dup
      /cairo_font_matrix exch def dup 4 get exch 5 get cairo_store_point
      /cairo_font where { pop cairo_selectfont } if } bind def
/Tm { 2 copy 8 2 roll 6 array astore /cairo_font_matrix exch def
      cairo_store_point /cairo_font where { pop cairo_selectfont } if } bind def
/g { setgray } bind def
/rg { setrgbcolor } bind def
/d1 { setcachedevice } bind def
%%EndProlog
%%Page: 1 1
%%BeginPageSetup
%%PageBoundingBox: 0 -1 391 371
%%EndPageSetup
q 0 -1 391 372 rectclip q
0 370.505 391 -371 re W n
0 g
322.891 136.076 m 293.254 136.076 268.062 117.126 258.73 90.685 c 
132.199 90.685 l 122.867 117.126 97.672 136.076 68.039 136.076 c 30.461 
136.076 0 105.615 0 68.037 c 0 30.462 30.461 0.001 68.039 0.001 c 
97.672 0.001 122.867 18.951 132.199 45.392 c 258.73 45.392 l 268.062 
18.951 293.254 0.001 322.891 0.001 c 360.469 0.001 390.93 30.462 390.93 
68.037 c 390.93 105.615 360.469 136.076 322.891 136.076 c h
322.891 136.076 m f
92.93 164.126 m 121.316 172.63 140.012 198.017 141.363 226.021 c 
262.566 262.337 l 279.094 239.689 308.668 228.767 337.059 237.275 c 
373.055 248.06 393.488 285.982 382.703 321.978 c 371.918 357.974 
333.996 378.408 298 367.626 c 269.613 359.119 250.918 333.732 249.566 
305.728 c 128.363 269.412 l 111.832 292.06 82.258 302.982 53.871 
294.474 c 17.875 283.689 -2.562 245.767 8.223 209.771 c 19.012 173.775 
56.934 153.337 92.93 164.126 c h
92.93 164.126 m f
Q Q
showpage
%%Trailer
count op_count sub {pop} repeat
countdictstack dict_count sub {end} repeat
cairo_eps_state restore
%%EOF
