%!PS-Adobe-3.0 EPSF-3.0
%%Creator: cairo 1.10.2 (http://cairographics.org)
%%CreationDate: Wed Jul 30 09:00:40 2014
%%Pages: 1
%%BoundingBox: 0 -1 329 386
%%DocumentData: Clean7Bit
%%LanguageLevel: 2
%%EndComments
%%BeginProlog
/cairo_eps_state save def
/dict_count countdictstack def
/op_count count 1 sub def
userdict begin
/q { gsave } bind def
/Q { grestore } bind def
/cm { 6 array astore concat } bind def
/w { setlinewidth } bind def
/J { setlinecap } bind def
/j { setlinejoin } bind def
/M { setmiterlimit } bind def
/d { setdash } bind def
/m { moveto } bind def
/l { lineto } bind def
/c { curveto } bind def
/h { closepath } bind def
/re { exch dup neg 3 1 roll 5 3 roll moveto 0 rlineto
      0 exch rlineto 0 rlineto closepath } bind def
/S { stroke } bind def
/f { fill } bind def
/f* { eofill } bind def
/n { newpath } bind def
/W { clip } bind def
/W* { eoclip } bind def
/BT { } bind def
/ET { } bind def
/pdfmark where { pop globaldict /?pdfmark /exec load put }
    { globaldict begin /?pdfmark /pop load def /pdfmark
    /cleartomark load def end } ifelse
/BDC { mark 3 1 roll /BDC pdfmark } bind def
/EMC { mark /EMC pdfmark } bind def
/cairo_store_point { /cairo_point_y exch def /cairo_point_x exch def } def
/Tj { show currentpoint cairo_store_point } bind def
/TJ {
  {
    dup
    type /stringtype eq
    { show } { -0.001 mul 0 cairo_font_matrix dtransform rmoveto } ifelse
  } forall
  currentpoint cairo_store_point
} bind def
/cairo_selectfont { cairo_font_matrix aload pop pop pop 0 0 6 array astore
    cairo_font exch selectfont cairo_point_x cairo_point_y moveto } bind def
/Tf { pop /cairo_font exch def /cairo_font_matrix where
      { pop cairo_selectfont } if } bind def
/Td { matrix translate cairo_font_matrix matrix concatmatrix dup
      /cairo_font_matrix exch def dup 4 get exch 5 get cairo_store_point
      /cairo_font where { pop cairo_selectfont } if } bind def
/Tm { 2 copy 8 2 roll 6 array astore /cairo_font_matrix exch def
      cairo_store_point /cairo_font where { pop cairo_selectfont } if } bind def
/g { setgray } bind def
/rg { setrgbcolor } bind def
/d1 { setcachedevice } bind def
%%EndProlog
%%Page: 1 1
%%BeginPageSetup
%%PageBoundingBox: 0 -1 329 386
%%EndPageSetup
q 0 -1 329 387 rectclip q
0 385.005 329 -386 re W n
0 g
238.059 220.161 m 201.766 245.95 171.68 211.567 164.52 211.567 c 
163.562 211.567 l 156.402 211.567 126.312 245.95 90.023 220.161 c 
53.727 194.376 80.949 71.169 150.191 71.169 c 177.891 71.169 l 247.133 
71.169 274.355 194.376 238.059 220.161 c h
238.059 220.161 m f
165.797 222.079 m 185.082 232.29 232.648 276.802 195.855 299.212 c 
162.223 319.692 152.754 246.47 158.125 226.618 c 163.492 222.645 
162.625 223.954 165.797 222.079 c h
165.797 222.079 m f
268.488 385.005 m 68.383 385.005 l 68.383 384.868 l 68.371 384.919 
68.367 384.958 68.367 384.958 c 0.035 316.642 l 0.02 316.642 l 0.02 
316.626 l 0 316.606 l 0 316.606 0.012 316.606 0.02 316.606 c 0.02 
59.575 l 0.02 26.727 26.746 0.001 59.594 0.001 c 268.484 0.001 l 
301.336 0.001 328.062 26.727 328.062 59.575 c 328.062 325.431 l 328.062 
358.278 301.336 385.005 268.488 385.005 c h
300.062 59.575 m 300.062 42.165 285.898 28.001 268.484 28.001 c 59.594 
28.001 l 42.184 28.001 28.02 42.165 28.02 59.575 c 28.02 288.833 l 
54.383 289.653 71.523 293.399 82.738 305.649 c 93.391 317.282 95.773 
333.942 96.266 357.005 c 268.484 357.005 l 285.898 357.005 300.062 
342.841 300.062 325.431 c h
300.062 59.575 m f
Q Q
showpage
%%Trailer
count op_count sub {pop} repeat
countdictstack dict_count sub {end} repeat
cairo_eps_state restore
%%EOF
