%!PS-Adobe-3.0 EPSF-3.0
%%Creator: cairo 1.10.2 (http://cairographics.org)
%%CreationDate: Fri Aug  1 07:20:04 2014
%%Pages: 1
%%BoundingBox: 0 -1 378 378
%%DocumentData: Clean7Bit
%%LanguageLevel: 2
%%EndComments
%%BeginProlog
/cairo_eps_state save def
/dict_count countdictstack def
/op_count count 1 sub def
userdict begin
/q { gsave } bind def
/Q { grestore } bind def
/cm { 6 array astore concat } bind def
/w { setlinewidth } bind def
/J { setlinecap } bind def
/j { setlinejoin } bind def
/M { setmiterlimit } bind def
/d { setdash } bind def
/m { moveto } bind def
/l { lineto } bind def
/c { curveto } bind def
/h { closepath } bind def
/re { exch dup neg 3 1 roll 5 3 roll moveto 0 rlineto
      0 exch rlineto 0 rlineto closepath } bind def
/S { stroke } bind def
/f { fill } bind def
/f* { eofill } bind def
/n { newpath } bind def
/W { clip } bind def
/W* { eoclip } bind def
/BT { } bind def
/ET { } bind def
/pdfmark where { pop globaldict /?pdfmark /exec load put }
    { globaldict begin /?pdfmark /pop load def /pdfmark
    /cleartomark load def end } ifelse
/BDC { mark 3 1 roll /BDC pdfmark } bind def
/EMC { mark /EMC pdfmark } bind def
/cairo_store_point { /cairo_point_y exch def /cairo_point_x exch def } def
/Tj { show currentpoint cairo_store_point } bind def
/TJ {
  {
    dup
    type /stringtype eq
    { show } { -0.001 mul 0 cairo_font_matrix dtransform rmoveto } ifelse
  } forall
  currentpoint cairo_store_point
} bind def
/cairo_selectfont { cairo_font_matrix aload pop pop pop 0 0 6 array astore
    cairo_font exch selectfont cairo_point_x cairo_point_y moveto } bind def
/Tf { pop /cairo_font exch def /cairo_font_matrix where
      { pop cairo_selectfont } if } bind def
/Td { matrix translate cairo_font_matrix matrix concatmatrix dup
      /cairo_font_matrix exch def dup 4 get exch 5 get cairo_store_point
      /cairo_font where { pop cairo_selectfont } if } bind def
/Tm { 2 copy 8 2 roll 6 array astore /cairo_font_matrix exch def
      cairo_store_point /cairo_font where { pop cairo_selectfont } if } bind def
/g { setgray } bind def
/rg { setrgbcolor } bind def
/d1 { setcachedevice } bind def
%%EndProlog
%%Page: 1 1
%%BeginPageSetup
%%PageBoundingBox: 0 -1 378 378
%%EndPageSetup
q 0 -1 378 379 rectclip q
0 377.539 378 -378 re W n
0 g
239.312 328.414 m 236.617 331.114 232.246 331.114 229.551 328.414 c 
39.156 138.02 l 36.457 135.325 36.457 130.954 39.156 128.254 c 128.258 
39.153 l 130.953 36.457 135.324 36.457 138.02 39.153 c 328.414 229.547 
l 331.109 232.247 331.109 236.618 328.414 239.313 c h
239.312 328.414 m f
28.648 117.75 m 26.812 119.586 24.105 120.239 21.637 119.438 c 19.168 
118.633 17.355 116.516 16.949 113.954 c 0.086 7.989 l -0.262 5.805 
0.461 3.586 2.023 2.024 c 3.586 0.457 5.805 -0.261 7.992 0.086 c 
113.953 16.946 l 116.516 17.356 118.637 19.164 119.438 21.633 c 120.238 
24.102 119.586 26.813 117.75 28.649 c h
28.648 117.75 m f
375.52 286.414 m 286.418 375.516 l 283.719 378.215 279.348 378.215 
276.652 375.516 c 249.016 347.883 l 246.32 345.188 246.32 340.813 
249.016 338.118 c 338.117 249.016 l 340.816 246.321 345.188 246.321 
347.883 249.016 c 375.52 276.653 l 378.215 279.348 378.215 283.719 
375.52 286.414 c h
375.52 286.414 m f
Q Q
showpage
%%Trailer
count op_count sub {pop} repeat
countdictstack dict_count sub {end} repeat
cairo_eps_state restore
%%EOF
