%!PS-Adobe-3.0 EPSF-3.0
%%Creator: cairo 1.10.2 (http://cairographics.org)
%%CreationDate: Thu Jul 31 07:30:22 2014
%%Pages: 1
%%BoundingBox: 0 -1 391 392
%%DocumentData: Clean7Bit
%%LanguageLevel: 2
%%EndComments
%%BeginProlog
/cairo_eps_state save def
/dict_count countdictstack def
/op_count count 1 sub def
userdict begin
/q { gsave } bind def
/Q { grestore } bind def
/cm { 6 array astore concat } bind def
/w { setlinewidth } bind def
/J { setlinecap } bind def
/j { setlinejoin } bind def
/M { setmiterlimit } bind def
/d { setdash } bind def
/m { moveto } bind def
/l { lineto } bind def
/c { curveto } bind def
/h { closepath } bind def
/re { exch dup neg 3 1 roll 5 3 roll moveto 0 rlineto
      0 exch rlineto 0 rlineto closepath } bind def
/S { stroke } bind def
/f { fill } bind def
/f* { eofill } bind def
/n { newpath } bind def
/W { clip } bind def
/W* { eoclip } bind def
/BT { } bind def
/ET { } bind def
/pdfmark where { pop globaldict /?pdfmark /exec load put }
    { globaldict begin /?pdfmark /pop load def /pdfmark
    /cleartomark load def end } ifelse
/BDC { mark 3 1 roll /BDC pdfmark } bind def
/EMC { mark /EMC pdfmark } bind def
/cairo_store_point { /cairo_point_y exch def /cairo_point_x exch def } def
/Tj { show currentpoint cairo_store_point } bind def
/TJ {
  {
    dup
    type /stringtype eq
    { show } { -0.001 mul 0 cairo_font_matrix dtransform rmoveto } ifelse
  } forall
  currentpoint cairo_store_point
} bind def
/cairo_selectfont { cairo_font_matrix aload pop pop pop 0 0 6 array astore
    cairo_font exch selectfont cairo_point_x cairo_point_y moveto } bind def
/Tf { pop /cairo_font exch def /cairo_font_matrix where
      { pop cairo_selectfont } if } bind def
/Td { matrix translate cairo_font_matrix matrix concatmatrix dup
      /cairo_font_matrix exch def dup 4 get exch 5 get cairo_store_point
      /cairo_font where { pop cairo_selectfont } if } bind def
/Tm { 2 copy 8 2 roll 6 array astore /cairo_font_matrix exch def
      cairo_store_point /cairo_font where { pop cairo_selectfont } if } bind def
/g { setgray } bind def
/rg { setrgbcolor } bind def
/d1 { setcachedevice } bind def
%%EndProlog
%%Page: 1 1
%%BeginPageSetup
%%PageBoundingBox: 0 -1 391 392
%%EndPageSetup
q 0 -1 391 393 rectclip q
0 391.071 391 -392 re W n
0 g
211.359 359.481 m 215.781 365.345 215.07 377.778 214.441 388.747 c 
214.414 389.22 214.391 389.681 214.363 390.153 c 208.164 390.743 
201.887 391.071 195.535 391.071 c 171.195 391.071 147.906 386.587 
126.41 378.458 c 141.742 371.091 165.48 358.407 191.863 339.665 c 
200.863 347.411 207.652 354.563 211.359 359.481 c h
211.359 359.481 m f
310.434 247.907 m 300.793 246.817 292.668 245.235 285.715 243.017 c 
318.945 185.001 331.902 111.704 335.07 58.602 c 367.992 92.142 388.898 
137.489 390.875 187.716 c 368.191 215.599 338.141 251.052 310.434 
247.907 c h
310.434 247.907 m f
112.887 297.985 m 136.234 302.845 158.172 314.595 175.66 327.001 c 
139.172 352.13 108.742 365.173 102.688 367.653 c 64.836 347.192 34.543 
314.587 16.922 275.083 c 39.828 284.208 64.633 288.852 89 293.376 c 
96.883 294.841 105.031 296.352 112.887 297.985 c h
112.887 297.985 m f
248.039 292.302 m 250.121 290.208 252.199 288.075 254.266 285.907 c 
261.883 277.911 268.793 269.165 275.129 259.911 c 284.359 263.395 
295.227 265.868 308.23 267.337 c 338.879 270.806 366.129 246.528 
389.516 219.802 c 384.5 260.317 367.125 296.985 341.23 325.907 c 
327.098 324.204 311.344 321.317 295.285 316.524 c 284.75 313.38 267.973 
304.829 248.039 292.302 c h
248.039 292.302 m f
222.309 191.321 m 230.332 218.485 239.621 238.067 257.617 250.778 c 
252.219 258.532 246.402 265.809 240.105 272.419 c 237.195 275.481 
234.246 278.434 231.293 281.337 c 159.078 232.184 60.164 141.895 51.172 
63.669 c 81.195 30.817 122.285 8.29 168.539 1.899 c 185.383 35.431 
201.234 103.599 210.66 144.142 c 215.184 163.61 219.094 180.427 222.309 
191.321 c h
222.309 191.321 m f
140.438 234.395 m 165.613 257.599 192.203 278.403 216.523 295.122 c 
208.414 302.294 200.285 308.907 192.301 314.97 c 172.102 299.786 
145.656 284.829 116.867 278.845 c 108.809 277.165 100.551 275.634 92.57 
274.149 c 61.82 268.438 32.301 262.911 7.477 249.059 c 2.645 232.044 0 
214.102 0 195.536 c 0 154.001 12.992 115.52 35.07 83.852 c 49.375 
140.489 98.441 195.7 140.438 234.395 c h
140.438 234.395 m f
233.363 306.29 m 256.629 321.122 276.684 331.376 289.695 335.259 c 
301.379 338.751 312.84 341.29 323.695 343.145 c 298.613 364.942 267.953 
380.474 234.105 387.247 c 234.859 373.591 235.184 358.599 226.969 
347.704 c 223.066 342.532 216.465 335.438 207.871 327.739 c 216.285 
321.192 224.836 314.048 233.363 306.29 c h
233.363 306.29 m f
241.062 185.782 m 238.008 175.442 234.16 158.884 229.703 139.712 c 
216.547 83.11 203.961 32.458 189.258 0.161 c 191.344 0.095 193.434 
0.001 195.535 0.001 c 241.105 0.001 282.996 15.63 316.242 41.767 c 
314.93 97.333 301.609 175.934 268.055 234.278 c 255.039 224.606 248.035 
209.392 241.062 185.782 c h
241.062 185.782 m f
Q Q
showpage
%%Trailer
count op_count sub {pop} repeat
countdictstack dict_count sub {end} repeat
cairo_eps_state restore
%%EOF
