%!PS-Adobe-3.0 EPSF-3.0
%%Creator: cairo 1.10.2 (http://cairographics.org)
%%CreationDate: Thu Jul 31 07:30:10 2014
%%Pages: 1
%%BoundingBox: 0 -1 380 309
%%DocumentData: Clean7Bit
%%LanguageLevel: 2
%%EndComments
%%BeginProlog
/cairo_eps_state save def
/dict_count countdictstack def
/op_count count 1 sub def
userdict begin
/q { gsave } bind def
/Q { grestore } bind def
/cm { 6 array astore concat } bind def
/w { setlinewidth } bind def
/J { setlinecap } bind def
/j { setlinejoin } bind def
/M { setmiterlimit } bind def
/d { setdash } bind def
/m { moveto } bind def
/l { lineto } bind def
/c { curveto } bind def
/h { closepath } bind def
/re { exch dup neg 3 1 roll 5 3 roll moveto 0 rlineto
      0 exch rlineto 0 rlineto closepath } bind def
/S { stroke } bind def
/f { fill } bind def
/f* { eofill } bind def
/n { newpath } bind def
/W { clip } bind def
/W* { eoclip } bind def
/BT { } bind def
/ET { } bind def
/pdfmark where { pop globaldict /?pdfmark /exec load put }
    { globaldict begin /?pdfmark /pop load def /pdfmark
    /cleartomark load def end } ifelse
/BDC { mark 3 1 roll /BDC pdfmark } bind def
/EMC { mark /EMC pdfmark } bind def
/cairo_store_point { /cairo_point_y exch def /cairo_point_x exch def } def
/Tj { show currentpoint cairo_store_point } bind def
/TJ {
  {
    dup
    type /stringtype eq
    { show } { -0.001 mul 0 cairo_font_matrix dtransform rmoveto } ifelse
  } forall
  currentpoint cairo_store_point
} bind def
/cairo_selectfont { cairo_font_matrix aload pop pop pop 0 0 6 array astore
    cairo_font exch selectfont cairo_point_x cairo_point_y moveto } bind def
/Tf { pop /cairo_font exch def /cairo_font_matrix where
      { pop cairo_selectfont } if } bind def
/Td { matrix translate cairo_font_matrix matrix concatmatrix dup
      /cairo_font_matrix exch def dup 4 get exch 5 get cairo_store_point
      /cairo_font where { pop cairo_selectfont } if } bind def
/Tm { 2 copy 8 2 roll 6 array astore /cairo_font_matrix exch def
      cairo_store_point /cairo_font where { pop cairo_selectfont } if } bind def
/g { setgray } bind def
/rg { setrgbcolor } bind def
/d1 { setcachedevice } bind def
%%EndProlog
%%Page: 1 1
%%BeginPageSetup
%%PageBoundingBox: 0 -1 380 309
%%EndPageSetup
q 0 -1 380 310 rectclip q
0 308.013 380 -309 re W n
0 g
89.203 306.642 m 64.551 302.982 55.043 297.689 35.457 276.716 c 13.512 
253.216 -0.605 215.689 0.02 179.954 c 0.02 141.181 12.285 106.485 
31.605 83.247 c 31.605 10.548 l 31.605 4.724 36.324 0.001 42.148 0.001 
c 127.594 0.001 l 133.418 0.001 138.141 4.72 138.141 10.548 c 138.141 
85.571 l 158.172 113.466 169.777 151.15 168.738 163.317 c 167.41 178.88 
151.281 203.005 131.727 197.181 c 115.754 192.423 106.23 170.216 96.289 
171.392 c 87.875 172.384 90.969 187.845 100.031 202.892 c 114.723 
227.278 173.27 192.849 178.781 238.919 c 184.293 284.985 144.914 
314.911 89.203 306.642 c h
117.047 77.47 m 117.047 21.091 l 52.695 21.091 l 52.695 77.47 l h
117.047 77.47 m f
343.594 276.716 m 324.012 297.692 314.5 302.982 289.848 306.642 c 
234.137 314.911 194.762 284.985 200.273 238.915 c 205.781 192.849 
264.328 227.278 279.023 202.892 c 288.082 187.845 291.176 172.384 
282.762 171.392 c 272.824 170.216 263.297 192.423 247.324 197.181 c 
227.773 203.005 211.641 178.88 210.312 163.317 c 209.273 151.138 
220.898 113.411 240.957 85.513 c 240.957 10.548 l 240.957 4.747 245.66 
0.044 251.461 0.044 c 336.902 0.044 l 342.703 0.044 347.406 4.747 
347.406 10.548 c 347.406 83.196 l 366.746 106.435 379.031 141.153 
379.031 179.954 c 379.656 215.689 365.539 253.216 343.594 276.716 c h
326.398 21.052 m 261.965 21.052 l 261.965 76.896 l 326.398 76.896 l h
326.398 21.052 m f
Q Q
showpage
%%Trailer
count op_count sub {pop} repeat
countdictstack dict_count sub {end} repeat
cairo_eps_state restore
%%EOF
