%!PS-Adobe-3.0 EPSF-3.0
%%Creator: cairo 1.10.2 (http://cairographics.org)
%%CreationDate: Thu Jul 31 07:30:13 2014
%%Pages: 1
%%BoundingBox: 0 -1 385 383
%%DocumentData: Clean7Bit
%%LanguageLevel: 2
%%EndComments
%%BeginProlog
/cairo_eps_state save def
/dict_count countdictstack def
/op_count count 1 sub def
userdict begin
/q { gsave } bind def
/Q { grestore } bind def
/cm { 6 array astore concat } bind def
/w { setlinewidth } bind def
/J { setlinecap } bind def
/j { setlinejoin } bind def
/M { setmiterlimit } bind def
/d { setdash } bind def
/m { moveto } bind def
/l { lineto } bind def
/c { curveto } bind def
/h { closepath } bind def
/re { exch dup neg 3 1 roll 5 3 roll moveto 0 rlineto
      0 exch rlineto 0 rlineto closepath } bind def
/S { stroke } bind def
/f { fill } bind def
/f* { eofill } bind def
/n { newpath } bind def
/W { clip } bind def
/W* { eoclip } bind def
/BT { } bind def
/ET { } bind def
/pdfmark where { pop globaldict /?pdfmark /exec load put }
    { globaldict begin /?pdfmark /pop load def /pdfmark
    /cleartomark load def end } ifelse
/BDC { mark 3 1 roll /BDC pdfmark } bind def
/EMC { mark /EMC pdfmark } bind def
/cairo_store_point { /cairo_point_y exch def /cairo_point_x exch def } def
/Tj { show currentpoint cairo_store_point } bind def
/TJ {
  {
    dup
    type /stringtype eq
    { show } { -0.001 mul 0 cairo_font_matrix dtransform rmoveto } ifelse
  } forall
  currentpoint cairo_store_point
} bind def
/cairo_selectfont { cairo_font_matrix aload pop pop pop 0 0 6 array astore
    cairo_font exch selectfont cairo_point_x cairo_point_y moveto } bind def
/Tf { pop /cairo_font exch def /cairo_font_matrix where
      { pop cairo_selectfont } if } bind def
/Td { matrix translate cairo_font_matrix matrix concatmatrix dup
      /cairo_font_matrix exch def dup 4 get exch 5 get cairo_store_point
      /cairo_font where { pop cairo_selectfont } if } bind def
/Tm { 2 copy 8 2 roll 6 array astore /cairo_font_matrix exch def
      cairo_store_point /cairo_font where { pop cairo_selectfont } if } bind def
/g { setgray } bind def
/rg { setrgbcolor } bind def
/d1 { setcachedevice } bind def
%%EndProlog
%%Page: 1 1
%%BeginPageSetup
%%PageBoundingBox: 0 -1 385 383
%%EndPageSetup
q 0 -1 385 384 rectclip q
0 382.048 386 -383 re W n
0 g
380.973 312.391 m 322.16 376.981 l 319.043 380.399 314.57 382.243 
309.977 382.032 c 75.039 382.032 l 70.438 382.243 65.973 380.403 62.859 
376.981 c 4.043 312.391 l -0.617 307.27 -1.324 299.68 2.316 293.79 c 
98.188 138.567 l 93.637 127.044 91.133 114.489 91.133 101.348 c 91.133 
45.376 136.508 0.001 192.484 0.001 c 192.535 0.001 l 248.512 0.001 
293.883 45.376 293.883 101.348 c 293.883 114.489 291.383 127.044 
286.832 138.567 c 382.703 293.79 l 386.34 299.68 385.637 307.27 380.973 
312.391 c h
251.379 299.059 m 192.625 202.696 l 192.598 202.696 192.566 202.696 
192.535 202.696 c 192.484 202.696 l 192.453 202.696 192.422 202.696 
192.391 202.696 c 133.641 299.059 l h
34.863 300.145 m 71.863 340.774 l 159.414 197.173 l 142.621 191.376 
127.828 181.294 116.344 168.227 c h
258.852 108.88 m 231.953 82.661 l 238.305 45.634 l 238.824 42.594 
237.574 39.528 235.082 37.716 c 233.672 36.692 232.004 36.169 230.324 
36.169 c 229.035 36.169 227.742 36.477 226.559 37.098 c 193.309 54.583 
l 160.055 37.098 l 157.328 35.665 154.023 35.903 151.531 37.716 c 
149.039 39.528 147.789 42.594 148.312 45.634 c 154.66 82.661 l 127.762 
108.88 l 125.555 111.032 124.758 114.247 125.711 117.18 c 126.664 
120.11 129.199 122.243 132.246 122.688 c 169.422 128.091 l 186.051 
161.778 l 187.41 164.54 190.227 166.29 193.309 166.29 c 196.387 166.29 
199.203 164.54 200.566 161.778 c 217.191 128.091 l 254.367 122.688 l 
257.418 122.243 259.953 120.11 260.902 117.18 c 261.852 114.247 261.059 
111.032 258.852 108.88 c h
268.676 168.231 m 257.191 181.294 242.398 191.38 225.605 197.173 c 
313.156 340.774 l 350.152 300.145 l h
268.676 168.231 m f
Q Q
showpage
%%Trailer
count op_count sub {pop} repeat
countdictstack dict_count sub {end} repeat
cairo_eps_state restore
%%EOF
