%!PS-Adobe-3.0 EPSF-3.0
%%Creator: cairo 1.10.2 (http://cairographics.org)
%%CreationDate: Thu Jul 31 07:30:21 2014
%%Pages: 1
%%BoundingBox: 0 -1 387 323
%%DocumentData: Clean7Bit
%%LanguageLevel: 2
%%EndComments
%%BeginProlog
/cairo_eps_state save def
/dict_count countdictstack def
/op_count count 1 sub def
userdict begin
/q { gsave } bind def
/Q { grestore } bind def
/cm { 6 array astore concat } bind def
/w { setlinewidth } bind def
/J { setlinecap } bind def
/j { setlinejoin } bind def
/M { setmiterlimit } bind def
/d { setdash } bind def
/m { moveto } bind def
/l { lineto } bind def
/c { curveto } bind def
/h { closepath } bind def
/re { exch dup neg 3 1 roll 5 3 roll moveto 0 rlineto
      0 exch rlineto 0 rlineto closepath } bind def
/S { stroke } bind def
/f { fill } bind def
/f* { eofill } bind def
/n { newpath } bind def
/W { clip } bind def
/W* { eoclip } bind def
/BT { } bind def
/ET { } bind def
/pdfmark where { pop globaldict /?pdfmark /exec load put }
    { globaldict begin /?pdfmark /pop load def /pdfmark
    /cleartomark load def end } ifelse
/BDC { mark 3 1 roll /BDC pdfmark } bind def
/EMC { mark /EMC pdfmark } bind def
/cairo_store_point { /cairo_point_y exch def /cairo_point_x exch def } def
/Tj { show currentpoint cairo_store_point } bind def
/TJ {
  {
    dup
    type /stringtype eq
    { show } { -0.001 mul 0 cairo_font_matrix dtransform rmoveto } ifelse
  } forall
  currentpoint cairo_store_point
} bind def
/cairo_selectfont { cairo_font_matrix aload pop pop pop 0 0 6 array astore
    cairo_font exch selectfont cairo_point_x cairo_point_y moveto } bind def
/Tf { pop /cairo_font exch def /cairo_font_matrix where
      { pop cairo_selectfont } if } bind def
/Td { matrix translate cairo_font_matrix matrix concatmatrix dup
      /cairo_font_matrix exch def dup 4 get exch 5 get cairo_store_point
      /cairo_font where { pop cairo_selectfont } if } bind def
/Tm { 2 copy 8 2 roll 6 array astore /cairo_font_matrix exch def
      cairo_store_point /cairo_font where { pop cairo_selectfont } if } bind def
/g { setgray } bind def
/rg { setrgbcolor } bind def
/d1 { setcachedevice } bind def
%%EndProlog
%%Page: 1 1
%%BeginPageSetup
%%PageBoundingBox: 0 -1 387 323
%%EndPageSetup
q 0 -1 387 324 rectclip q
0 322.643 387 -323 re W n
0 g
186.305 286.85 m 184.984 286.85 183.914 285.78 183.914 284.46 c 183.914 
280.342 l 183.914 279.018 184.984 277.948 186.305 277.948 c 187.629 
277.948 188.699 279.018 188.699 280.342 c 188.699 284.46 l 188.699 
285.78 187.629 286.85 186.305 286.85 c h
186.305 286.85 m f
128.832 225.991 m 123.383 225.991 l 122.289 225.991 121.398 225.104 
121.398 224.006 c 121.398 222.913 122.289 222.022 123.383 222.022 c 
128.832 222.022 l 129.93 222.022 130.82 222.913 130.82 224.006 c 
130.816 225.104 129.93 225.991 128.832 225.991 c h
128.832 225.991 m f
249.23 226.174 m 243.559 226.174 l 242.359 226.174 241.391 225.206 
241.391 224.006 c 241.391 222.811 242.359 221.839 243.559 221.839 c 
249.23 221.839 l 250.426 221.839 251.398 222.811 251.398 224.006 c 
251.398 225.206 250.426 226.174 249.23 226.174 c h
249.23 226.174 m f
143.504 267.721 m 142.57 268.655 141.055 268.655 140.121 267.721 c 
139.188 266.788 139.188 265.272 140.121 264.339 c 143.156 261.299 l 
143.625 260.835 144.238 260.6 144.848 260.6 c 145.461 260.6 146.074 
260.835 146.543 261.299 c 147.477 262.237 147.477 263.749 146.543 
264.682 c h
143.504 267.721 m f
229.105 267.721 m 225.547 264.163 l 224.609 263.229 224.609 261.71 
225.547 260.776 c 226.012 260.311 226.625 260.077 227.238 260.077 c 
227.852 260.077 228.461 260.311 228.93 260.776 c 232.488 264.339 l 
233.426 265.272 233.426 266.788 232.488 267.721 c 231.555 268.655 
230.039 268.655 229.105 267.721 c h
229.105 267.721 m f
363.008 277.245 m 359.293 305.491 342.684 322.643 317.609 322.643 c 
68.891 322.643 l 43.82 322.643 27.211 305.491 23.492 277.245 c 19.773 
249.003 0 45.397 0 45.397 c 0 20.323 20.324 -0.001 45.398 -0.001 c 
341.105 -0.001 l 366.176 -0.001 386.5 20.323 386.5 45.397 c 386.5 
45.397 366.727 249.003 363.008 277.245 c h
194.359 208.487 m 194.863 209.131 195.32 209.815 195.711 210.538 c 
204.379 221.577 226.375 250.264 223.18 253.444 c 220.664 255.94 201.441 
245.971 187.664 238.315 c 182.504 235.448 178.102 232.901 175.633 
231.46 c 174.988 231.143 174.387 230.772 173.793 230.374 c 173.672 
230.303 173.484 230.19 173.484 230.19 c 173.496 230.178 l 169.195 
227.151 166.535 222.03 167.023 216.405 c 167.281 213.417 168.398 210.71 
170.094 208.487 c 100.121 208.487 l 98.488 208.487 97.164 209.811 
97.164 211.444 c 97.164 260.596 137.152 300.585 186.305 300.585 c 
188.832 300.585 191.434 300.471 194.035 300.249 c 216.188 298.342 
236.719 288.26 251.848 271.858 c 267.066 255.362 275.445 233.905 
275.445 211.444 c 275.445 209.811 274.125 208.487 272.492 208.487 c h
194.359 208.487 m f
Q Q
showpage
%%Trailer
count op_count sub {pop} repeat
countdictstack dict_count sub {end} repeat
cairo_eps_state restore
%%EOF
