%!PS-Adobe-3.0 EPSF-3.0
%%Creator: cairo 1.10.2 (http://cairographics.org)
%%CreationDate: Thu Jul 31 07:30:07 2014
%%Pages: 1
%%BoundingBox: 0 -1 157 376
%%DocumentData: Clean7Bit
%%LanguageLevel: 2
%%EndComments
%%BeginProlog
/cairo_eps_state save def
/dict_count countdictstack def
/op_count count 1 sub def
userdict begin
/q { gsave } bind def
/Q { grestore } bind def
/cm { 6 array astore concat } bind def
/w { setlinewidth } bind def
/J { setlinecap } bind def
/j { setlinejoin } bind def
/M { setmiterlimit } bind def
/d { setdash } bind def
/m { moveto } bind def
/l { lineto } bind def
/c { curveto } bind def
/h { closepath } bind def
/re { exch dup neg 3 1 roll 5 3 roll moveto 0 rlineto
      0 exch rlineto 0 rlineto closepath } bind def
/S { stroke } bind def
/f { fill } bind def
/f* { eofill } bind def
/n { newpath } bind def
/W { clip } bind def
/W* { eoclip } bind def
/BT { } bind def
/ET { } bind def
/pdfmark where { pop globaldict /?pdfmark /exec load put }
    { globaldict begin /?pdfmark /pop load def /pdfmark
    /cleartomark load def end } ifelse
/BDC { mark 3 1 roll /BDC pdfmark } bind def
/EMC { mark /EMC pdfmark } bind def
/cairo_store_point { /cairo_point_y exch def /cairo_point_x exch def } def
/Tj { show currentpoint cairo_store_point } bind def
/TJ {
  {
    dup
    type /stringtype eq
    { show } { -0.001 mul 0 cairo_font_matrix dtransform rmoveto } ifelse
  } forall
  currentpoint cairo_store_point
} bind def
/cairo_selectfont { cairo_font_matrix aload pop pop pop 0 0 6 array astore
    cairo_font exch selectfont cairo_point_x cairo_point_y moveto } bind def
/Tf { pop /cairo_font exch def /cairo_font_matrix where
      { pop cairo_selectfont } if } bind def
/Td { matrix translate cairo_font_matrix matrix concatmatrix dup
      /cairo_font_matrix exch def dup 4 get exch 5 get cairo_store_point
      /cairo_font where { pop cairo_selectfont } if } bind def
/Tm { 2 copy 8 2 roll 6 array astore /cairo_font_matrix exch def
      cairo_store_point /cairo_font where { pop cairo_selectfont } if } bind def
/g { setgray } bind def
/rg { setrgbcolor } bind def
/d1 { setcachedevice } bind def
%%EndProlog
%%Page: 1 1
%%BeginPageSetup
%%PageBoundingBox: 0 -1 157 376
%%EndPageSetup
q 0 -1 157 377 rectclip q
0 375.593 157 -376 re W n
0 g
150.453 375.593 m 5.812 375.593 l 2.602 375.593 0 372.991 0 369.78 c 0 
366.565 2.602 363.964 5.812 363.964 c 65.504 363.964 l 64.496 361.624 
63.914 358.972 63.914 356.159 c 63.914 352.089 65.113 348.347 67.105 
345.413 c 65.113 342.476 63.914 338.733 63.914 334.663 c 63.914 330.425 
65.219 326.55 67.363 323.565 c 65.219 320.577 63.914 316.702 63.914 
312.464 c 63.914 308.394 65.113 304.651 67.105 301.718 c 65.113 298.78 
63.914 295.042 63.914 290.968 c 63.914 286.73 65.219 282.855 67.363 
279.87 c 65.219 276.882 63.914 273.007 63.914 268.769 c 63.914 264.698 
65.113 260.956 67.105 258.022 c 65.113 255.089 63.914 251.347 63.914 
247.272 c 63.914 243.034 65.219 239.163 67.363 236.175 c 65.219 233.19 
63.914 229.315 63.914 225.073 c 63.914 222.288 64.488 219.663 65.477 
217.335 c 62.816 216.187 60.359 214.687 58.168 212.897 c 55.074 212.897 
l 39.156 212.897 26.25 199.991 26.25 184.073 c 26.25 32.276 l 26.25 
16.358 39.156 3.452 55.074 3.452 c 55.074 3.452 69.332 -0.001 79.246 
-0.001 c 89.16 -0.001 101.191 3.452 101.191 3.452 c 117.109 3.452 
130.016 16.358 130.016 32.276 c 130.016 184.077 l 130.016 199.995 
117.109 212.901 101.191 212.901 c 98.098 212.901 l 95.906 214.69 93.449 
216.19 90.789 217.339 c 91.781 219.667 92.352 222.292 92.352 225.077 c 
92.352 229.315 91.047 233.19 88.906 236.179 c 91.047 239.163 92.352 
243.038 92.352 247.276 c 92.352 251.351 91.152 255.089 89.16 258.026 c 
91.152 260.96 92.352 264.702 92.352 268.772 c 92.352 273.011 91.047 
276.886 88.906 279.87 c 91.047 282.858 92.352 286.733 92.352 290.972 c 
92.352 295.046 91.152 298.784 89.16 301.722 c 91.152 304.655 92.352 
308.397 92.352 312.468 c 92.352 316.706 91.047 320.581 88.906 323.569 c 
91.047 326.554 92.352 330.429 92.352 334.667 c 92.352 338.737 91.152 
342.48 89.16 345.417 c 91.152 348.351 92.352 352.089 92.352 356.163 c 
92.352 358.976 91.77 361.628 90.762 363.968 c 150.453 363.968 l 153.664 
363.968 156.266 366.569 156.266 369.78 c 156.266 372.991 153.664 
375.593 150.453 375.593 c h
78.133 339.105 m 80.234 339.105 82.223 339.671 84.02 340.655 c 84.93 
338.96 85.48 336.886 85.48 334.667 c 85.48 332.21 84.809 329.925 83.719 
328.147 c 82.004 329.03 80.113 329.522 78.133 329.522 c 76.152 329.522 
74.262 329.03 72.547 328.147 c 71.457 329.929 70.785 332.21 70.785 
334.667 c 70.785 336.886 71.336 338.96 72.246 340.655 c 74.043 339.671 
76.031 339.105 78.133 339.105 c h
85.48 312.468 m 85.48 310.245 84.93 308.171 84.02 306.48 c 82.223 
307.46 80.234 308.026 78.133 308.026 c 76.031 308.026 74.043 307.464 
72.246 306.48 c 71.336 308.171 70.789 310.245 70.789 312.468 c 70.789 
314.921 71.457 317.206 72.547 318.987 c 74.262 318.105 76.152 317.612 
78.133 317.612 c 80.117 317.612 82.004 318.105 83.723 318.987 c 84.812 
317.206 85.48 314.921 85.48 312.468 c h
85.48 290.972 m 85.48 288.515 84.812 286.233 83.723 284.452 c 82.004 
285.335 80.117 285.827 78.133 285.827 c 76.152 285.827 74.262 285.335 
72.547 284.452 c 71.457 286.233 70.789 288.515 70.789 290.972 c 70.789 
293.19 71.336 295.265 72.246 296.96 c 74.043 295.976 76.031 295.413 
78.133 295.413 c 80.234 295.413 82.223 295.976 84.02 296.96 c 84.93 
295.265 85.48 293.19 85.48 290.972 c h
85.48 268.772 m 85.48 266.554 84.93 264.48 84.02 262.784 c 82.223 
263.769 80.234 264.331 78.133 264.331 c 76.031 264.331 74.043 263.769 
72.246 262.784 c 71.336 264.48 70.789 266.554 70.789 268.772 c 70.789 
271.226 71.457 273.511 72.547 275.292 c 74.262 274.409 76.152 273.917 
78.133 273.917 c 80.117 273.917 82.004 274.409 83.723 275.292 c 84.812 
273.511 85.48 271.226 85.48 268.772 c h
85.48 247.276 m 85.48 244.823 84.812 242.538 83.723 240.757 c 82.004 
241.64 80.117 242.132 78.133 242.132 c 76.152 242.132 74.262 241.64 
72.547 240.757 c 71.457 242.538 70.789 244.823 70.789 247.276 c 70.789 
249.499 71.336 251.569 72.246 253.265 c 74.043 252.284 76.031 251.718 
78.133 251.718 c 80.234 251.718 82.223 252.28 84.02 253.265 c 84.93 
251.569 85.48 249.499 85.48 247.276 c h
78.133 219.944 m 76.062 219.944 74.047 219.745 72.09 219.374 c 71.273 
221.015 70.785 222.983 70.785 225.077 c 70.785 227.534 71.453 229.819 
72.543 231.601 c 74.262 230.718 76.148 230.222 78.133 230.222 c 80.113 
230.222 82.004 230.718 83.719 231.601 c 84.809 229.819 85.477 227.534 
85.477 225.077 c 85.477 222.983 84.992 221.015 84.172 219.374 c 82.219 
219.745 80.203 219.944 78.133 219.944 c h
85.48 356.159 m 85.48 353.94 84.93 351.866 84.02 350.171 c 82.223 
351.155 80.234 351.722 78.133 351.722 c 76.031 351.722 74.043 351.155 
72.246 350.171 c 71.336 351.866 70.789 353.94 70.789 356.159 c 70.789 
359.257 71.844 362.081 73.477 363.964 c 82.789 363.964 l 84.422 362.081 
85.48 359.257 85.48 356.159 c h
85.48 356.159 m f
Q Q
showpage
%%Trailer
count op_count sub {pop} repeat
countdictstack dict_count sub {end} repeat
cairo_eps_state restore
%%EOF
