%!PS-Adobe-3.0 EPSF-3.0
%%Creator: cairo 1.10.2 (http://cairographics.org)
%%CreationDate: Wed Jul 30 08:47:39 2014
%%Pages: 1
%%BoundingBox: 0 -1 384 384
%%DocumentData: Clean7Bit
%%LanguageLevel: 2
%%EndComments
%%BeginProlog
/cairo_eps_state save def
/dict_count countdictstack def
/op_count count 1 sub def
userdict begin
/q { gsave } bind def
/Q { grestore } bind def
/cm { 6 array astore concat } bind def
/w { setlinewidth } bind def
/J { setlinecap } bind def
/j { setlinejoin } bind def
/M { setmiterlimit } bind def
/d { setdash } bind def
/m { moveto } bind def
/l { lineto } bind def
/c { curveto } bind def
/h { closepath } bind def
/re { exch dup neg 3 1 roll 5 3 roll moveto 0 rlineto
      0 exch rlineto 0 rlineto closepath } bind def
/S { stroke } bind def
/f { fill } bind def
/f* { eofill } bind def
/n { newpath } bind def
/W { clip } bind def
/W* { eoclip } bind def
/BT { } bind def
/ET { } bind def
/pdfmark where { pop globaldict /?pdfmark /exec load put }
    { globaldict begin /?pdfmark /pop load def /pdfmark
    /cleartomark load def end } ifelse
/BDC { mark 3 1 roll /BDC pdfmark } bind def
/EMC { mark /EMC pdfmark } bind def
/cairo_store_point { /cairo_point_y exch def /cairo_point_x exch def } def
/Tj { show currentpoint cairo_store_point } bind def
/TJ {
  {
    dup
    type /stringtype eq
    { show } { -0.001 mul 0 cairo_font_matrix dtransform rmoveto } ifelse
  } forall
  currentpoint cairo_store_point
} bind def
/cairo_selectfont { cairo_font_matrix aload pop pop pop 0 0 6 array astore
    cairo_font exch selectfont cairo_point_x cairo_point_y moveto } bind def
/Tf { pop /cairo_font exch def /cairo_font_matrix where
      { pop cairo_selectfont } if } bind def
/Td { matrix translate cairo_font_matrix matrix concatmatrix dup
      /cairo_font_matrix exch def dup 4 get exch 5 get cairo_store_point
      /cairo_font where { pop cairo_selectfont } if } bind def
/Tm { 2 copy 8 2 roll 6 array astore /cairo_font_matrix exch def
      cairo_store_point /cairo_font where { pop cairo_selectfont } if } bind def
/g { setgray } bind def
/rg { setrgbcolor } bind def
/d1 { setcachedevice } bind def
%%EndProlog
%%Page: 1 1
%%BeginPageSetup
%%PageBoundingBox: 0 -1 384 384
%%EndPageSetup
q 0 -1 384 385 rectclip q
0 383.058 384 -384 re W n
0 g
327.781 326.147 m 292.148 362.202 244.641 382.413 194.02 383.058 c 
193.961 383.058 193.898 383.058 193.836 383.058 c 193.68 383.058 
193.527 383.038 193.371 383.034 c 192.766 383.046 192.156 383.058 
191.547 383.058 c 190.57 383.058 189.594 383.046 188.621 383.019 c 
138.109 382.257 90.727 362.011 55.195 325.995 c 19.602 289.917 0 
242.155 0 191.511 c 0 140.804 19.645 92.999 55.312 56.909 c 90.949 
20.854 138.453 0.644 189.078 -0.001 c 189.141 -0.001 189.199 -0.001 
189.258 -0.001 c 189.414 -0.001 189.566 0.019 189.723 0.022 c 190.332 
0.015 190.938 -0.001 191.547 -0.001 c 192.527 -0.001 193.508 0.011 
194.48 0.038 c 244.992 0.8 292.367 21.05 327.898 57.061 c 363.492 93.14 
383.098 140.901 383.098 191.55 c 383.098 242.257 363.453 290.058 
327.781 326.147 c h
191.547 73.183 m 175.215 73.183 161.957 86.44 161.957 102.772 c 161.957 
119.108 175.215 132.366 191.547 132.366 c 207.883 132.366 221.141 
119.108 221.141 102.772 c 221.141 86.44 207.883 73.183 191.547 73.183 c 
h
191.547 205.55 m 134.879 205.55 88.773 159.444 88.773 102.772 c 88.773 
102.737 l 88.773 102.655 88.777 102.577 88.777 102.495 c 88.781 101.64 
88.793 100.788 88.812 99.936 c 88.828 99.495 88.848 99.054 88.863 
98.616 c 88.883 98.132 88.902 97.651 88.93 97.171 c 88.957 96.62 88.996 
96.073 89.031 95.526 c 89.055 95.183 89.078 94.835 89.109 94.487 c 
89.16 93.847 89.215 93.206 89.277 92.569 c 89.297 92.366 89.32 92.159 
89.34 91.956 c 90.641 79.464 94.184 67.436 99.785 56.378 c 56.527 
85.925 28 135.628 28 191.511 c 28 280.382 100.277 353.733 189.125 
355.022 c 189.191 355.022 189.258 355.026 189.328 355.026 c 190.062 
355.05 190.805 355.058 191.547 355.058 c 197.934 355.058 204.133 
354.253 210.055 352.737 c 241.086 344.698 264.555 316.944 266.227 
284.081 c 266.289 282.831 266.32 281.569 266.32 280.304 c 266.312 
239.081 232.773 205.55 191.547 205.55 c h
191.547 205.55 m f
191.547 309.874 m 175.215 309.874 161.957 296.62 161.957 280.284 c 
161.957 263.952 175.215 250.694 191.547 250.694 c 207.883 250.694 
221.141 263.952 221.141 280.284 c 221.141 296.62 207.883 309.874 
191.547 309.874 c h
191.547 309.874 m f
Q Q
showpage
%%Trailer
count op_count sub {pop} repeat
countdictstack dict_count sub {end} repeat
cairo_eps_state restore
%%EOF
