<?xml version="1.0" encoding="iso-8859-1"?>
<!-- Generator: Adobe Illustrator 16.0.0, SVG Export Plug-In . SVG Version: 6.00 Build 0)  -->
<!DOCTYPE svg PUBLIC "-//W3C//DTD SVG 1.1//EN" "http://www.w3.org/Graphics/SVG/1.1/DTD/svg11.dtd">
<svg version="1.1" xmlns="http://www.w3.org/2000/svg" xmlns:xlink="http://www.w3.org/1999/xlink" x="0px" y="0px" width="512px"
	 height="512px" viewBox="0 0 512 512" style="enable-background:new 0 0 512 512;" xml:space="preserve">
<g id="Guides_For_Artboard">
</g>
<g id="_x30_">
</g>
<g id="_x31_">
</g>
<g id="_x32_">
</g>
<g id="_x33_">
</g>
<g id="_x34_">
</g>
<g id="_x35_">
</g>
<g id="_x36_">
</g>
<g id="_x37_">
</g>
<g id="_x38_">
</g>
<g id="_x39_">
</g>
<g id="_x31_0">
</g>
<g id="_x31_1">
</g>
<g id="_x31_2">
</g>
<g id="_x31_3">
</g>
<g id="_x31_4">
</g>
<g id="_x31_5">
</g>
<g id="_x31_6">
</g>
<g id="_x31_7">
</g>
<g id="_x31_8">
</g>
<g id="_x31_9">
</g>
<g id="_x32_0">
</g>
<g id="_x32_1">
</g>
<g id="_x32_2">
</g>
<g id="_x32_3">
</g>
<g id="_x32_4">
</g>
<g id="_x32_5">
</g>
<g id="_x32_6">
</g>
<g id="_x32_7">
</g>
<g id="_x32_8">
</g>
<g id="_x32_9">
</g>
<g id="_x33_0">
</g>
<g id="_x33_1">
</g>
<g id="_x33_2">
</g>
<g id="_x33_3">
</g>
<g id="_x33_4">
</g>
<g id="_x33_5">
</g>
<g id="_x33_6">
</g>
<g id="_x33_7">
</g>
<g id="_x33_8">
</g>
<g id="_x33_9">
</g>
<g id="_x34_0">
</g>
<g id="_x34_1">
</g>
<g id="_x34_2">
</g>
<g id="_x34_3">
</g>
<g id="_x34_4">
</g>
<g id="_x34_5">
</g>
<g id="_x34_6">
</g>
<g id="_x34_7">
	<g>
		<path d="M130.596,65.207c-30.813,4.572-42.701,11.188-67.183,37.404c-27.431,29.377-45.077,76.285-44.296,120.953
			c0,48.467,15.333,91.836,39.48,120.885v90.875c0,7.281,5.902,13.184,13.183,13.184h106.803c7.281,0,13.183-5.902,13.183-13.184
			v-93.779c25.04-34.869,39.548-81.973,38.251-97.186c-1.661-19.449-21.825-49.605-46.266-42.328
			c-19.966,5.947-31.873,33.705-44.296,32.238c-10.518-1.242-6.654-20.568,4.674-39.375c18.365-30.484,91.549,12.553,98.438-45.033
			C249.458,92.277,200.237,54.871,130.596,65.207z M165.401,351.67v70.473H84.963V351.67H165.401z"/>
		<path d="M448.585,102.613c-24.479-26.219-36.368-32.832-67.182-37.406c-69.642-10.336-118.861,27.07-111.971,84.656
			c6.889,57.584,80.072,14.549,98.438,45.031c11.327,18.809,15.191,38.133,4.675,39.375c-12.424,1.469-24.332-26.289-44.296-32.236
			c-24.442-7.279-44.605,22.877-46.266,42.326c-1.298,15.225,13.231,62.383,38.303,97.26v93.705c0,7.252,5.879,13.131,13.13,13.131
			H440.22c7.251,0,13.13-5.879,13.13-13.131v-90.811c24.176-29.049,39.532-72.447,39.532-120.949
			C493.664,178.896,476.016,131.988,448.585,102.613z M427.09,422.195h-80.542v-69.807h80.542V422.195z"/>
	</g>
</g>
<g id="_x34_8">
</g>
<g id="_x34_9">
</g>
<g id="_x35_0">
</g>
<g id="_x35_1">
</g>
<g id="_x35_2">
</g>
<g id="_x35_3">
</g>
<g id="_x35_4">
</g>
<g id="_x35_5">
</g>
<g id="_x35_6">
</g>
<g id="_x35_7">
</g>
<g id="_x35_8">
</g>
<g id="_x35_9">
</g>
<g id="_x36_0">
</g>
<g id="_x36_1">
</g>
<g id="_x36_2">
</g>
<g id="_x36_3">
</g>
<g id="_x36_4">
</g>
<g id="_x36_5">
</g>
<g id="_x36_6">
</g>
<g id="_x36_7">
</g>
<g id="_x36_8">
</g>
<g id="_x36_9">
</g>
<g id="_x37_0">
</g>
</svg>
