%!PS-Adobe-3.0 EPSF-3.0
%%Creator: cairo 1.10.2 (http://cairographics.org)
%%CreationDate: Thu Jul 31 07:30:24 2014
%%Pages: 1
%%BoundingBox: 0 -1 350 387
%%DocumentData: Clean7Bit
%%LanguageLevel: 2
%%EndComments
%%BeginProlog
/cairo_eps_state save def
/dict_count countdictstack def
/op_count count 1 sub def
userdict begin
/q { gsave } bind def
/Q { grestore } bind def
/cm { 6 array astore concat } bind def
/w { setlinewidth } bind def
/J { setlinecap } bind def
/j { setlinejoin } bind def
/M { setmiterlimit } bind def
/d { setdash } bind def
/m { moveto } bind def
/l { lineto } bind def
/c { curveto } bind def
/h { closepath } bind def
/re { exch dup neg 3 1 roll 5 3 roll moveto 0 rlineto
      0 exch rlineto 0 rlineto closepath } bind def
/S { stroke } bind def
/f { fill } bind def
/f* { eofill } bind def
/n { newpath } bind def
/W { clip } bind def
/W* { eoclip } bind def
/BT { } bind def
/ET { } bind def
/pdfmark where { pop globaldict /?pdfmark /exec load put }
    { globaldict begin /?pdfmark /pop load def /pdfmark
    /cleartomark load def end } ifelse
/BDC { mark 3 1 roll /BDC pdfmark } bind def
/EMC { mark /EMC pdfmark } bind def
/cairo_store_point { /cairo_point_y exch def /cairo_point_x exch def } def
/Tj { show currentpoint cairo_store_point } bind def
/TJ {
  {
    dup
    type /stringtype eq
    { show } { -0.001 mul 0 cairo_font_matrix dtransform rmoveto } ifelse
  } forall
  currentpoint cairo_store_point
} bind def
/cairo_selectfont { cairo_font_matrix aload pop pop pop 0 0 6 array astore
    cairo_font exch selectfont cairo_point_x cairo_point_y moveto } bind def
/Tf { pop /cairo_font exch def /cairo_font_matrix where
      { pop cairo_selectfont } if } bind def
/Td { matrix translate cairo_font_matrix matrix concatmatrix dup
      /cairo_font_matrix exch def dup 4 get exch 5 get cairo_store_point
      /cairo_font where { pop cairo_selectfont } if } bind def
/Tm { 2 copy 8 2 roll 6 array astore /cairo_font_matrix exch def
      cairo_store_point /cairo_font where { pop cairo_selectfont } if } bind def
/g { setgray } bind def
/rg { setrgbcolor } bind def
/d1 { setcachedevice } bind def
%%EndProlog
%%Page: 1 1
%%BeginPageSetup
%%PageBoundingBox: 0 -1 350 387
%%EndPageSetup
q 0 -1 350 388 rectclip q
0 386.44 350 -387 re W n
0 g
176.062 319.674 m 176.062 282.799 146.172 252.905 109.297 252.905 c 
72.422 252.905 42.531 282.799 42.531 319.674 c 42.531 356.545 72.422 
386.44 109.297 386.44 c 146.172 386.44 176.062 356.545 176.062 319.674 
c h
176.062 319.674 m f
286.73 280.471 m 252.109 280.471 223.941 252.307 223.941 217.682 c 
223.941 207.667 226.312 198.194 230.5 189.784 c 198.145 157.733 l 
198.145 157.733 149.367 212.073 136.562 223.549 c 123.758 235.03 
104.691 242.792 85.246 242.792 c 46.871 242.792 13.949 214.362 8.305 
176.522 c 8.211 175.979 8.133 175.428 8.078 174.866 c 8.07 174.776 l 
7.836 172.956 7.676 171.26 7.578 169.608 c 0.086 21.034 l -0.426 15.647 
1.355 10.288 5 6.288 c 8.645 2.284 13.801 -0.001 19.219 -0.001 c 
126.688 -0.001 l 136.434 -0.001 144.641 7.299 145.773 16.983 c 153.547 
121.034 l 153.551 121.065 153.555 121.096 153.559 121.131 c 153.719 
122.573 l 153.719 122.573 185.715 93.327 196.992 93.327 c 204.266 
93.327 210.914 95.819 215.879 100.737 c 272.266 156.592 l 276.914 
155.495 281.75 154.893 286.73 154.893 c 321.352 154.893 349.52 183.061 
349.52 217.682 c 349.52 252.307 321.352 280.471 286.73 280.471 c h
286.73 200.463 m 277.234 200.463 269.508 208.186 269.508 217.682 c 
269.508 227.178 277.234 234.905 286.73 234.905 c 296.227 234.905 
303.949 227.178 303.949 217.682 c 303.949 208.186 296.227 200.463 
286.73 200.463 c h
286.73 200.463 m f
Q Q
showpage
%%Trailer
count op_count sub {pop} repeat
countdictstack dict_count sub {end} repeat
cairo_eps_state restore
%%EOF
