%!PS-Adobe-3.0 EPSF-3.0
%%Creator: cairo 1.10.2 (http://cairographics.org)
%%CreationDate: Wed Jul 30 08:47:27 2014
%%Pages: 1
%%BoundingBox: 0 -1 346 362
%%DocumentData: Clean7Bit
%%LanguageLevel: 2
%%EndComments
%%BeginProlog
/cairo_eps_state save def
/dict_count countdictstack def
/op_count count 1 sub def
userdict begin
/q { gsave } bind def
/Q { grestore } bind def
/cm { 6 array astore concat } bind def
/w { setlinewidth } bind def
/J { setlinecap } bind def
/j { setlinejoin } bind def
/M { setmiterlimit } bind def
/d { setdash } bind def
/m { moveto } bind def
/l { lineto } bind def
/c { curveto } bind def
/h { closepath } bind def
/re { exch dup neg 3 1 roll 5 3 roll moveto 0 rlineto
      0 exch rlineto 0 rlineto closepath } bind def
/S { stroke } bind def
/f { fill } bind def
/f* { eofill } bind def
/n { newpath } bind def
/W { clip } bind def
/W* { eoclip } bind def
/BT { } bind def
/ET { } bind def
/pdfmark where { pop globaldict /?pdfmark /exec load put }
    { globaldict begin /?pdfmark /pop load def /pdfmark
    /cleartomark load def end } ifelse
/BDC { mark 3 1 roll /BDC pdfmark } bind def
/EMC { mark /EMC pdfmark } bind def
/cairo_store_point { /cairo_point_y exch def /cairo_point_x exch def } def
/Tj { show currentpoint cairo_store_point } bind def
/TJ {
  {
    dup
    type /stringtype eq
    { show } { -0.001 mul 0 cairo_font_matrix dtransform rmoveto } ifelse
  } forall
  currentpoint cairo_store_point
} bind def
/cairo_selectfont { cairo_font_matrix aload pop pop pop 0 0 6 array astore
    cairo_font exch selectfont cairo_point_x cairo_point_y moveto } bind def
/Tf { pop /cairo_font exch def /cairo_font_matrix where
      { pop cairo_selectfont } if } bind def
/Td { matrix translate cairo_font_matrix matrix concatmatrix dup
      /cairo_font_matrix exch def dup 4 get exch 5 get cairo_store_point
      /cairo_font where { pop cairo_selectfont } if } bind def
/Tm { 2 copy 8 2 roll 6 array astore /cairo_font_matrix exch def
      cairo_store_point /cairo_font where { pop cairo_selectfont } if } bind def
/g { setgray } bind def
/rg { setrgbcolor } bind def
/d1 { setcachedevice } bind def
%%EndProlog
%%Page: 1 1
%%BeginPageSetup
%%PageBoundingBox: 0 -1 346 362
%%EndPageSetup
q 0 -1 346 363 rectclip q
0 361.098 346 -362 re W n
0 g
329.141 133.688 m 323.918 133.688 319.262 131.274 316.223 127.505 c 
316.223 138.559 l 316.223 147.719 308.797 155.145 299.637 155.145 c 
292.934 155.145 287.168 151.169 284.551 145.45 c 284.551 153.309 l 
284.551 162.473 277.125 169.899 267.965 169.899 c 258.801 169.899 
251.375 162.473 251.375 153.309 c 251.375 101.536 l 94.352 101.536 l 
94.352 153.309 l 94.352 162.473 86.926 169.899 77.766 169.899 c 68.602 
169.899 61.176 162.473 61.176 153.309 c 61.176 145.45 l 58.562 151.169 
52.793 155.145 46.09 155.145 c 36.93 155.145 29.504 147.719 29.504 
138.559 c 29.504 127.505 l 26.465 131.274 21.809 133.688 16.586 133.688 
c 7.426 133.688 0 126.262 0 117.102 c 0 52.798 l 0 43.634 7.426 36.208 
16.586 36.208 c 21.809 36.208 26.465 38.626 29.504 42.395 c 29.504 
31.337 l 29.504 22.18 36.93 14.755 46.09 14.755 c 52.793 14.755 58.562 
18.731 61.176 24.45 c 61.176 16.587 l 61.176 7.427 68.602 0.001 77.766 
0.001 c 86.926 0.001 94.352 7.427 94.352 16.587 c 94.352 68.364 l 
251.375 68.364 l 251.375 16.587 l 251.375 7.427 258.801 0.001 267.961 
0.001 c 277.125 0.001 284.547 7.427 284.547 16.587 c 284.547 24.45 l 
287.164 18.731 292.934 14.755 299.637 14.755 c 308.797 14.755 316.223 
22.18 316.223 31.337 c 316.223 42.395 l 319.262 38.626 323.918 36.208 
329.141 36.208 c 338.301 36.208 345.727 43.634 345.727 52.798 c 345.727 
117.102 l 345.727 126.262 338.301 133.688 329.141 133.688 c h
329.141 133.688 m f
329.141 324.891 m 323.918 324.891 319.262 322.473 316.223 318.704 c 
316.223 329.759 l 316.223 338.923 308.797 346.344 299.637 346.344 c 
292.934 346.344 287.168 342.368 284.551 336.649 c 284.551 344.512 l 
284.551 353.673 277.125 361.098 267.965 361.098 c 258.801 361.098 
251.375 353.673 251.375 344.512 c 251.375 292.735 l 94.352 292.735 l 
94.352 344.512 l 94.352 353.673 86.926 361.098 77.766 361.098 c 68.602 
361.098 61.176 353.673 61.176 344.512 c 61.176 336.649 l 58.562 342.372 
52.793 346.344 46.09 346.344 c 36.93 346.344 29.504 338.923 29.504 
329.759 c 29.504 318.704 l 26.465 322.473 21.809 324.891 16.586 324.891 
c 7.426 324.891 0 317.462 0 308.302 c 0 243.997 l 0 234.837 7.426 
227.407 16.586 227.407 c 21.809 227.407 26.465 229.825 29.504 233.594 c 
29.504 222.54 l 29.504 213.38 36.93 205.954 46.09 205.954 c 52.793 
205.954 58.562 209.93 61.176 215.649 c 61.176 207.786 l 61.176 198.626 
68.602 191.2 77.766 191.2 c 86.926 191.2 94.352 198.626 94.352 207.786 
c 94.352 259.563 l 251.375 259.563 l 251.375 207.786 l 251.375 198.626 
258.801 191.2 267.961 191.2 c 277.125 191.2 284.547 198.626 284.547 
207.786 c 284.547 215.649 l 287.164 209.93 292.934 205.954 299.637 
205.954 c 308.797 205.954 316.223 213.38 316.223 222.54 c 316.223 
233.594 l 319.262 229.825 323.918 227.407 329.141 227.407 c 338.301 
227.407 345.727 234.837 345.727 243.997 c 345.727 308.302 l 345.727 
317.462 338.301 324.891 329.141 324.891 c h
329.141 324.891 m f
Q Q
showpage
%%Trailer
count op_count sub {pop} repeat
countdictstack dict_count sub {end} repeat
cairo_eps_state restore
%%EOF
