%!PS-Adobe-3.0 EPSF-3.0
%%Creator: cairo 1.10.2 (http://cairographics.org)
%%CreationDate: Fri Aug  1 07:19:59 2014
%%Pages: 1
%%BoundingBox: 0 -1 386 230
%%DocumentData: Clean7Bit
%%LanguageLevel: 2
%%EndComments
%%BeginProlog
/cairo_eps_state save def
/dict_count countdictstack def
/op_count count 1 sub def
userdict begin
/q { gsave } bind def
/Q { grestore } bind def
/cm { 6 array astore concat } bind def
/w { setlinewidth } bind def
/J { setlinecap } bind def
/j { setlinejoin } bind def
/M { setmiterlimit } bind def
/d { setdash } bind def
/m { moveto } bind def
/l { lineto } bind def
/c { curveto } bind def
/h { closepath } bind def
/re { exch dup neg 3 1 roll 5 3 roll moveto 0 rlineto
      0 exch rlineto 0 rlineto closepath } bind def
/S { stroke } bind def
/f { fill } bind def
/f* { eofill } bind def
/n { newpath } bind def
/W { clip } bind def
/W* { eoclip } bind def
/BT { } bind def
/ET { } bind def
/pdfmark where { pop globaldict /?pdfmark /exec load put }
    { globaldict begin /?pdfmark /pop load def /pdfmark
    /cleartomark load def end } ifelse
/BDC { mark 3 1 roll /BDC pdfmark } bind def
/EMC { mark /EMC pdfmark } bind def
/cairo_store_point { /cairo_point_y exch def /cairo_point_x exch def } def
/Tj { show currentpoint cairo_store_point } bind def
/TJ {
  {
    dup
    type /stringtype eq
    { show } { -0.001 mul 0 cairo_font_matrix dtransform rmoveto } ifelse
  } forall
  currentpoint cairo_store_point
} bind def
/cairo_selectfont { cairo_font_matrix aload pop pop pop 0 0 6 array astore
    cairo_font exch selectfont cairo_point_x cairo_point_y moveto } bind def
/Tf { pop /cairo_font exch def /cairo_font_matrix where
      { pop cairo_selectfont } if } bind def
/Td { matrix translate cairo_font_matrix matrix concatmatrix dup
      /cairo_font_matrix exch def dup 4 get exch 5 get cairo_store_point
      /cairo_font where { pop cairo_selectfont } if } bind def
/Tm { 2 copy 8 2 roll 6 array astore /cairo_font_matrix exch def
      cairo_store_point /cairo_font where { pop cairo_selectfont } if } bind def
/g { setgray } bind def
/rg { setrgbcolor } bind def
/d1 { setcachedevice } bind def
%%EndProlog
%%Page: 1 1
%%BeginPageSetup
%%PageBoundingBox: 0 -1 386 230
%%EndPageSetup
q 0 -1 386 231 rectclip q
0 229.266 386 -230 re W n
0 g
314.434 142.055 m 306.582 142.055 298.723 140.7 291.066 138.02 c 
289.473 137.462 l 263.754 184.188 l 263.754 204.481 l 294.566 204.481 l 
300.488 204.481 305.305 209.298 305.305 215.22 c 305.305 221.141 
300.488 225.962 294.566 225.962 c 253.734 225.962 l 247.812 225.962 
242.996 221.141 242.996 215.22 c 242.996 214.352 243.113 213.45 243.348 
212.54 c 243.41 212.298 l 243.41 191.743 l 149.723 191.743 l 142.008 
208.927 l 164.324 208.927 l 169.93 208.927 174.492 213.489 174.492 
219.095 c 174.492 224.704 169.93 229.266 164.324 229.266 c 88.258 
229.266 l 82.648 229.266 78.086 224.704 78.086 219.095 c 78.086 213.489 
82.648 208.927 88.258 208.927 c 119.715 208.927 l 126.508 193.528 l 
95.988 137.45 l 94.383 138.012 l 86.738 140.692 78.879 142.052 71.023 
142.052 c 31.863 142.052 0 110.188 0 71.024 c 0 31.86 31.863 0.001 
71.023 0.001 c 105.773 0.001 135.188 24.891 140.973 59.184 c 141.254 
60.852 l 171.48 60.852 l 172.062 60.305 l 176.68 55.919 182.73 53.505 
189.09 53.505 c 202.734 53.505 213.832 64.606 213.832 78.251 c 213.832 
80.606 213.496 82.954 212.828 85.223 c 212.594 86.024 l 253.582 160.485 
l 271.66 127.641 l 270.336 126.591 l 253.227 112.993 243.41 92.739 
243.41 71.024 c 243.41 31.86 275.273 0.001 314.434 0.001 c 353.598 
0.001 385.457 31.86 385.457 71.024 c 385.457 110.192 353.598 142.055 
314.434 142.055 c h
103.871 109.626 m 105.75 107.848 l 112.711 101.278 117.656 92.93 
120.043 83.708 c 120.695 81.208 l 88.23 81.208 l h
120.043 58.352 m 114.242 35.977 94.086 20.352 71.027 20.352 c 43.078 
20.352 20.344 43.091 20.344 71.036 c 20.344 98.985 43.078 121.72 71.027 
121.72 c 75.105 121.72 79.324 121.169 83.562 120.087 c 86.066 119.446 l 
62.121 75.927 l 62.062 75.766 61.996 75.61 61.914 75.454 c 61.746 75.11 
61.625 74.813 61.523 74.524 c 61.383 74.153 61.289 73.852 61.219 73.563 
c 61.141 73.266 61.082 72.981 61.027 72.61 c 60.961 72.208 60.926 
71.872 60.922 71.575 c 60.918 71.47 l 60.91 71.337 60.891 71.2 60.871 
71.063 c 60.863 71.02 l 60.867 70.985 l 60.887 70.872 60.898 70.759 
60.906 70.645 c 60.926 70.243 60.969 69.86 61.02 69.481 c 61.062 69.208 
61.113 68.899 61.191 68.591 c 61.266 68.29 61.359 67.989 61.477 67.669 
c 61.594 67.309 61.711 67.02 61.848 66.727 c 61.973 66.45 62.117 66.2 
62.285 65.911 c 62.328 65.841 l 62.5 65.536 62.652 65.302 62.816 65.083 
c 63 64.833 63.199 64.587 63.465 64.29 c 63.676 64.059 63.895 63.821 
64.133 63.598 c 64.383 63.376 64.645 63.169 64.91 62.958 c 65.164 
62.766 65.449 62.555 65.734 62.391 c 65.852 62.321 l 65.93 62.266 
66.012 62.204 66.094 62.145 c 66.164 62.091 l 66.328 62.04 66.484 
61.973 66.645 61.887 c 66.918 61.755 67.238 61.618 67.527 61.52 c 
67.898 61.384 68.211 61.286 68.535 61.2 c 68.789 61.134 69.051 61.079 
69.43 61.02 c 69.828 60.954 70.199 60.915 70.57 60.899 c 70.68 60.907 
70.848 60.884 71.023 60.86 c 120.691 60.856 l h
170.035 94.036 m 167.363 90.817 165.543 86.946 164.773 82.837 c 164.469 
81.208 l 141.254 81.208 l 140.973 82.876 l 138.062 100.13 128.883 
115.661 115.121 126.602 c 113.801 127.653 l 137.148 170.071 l 170.828 
94.993 l h
197.863 101.446 m 196.312 101.923 l 194.516 102.47 192.637 102.809 
190.73 102.934 c 189.527 103.012 l 158.855 171.411 l 236.379 171.411 l 
h
314.434 20.352 m 286.488 20.352 263.754 43.091 263.754 71.036 c 263.754 
85.071 269.418 98.145 279.707 107.852 c 281.586 109.626 l 305.527 66.13 
l 307.309 62.884 310.727 60.868 314.445 60.868 c 316.184 60.868 317.832 
61.29 319.344 62.126 c 321.727 63.434 323.449 65.591 324.207 68.2 c 
324.961 70.813 324.656 73.563 323.344 75.95 c 299.402 119.446 l 301.906 
120.087 l 306.137 121.173 310.355 121.72 314.445 121.72 c 342.395 
121.72 365.129 98.985 365.129 71.036 c 365.117 43.091 342.375 20.352 
314.434 20.352 c h
314.434 20.352 m f
Q Q
showpage
%%Trailer
count op_count sub {pop} repeat
countdictstack dict_count sub {end} repeat
cairo_eps_state restore
%%EOF
