%!PS-Adobe-3.0 EPSF-3.0
%%Creator: cairo 1.10.2 (http://cairographics.org)
%%CreationDate: Thu Jul 31 07:30:23 2014
%%Pages: 1
%%BoundingBox: 0 -1 331 388
%%DocumentData: Clean7Bit
%%LanguageLevel: 2
%%EndComments
%%BeginProlog
/cairo_eps_state save def
/dict_count countdictstack def
/op_count count 1 sub def
userdict begin
/q { gsave } bind def
/Q { grestore } bind def
/cm { 6 array astore concat } bind def
/w { setlinewidth } bind def
/J { setlinecap } bind def
/j { setlinejoin } bind def
/M { setmiterlimit } bind def
/d { setdash } bind def
/m { moveto } bind def
/l { lineto } bind def
/c { curveto } bind def
/h { closepath } bind def
/re { exch dup neg 3 1 roll 5 3 roll moveto 0 rlineto
      0 exch rlineto 0 rlineto closepath } bind def
/S { stroke } bind def
/f { fill } bind def
/f* { eofill } bind def
/n { newpath } bind def
/W { clip } bind def
/W* { eoclip } bind def
/BT { } bind def
/ET { } bind def
/pdfmark where { pop globaldict /?pdfmark /exec load put }
    { globaldict begin /?pdfmark /pop load def /pdfmark
    /cleartomark load def end } ifelse
/BDC { mark 3 1 roll /BDC pdfmark } bind def
/EMC { mark /EMC pdfmark } bind def
/cairo_store_point { /cairo_point_y exch def /cairo_point_x exch def } def
/Tj { show currentpoint cairo_store_point } bind def
/TJ {
  {
    dup
    type /stringtype eq
    { show } { -0.001 mul 0 cairo_font_matrix dtransform rmoveto } ifelse
  } forall
  currentpoint cairo_store_point
} bind def
/cairo_selectfont { cairo_font_matrix aload pop pop pop 0 0 6 array astore
    cairo_font exch selectfont cairo_point_x cairo_point_y moveto } bind def
/Tf { pop /cairo_font exch def /cairo_font_matrix where
      { pop cairo_selectfont } if } bind def
/Td { matrix translate cairo_font_matrix matrix concatmatrix dup
      /cairo_font_matrix exch def dup 4 get exch 5 get cairo_store_point
      /cairo_font where { pop cairo_selectfont } if } bind def
/Tm { 2 copy 8 2 roll 6 array astore /cairo_font_matrix exch def
      cairo_store_point /cairo_font where { pop cairo_selectfont } if } bind def
/g { setgray } bind def
/rg { setrgbcolor } bind def
/d1 { setcachedevice } bind def
%%EndProlog
%%Page: 1 1
%%BeginPageSetup
%%PageBoundingBox: 0 -1 331 388
%%EndPageSetup
q 0 -1 331 389 rectclip q
0 387.732 331 -388 re W n
0 g
285.578 356.334 m 266.012 356.334 l 266.012 371.111 l 266.012 380.287 
258.566 387.732 249.387 387.732 c 243.344 387.732 l 234.164 387.732 
226.723 380.287 226.723 371.111 c 226.723 356.334 l 110.438 356.334 l 
110.438 371.111 l 110.438 380.287 102.996 387.732 93.816 387.732 c 
87.773 387.732 l 78.594 387.732 71.152 380.287 71.152 371.111 c 71.152 
356.334 l 44.875 356.334 l 20.133 356.334 0 336.201 0 311.455 c 0 
44.877 l 0 20.13 20.133 0.002 44.875 0.002 c 285.578 0.002 l 310.324 
0.002 330.457 20.13 330.457 44.877 c 330.457 311.455 l 330.457 336.201 
310.324 356.334 285.578 356.334 c h
303.43 44.877 m 303.43 35.037 295.422 27.025 285.578 27.025 c 44.875 
27.025 l 35.035 27.025 27.027 35.037 27.027 44.877 c 27.027 311.455 l 
27.027 321.298 35.035 329.306 44.875 329.306 c 71.152 329.306 l 71.152 
308.076 l 71.152 298.9 78.594 291.455 87.773 291.455 c 93.816 291.455 l 
102.996 291.455 110.438 298.9 110.438 308.076 c 110.438 329.306 l 
226.723 329.306 l 226.723 308.08 l 226.723 298.9 234.164 291.455 
243.344 291.455 c 249.387 291.455 l 258.57 291.455 266.012 298.9 
266.012 308.08 c 266.012 329.306 l 285.578 329.306 l 295.422 329.306 
303.43 321.298 303.43 311.455 c h
303.43 44.877 m f
256.695 254.775 m 79.094 254.775 l 71.633 254.775 65.582 248.724 65.582 
241.263 c 65.582 233.798 71.633 227.748 79.094 227.748 c 256.695 
227.748 l 264.156 227.748 270.207 233.798 270.207 241.263 c 270.207 
248.724 264.156 254.775 256.695 254.775 c h
256.695 254.775 m f
255.742 201.173 m 78.145 201.173 l 70.68 201.173 64.629 195.123 64.629 
187.662 c 64.629 180.201 70.68 174.15 78.145 174.15 c 255.742 174.15 l 
263.207 174.15 269.258 180.201 269.258 187.662 c 269.258 195.123 
263.207 201.173 255.742 201.173 c h
255.742 201.173 m f
254.793 147.576 m 77.191 147.576 l 69.73 147.576 63.68 141.525 63.68 
134.06 c 63.68 126.599 69.73 120.548 77.191 120.548 c 254.793 120.548 l 
262.254 120.548 268.305 126.599 268.305 134.06 c 268.305 141.525 
262.254 147.576 254.793 147.576 c h
254.793 147.576 m f
253.84 93.974 m 76.238 93.974 l 68.777 93.974 62.727 87.923 62.727 
80.462 c 62.727 72.998 68.777 66.951 76.238 66.951 c 253.84 66.951 l 
261.301 66.951 267.352 72.998 267.352 80.462 c 267.352 87.923 261.301 
93.974 253.84 93.974 c h
253.84 93.974 m f
Q Q
showpage
%%Trailer
count op_count sub {pop} repeat
countdictstack dict_count sub {end} repeat
cairo_eps_state restore
%%EOF
