9
8
8
8
8
8
8
8
7
9
8
7
9
8
9
9
9
8
8
8
8
8
9
9
10
10
7
6
9
7
9
9
8
7
7
9
10
10
7
9
8
8
9
9
9
10
10
8
9
9
8
8
8
8
7
9
9
8
8
10
10
8
8
9
8
8
7
6
6
6
9
8
8
8
8
8
9
9
8
8
7
7
9
9
8
9
9
9
9
9
8
11
10
9
9
9
8
8
9
9
9
10
10
10
9
9
10
8
8
7
9
8
9
10
8
9
9
8
8
8
8
7
7
9
7
7
6
8
9
7
7
10
9
8
8
7
9
9
8
8
8
8
7
6
6
6
10
10
8
9
9
8
7
9
10
8
7
7
9
9
8
8
8
8
8
8
7
6
10
10
8
9
10
11
8
9
10
10
9
8
8
8
8
8
8
7
7
9
10
7
9
8
9
9
8
8
10
9
7
7
9
10
10
8
9
9
7
9
9
7
9
10
10
8
8
9
8
8
8
8
8
8
8
8
8
8
7
8
7
7
6
9
9
9
9
9
9
10
11
10
8
7
6
9
9
9
8
9
9
8
8
9
9
8
8
8
8
8
8
8
7
9
9
8
8
7
7
9
8
8
9
9
7
9
9
8
8
8
9
9
10
10
8
8
9
9
8
8
8
8
8
8
8
9
9
8
8
7
6
9
9
10
10
8
8
8
8
8
9
9
8
8
7
7
10
10
10
7
7
6
9
10
8
7
9
9
8
7
7
6
6
10
9
7
9
8
10
10
9
8
8
7
7
9
9
7
7
6
9
7
10
10
9
9
8
7
6
9
9
8
9
9
8
8
8
8
8
8
8
7
7
10
10
10
8
7
7
8
9
8
7
7
6
9
9
9
9
7
7
6
6
6
9
9
8
9
9
9
8
7
9
8
8
9
9
7
9
9
8
8
8
8
8
8
9
9
7
7
6
9
9
8
8
8
8
8
8
7
8
7
6
6
6
9
11
8
9
8
9
9
9
9
8
8
8
7
9
9
7
7
6
9
8
8
8
9
9
8
8
8
7
9
9
8
7
9
9
7
9
10
9
8
8
9
9
7
6
6
9
9
8
8
8
9
8
8
8
9
9
8
8
7
9
8
9
9
8
7
7
9
9
7
9
9
7
7
9
9
8
8
8
8
8
8
7
9
10
10
8
8
9
8
9
9
8
8
7
6
6
6
9
9
8
8
8
8
8
8
8
9
9
9
9
7
10
8
9
9
7
7
6
9
10
10
9
8
8
8
8
7
9
8
8
8
9
9
7
9
9
8
7
7
9
8
7
7
9
9
10
10
9
8
8
8
8
7
6
6
10
10
8
9
9
9
10
8
8
7
9
7
9
8
8
8
8
7
7
6
9
9
8
8
9
10
7
9
9
7
7
6
9
8
8
9
9
8
10
9
9
7
7
9
9
9
9
7
9
9
9
9
8
8
8
8
8
9
9
8
8
12
12
11
12
12
11
11
11
11
10
10
9
12
12
11
11
11
11
11
11
11
11
11
11
11
11
11
11
10
10
9
9
9
9
9
9
12
13
12
10
12
10
10
9
12
11
10
10
12
11
10
12
12
11
11
13
13
11
9
12
7
10
10
9
8
6
9
9
8
8
8
10
10
9
8
8
8
9
10
7
9
9
8
9
10
9
8
8
8
7
6
9
9
8
8
8
8
8
9
9
9
7
9
7
7
9
9
8
9
9
8
8
7
9
8
8
8
8
6
9
8
7
9
8
8
8
8
8
8
8
8
8
7
9
9
7
9
8
7
7
9
7
9
9
8
8
8
8
8
9
9
8
7
10
9
8
8
8
8
8
8
7
9
9
8
8
8
8
7
9
9
8
8
7
7
9
10
10
7
7
9
9
8
8
8
8
10
10
8
6
9
8
8
7
9
7
7
9
9
8
8
8
7
9
8
8
9
9
8
8
7
9
9
9
9
8
9
9
7
8
8
7
10
10
8
6
9
9
8
10
11
8
9
7
7
6
9
9
8
8
8
8
8
8
8
8
8
8
7
7
9
9
8
8
10
10
9
9
9
9
9
9
9
9
9
9
9
9
9
9
9
9
9
9
10
9
9
9
9
9
8
8
9
9
10
9
9
9
9
9
9
9
9
9
9
9
9
9
9
11
11
10
10
10
10
10
10
9
9
9
9
9
9
9
9
10
9
10
9
9
9
9
9
9
8
8
7
7
6
9
9
8
8
10
10
8
9
9
7
7
9
7
9
9
7
9
9
8
8
7
9
10
7
6
9
8
8
8
9
9
8
7
9
8
9
9
8
9
9
7
7
6
6
6
6
6
9
9
8
8
8
8
8
8
7
7
9
9
8
9
9
8
8
8
8
8
10
10
10
10
8
8
9
9
8
9
9
8
8
8
8
8
8
7
6
6
9
8
7
8
8
8
8
8
8
8
8
7
6
9
9
8
7
10
9
9
9
8
8
8
8
9
9
7
7
9
9
7
6
6
9
9
8
8
9
9
8
10
