{
    "images": [{
        "src": "https://www.bensound.com/bensound-img/creativeminds.jpg",
        "mp3": "https://www.bensound.com/bensound-music/bensound-creativeminds.mp3",
        "name": "Creative Minds",
        "author": "Ben Sound"
    },{
        "src": "https://i1.sndcdn.com/artworks-000415403010-ssm9cg-t500x500.jpg",
        "mp3": "https://www.chosic.com/wp-content/uploads/2020/11/batchbug-sweet-dreams.mp3",
        "name": "Sweet Dreams",
        "author": "BatchBug"
    },{
        "src": "https://www.bensound.com/bensound-img/cute.jpg",
        "mp3": "https://www.bensound.com/bensound-music/bensound-cute.mp3",
        "name": "Cute",
        "author": "Ben Sound"
    },{
        "src": "https://www.bensound.com/bensound-img/ukulele.jpg",
        "mp3": "https://www.bensound.com/bensound-music/bensound-ukulele.mp3",
        "name": "Ukulele",
        "author": "Ben Sound"
    },{
        "src": "https://i1.sndcdn.com/artworks-000415403010-ssm9cg-t500x500.jpg",
        "mp3": "https://www.chosic.com/wp-content/uploads/2020/11/batchbug-sweet-dreams.mp3",
        "name": "Sweet Dreams",
        "author": "BatchBug"
    },{
        "src": "https://www.bensound.com/bensound-img/cute.jpg",
        "mp3": "https://www.bensound.com/bensound-music/bensound-cute.mp3",
        "name": "Cute",
        "author": "Ben Sound"
    },{
        "src": "https://www.bensound.com/bensound-img/ukulele.jpg",
        "mp3": "https://www.bensound.com/bensound-music/bensound-ukulele.mp3",
        "name": "Ukulele",
        "author": "Ben Sound"
    },{
        "src": "https://www.bensound.com/bensound-img/creativeminds.jpg",
        "mp3": "https://www.bensound.com/bensound-music/bensound-creativeminds.mp3",
        "name": "Creative Minds",
        "author": "Ben Sound"
    }]
}