{
    "meta": {
      "locale": "ru-RU",
      "timezone": "Europe/Moscow",
      "client_id": "ru.yandex.searchplugin/5.80 (Samsung Galaxy; Android 4.4)"
    },
    "request": {
       "command": "засеки",
       "original_utterance": "Сколько прошло времени?",
       "type": "SimpleUtterance",
       "markup": {
          "dangerous_context": "True"
       },
       "payload": "{}"
    },
    "session": {
      "new": false,
      "message_id": "4",
      "session_id": "123",
      "skill_id": "321",
      "user_id": "454321"
    },
    "version": "1.0"
}