^C:\USERS\1\DESKTOP\СТРОКИ\CONSOLEAPPLICATION2\UNITTEST1\STDAFX.CPP
/c /I"C:\PROGRAM FILES (X86)\MICROSOFT VISUAL STUDIO 14.0\VC\UNITTEST\INCLUDE" /Zi /nologo /W3 /WX- /O2 /Oi /GL /D NDEBUG /D _WINDLL /D _UNICODE /D UNICODE /Gm- /EHsc /MD /GS /Gy /fp:precise /Zc:wchar_t /Zc:forScope /Zc:inline /Yc"stdafx.h" /Fp"X64\RELEASE\UNITTEST1.PCH" /Fo"X64\RELEASE\\" /Fd"X64\RELEASE\VC140.PDB" /Gd /TP /FC C:\USERS\1\DESKTOP\СТРОКИ\CONSOLEAPPLICATION2\UNITTEST1\STDAFX.CPP
^C:\USERS\1\DESKTOP\СТРОКИ\CONSOLEAPPLICATION2\UNITTEST1\UNITTEST1.CPP
/c /I"C:\PROGRAM FILES (X86)\MICROSOFT VISUAL STUDIO 14.0\VC\UNITTEST\INCLUDE" /Zi /nologo /W3 /WX- /O2 /Oi /GL /D NDEBUG /D _WINDLL /D _UNICODE /D UNICODE /Gm- /EHsc /MD /GS /Gy /fp:precise /Zc:wchar_t /Zc:forScope /Zc:inline /Yu"stdafx.h" /Fp"X64\RELEASE\UNITTEST1.PCH" /Fo"X64\RELEASE\\" /Fd"X64\RELEASE\VC140.PDB" /Gd /TP /FC C:\USERS\1\DESKTOP\СТРОКИ\CONSOLEAPPLICATION2\UNITTEST1\UNITTEST1.CPP
