^C:\USERS\YANA\DESKTOP\GITGITGIT\LASTPROJECT2\CONSOLEAPPLICATION2\DEBUG\CONSOLEAPPLICATION2.OBJ|C:\USERS\YANA\DESKTOP\GITGITGIT\LASTPROJECT2\CONSOLEAPPLICATION2\DEBUG\STDAFX.OBJ
C:\USERS\YANA\DESKTOP\GITGITGIT\LASTPROJECT2\DEBUG\CONSOLEAPPLICATION2.ILK
C:\USERS\YANA\DESKTOP\GITGITGIT\LASTPROJECT2\DEBUG\CONSOLEAPPLICATION2.EXE
C:\USERS\YANA\DESKTOP\GITGITGIT\LASTPROJECT2\DEBUG\CONSOLEAPPLICATION2.PDB
