{
    "https://rsconnect-prod.services.ally.com/": {
        "server_url": "https://rsconnect-prod.services.ally.com/",
        "filename": "C:\\Users\\mz3gx7\\VSCode\\streamlit_demo_psr",
        "app_url": "https://rsconnect-prod.services.ally.com/content/c73e50d3-361a-40e2-805e-b2d384136a00/",
        "app_id": 55,
        "app_guid": "c73e50d3-361a-40e2-805e-b2d384136a00",
        "title": "streamlit_demo_psr",
        "app_mode": "python-streamlit"
    }
}