{
  "version": "1.1.0",
  "diagrams": [
    {
      "ordinal": 0,
      "scrollPosition": {
        "x": 0,
        "y": 0
      },
      "nodes": [
        {
          "location": {
            "x": 392.9,
            "y": 219
          },
          "nodeIndex": "Dim_Employee",
          "nodeLineageTag": "7aa52d31-3ac0-4527-b8e6-baf6f2133d2f",
          "size": {
            "height": 300,
            "width": 234
          },
          "zIndex": 3
        },
        {
          "location": {
            "x": 396.2,
            "y": 0
          },
          "nodeIndex": "Dim_Calendar",
          "size": {
            "height": 200,
            "width": 234
          },
          "zIndex": 1
        },
        {
          "location": {
            "x": 0,
            "y": 0
          },
          "nodeIndex": "USER_OWNERSHIP",
          "nodeLineageTag": "0d9e3a2d-d34c-4581-a318-6837771ab34c",
          "size": {
            "height": 510,
            "width": 234
          },
          "zIndex": 2
        }
      ],
      "name": "All tables",
      "zoomValue": 100,
      "pinKeyFieldsToTop": false,
      "showExtraHeaderInfo": false,
      "hideKeyFieldsWhenCollapsed": false,
      "tablesLocked": false
    }
  ],
  "selectedDiagram": "All tables",
  "defaultDiagram": "All tables"
}