{
  "config": "{\"version\":\"5.44\",\"themeCollection\":{\"baseTheme\":{\"name\":\"CY23SU04\",\"version\":\"5.45\",\"type\":2}},\"activeSectionIndex\":0,\"defaultDrillFilterOtherVisuals\":true,\"linguisticSchemaSyncVersion\":2,\"settings\":{\"useNewFilterPaneExperience\":true,\"allowChangeFilterTypes\":true,\"useStylableVisualContainerHeader\":true,\"queryLimitOption\":6,\"exportDataMode\":1,\"useDefaultAggregateDisplayName\":true},\"objects\":{\"section\":[{\"properties\":{\"verticalAlignment\":{\"expr\":{\"Literal\":{\"Value\":\"'Top'\"}}}}}],\"outspacePane\":[{\"properties\":{\"expanded\":{\"expr\":{\"Literal\":{\"Value\":\"false\"}}},\"visible\":{\"expr\":{\"Literal\":{\"Value\":\"false\"}}}}}]}}",
  "layoutOptimization": 0,
  "resourcePackages": [
    {
      "resourcePackage": {
        "disabled": false,
        "items": [
          {
            "name": "CY23SU04",
            "path": "BaseThemes/CY23SU04.json",
            "type": 202
          }
        ],
        "name": "SharedResources",
        "type": 2
      }
    }
  ],
  "sections": [
    {
      "config": "{\"relationships\":[{\"source\":\"6f54c8f108e79e9d7a36\",\"target\":\"af06a96845006ebeb21e\",\"type\":3}],\"visibility\":1}",
      "displayName": "Page 1",
      "displayOption": 1,
      "filters": "[]",
      "height": 720.00,
      "name": "ReportSection",
      "ordinal": 1,
      "visualContainers": [
        {
          "config": "{\"name\":\"04e01506bd844cf0b934\",\"layouts\":[{\"id\":0,\"position\":{\"x\":804.7524752475248,\"y\":62.31023102310231,\"z\":6000,\"width\":249.24092409240924,\"height\":62.31023102310231,\"tabOrder\":6000}}],\"singleVisual\":{\"visualType\":\"slicer\",\"projections\":{\"Values\":[{\"queryRef\":\"USER_OWNERSHIP.PBI_DATASETNAME\",\"active\":true}]},\"prototypeQuery\":{\"Version\":2,\"From\":[{\"Name\":\"v\",\"Entity\":\"V_MIGR_SCORECARD_ZID_MONTH\",\"Type\":0},{\"Name\":\"u\",\"Entity\":\"USER_OWNERSHIP\",\"Type\":0}],\"Select\":[{\"Column\":{\"Expression\":{\"SourceRef\":{\"Source\":\"u\"}},\"Property\":\"PBI_DATASETNAME\"},\"Name\":\"USER_OWNERSHIP.PBI_DATASETNAME\",\"NativeReferenceName\":\"DATASET\"}],\"OrderBy\":[{\"Direction\":1,\"Expression\":{\"Column\":{\"Expression\":{\"SourceRef\":{\"Source\":\"v\"}},\"Property\":\"SR_DIR_OR_DIR\"}}}]},\"columnProperties\":{\"USER_OWNERSHIP.PBI_DATASETNAME\":{\"displayName\":\"DATASET\"}},\"drillFilterOtherVisuals\":true,\"hasDefaultSort\":true,\"objects\":{\"data\":[{\"properties\":{\"mode\":{\"expr\":{\"Literal\":{\"Value\":\"'Dropdown'\"}}}}}],\"general\":[{\"properties\":{\"selfFilterEnabled\":{\"expr\":{\"Literal\":{\"Value\":\"true\"}}}}}]},\"vcObjects\":{\"border\":[{\"properties\":{\"show\":{\"expr\":{\"Literal\":{\"Value\":\"true\"}}}}}],\"title\":[{\"properties\":{\"text\":{\"expr\":{\"Literal\":{\"Value\":\"'Slicer - EC Member'\"}}}}}]}}}",
          "filters": "[]",
          "height": 62.31,
          "width": 249.24,
          "x": 804.75,
          "y": 62.31,
          "z": 6000.00
        },
        {
          "config": "{\"name\":\"15ef18f86f61710f86b0\",\"layouts\":[{\"id\":0,\"position\":{\"x\":804.7524752475248,\"y\":0,\"z\":5000,\"width\":249.24092409240924,\"height\":62.31023102310231,\"tabOrder\":5000}}],\"singleVisual\":{\"visualType\":\"slicer\",\"projections\":{\"Values\":[{\"queryRef\":\"USER_OWNERSHIP.PBI_WORKSPACENAME\",\"active\":true}]},\"prototypeQuery\":{\"Version\":2,\"From\":[{\"Name\":\"v\",\"Entity\":\"V_MIGR_SCORECARD_ZID_MONTH\",\"Type\":0},{\"Name\":\"u\",\"Entity\":\"USER_OWNERSHIP\",\"Type\":0}],\"Select\":[{\"Column\":{\"Expression\":{\"SourceRef\":{\"Source\":\"u\"}},\"Property\":\"PBI_WORKSPACENAME\"},\"Name\":\"USER_OWNERSHIP.PBI_WORKSPACENAME\",\"NativeReferenceName\":\"WORKSPACE\"}],\"OrderBy\":[{\"Direction\":1,\"Expression\":{\"Column\":{\"Expression\":{\"SourceRef\":{\"Source\":\"v\"}},\"Property\":\"SR_DIR_OR_DIR\"}}}]},\"columnProperties\":{\"USER_OWNERSHIP.PBI_WORKSPACENAME\":{\"displayName\":\"WORKSPACE\"}},\"drillFilterOtherVisuals\":true,\"hasDefaultSort\":true,\"objects\":{\"data\":[{\"properties\":{\"mode\":{\"expr\":{\"Literal\":{\"Value\":\"'Dropdown'\"}}}}}],\"general\":[{\"properties\":{\"selfFilterEnabled\":{\"expr\":{\"Literal\":{\"Value\":\"true\"}}}}}]},\"vcObjects\":{\"border\":[{\"properties\":{\"show\":{\"expr\":{\"Literal\":{\"Value\":\"true\"}}}}}],\"title\":[{\"properties\":{\"text\":{\"expr\":{\"Literal\":{\"Value\":\"'Slicer - EC Member'\"}}}}}]}}}",
          "filters": "[]",
          "height": 62.31,
          "width": 249.24,
          "x": 804.75,
          "y": 0.00,
          "z": 5000.00
        },
        {
          "config": "{\"name\":\"271e55efe9a08951c9c4\",\"layouts\":[{\"id\":0,\"position\":{\"x\":1071.304347826087,\"y\":0,\"z\":4000,\"width\":192,\"height\":64,\"tabOrder\":4000}}],\"singleVisual\":{\"visualType\":\"slicer\",\"projections\":{\"Values\":[{\"queryRef\":\"Dim_Employee.EMPLOYEE_FULL_NAME\",\"active\":true}]},\"prototypeQuery\":{\"Version\":2,\"From\":[{\"Name\":\"v\",\"Entity\":\"V_MIGR_SCORECARD_ZID_MONTH\",\"Type\":0},{\"Name\":\"d\",\"Entity\":\"Dim_Employee\",\"Type\":0}],\"Select\":[{\"Column\":{\"Expression\":{\"SourceRef\":{\"Source\":\"d\"}},\"Property\":\"EMPLOYEE_FULL_NAME\"},\"Name\":\"Dim_Employee.EMPLOYEE_FULL_NAME\",\"NativeReferenceName\":\"WORKSPACE OWNER\"}],\"OrderBy\":[{\"Direction\":1,\"Expression\":{\"Column\":{\"Expression\":{\"SourceRef\":{\"Source\":\"v\"}},\"Property\":\"SR_DIR_OR_DIR\"}}}]},\"columnProperties\":{\"Dim_Employee.EMPLOYEE_FULL_NAME\":{\"displayName\":\"WORKSPACE OWNER\"}},\"drillFilterOtherVisuals\":true,\"hasDefaultSort\":true,\"objects\":{\"data\":[{\"properties\":{\"mode\":{\"expr\":{\"Literal\":{\"Value\":\"'Dropdown'\"}}}}}],\"general\":[{\"properties\":{\"selfFilterEnabled\":{\"expr\":{\"Literal\":{\"Value\":\"true\"}}},\"selfFilter\":{\"filter\":{\"Version\":2,\"From\":[{\"Name\":\"d\",\"Entity\":\"Dim_Employee\",\"Type\":0}],\"Where\":[{\"Condition\":{\"Contains\":{\"Left\":{\"Column\":{\"Expression\":{\"SourceRef\":{\"Source\":\"d\"}},\"Property\":\"EMPLOYEE_FULL_NAME\"}},\"Right\":{\"Literal\":{\"Value\":\"'preho'\"}}}},\"Annotations\":{\"PowerBI.MParameterBehavior\":1}}]}},\"filter\":{\"filter\":{\"Version\":2,\"From\":[{\"Name\":\"d\",\"Entity\":\"Dim_Employee\",\"Type\":0}],\"Where\":[{\"Condition\":{\"In\":{\"Expressions\":[{\"Column\":{\"Expression\":{\"SourceRef\":{\"Source\":\"d\"}},\"Property\":\"EMPLOYEE_FULL_NAME\"}}],\"Values\":[[{\"Literal\":{\"Value\":\"'Scott Prehoda'\"}}]]}}}]}}}}]},\"vcObjects\":{\"border\":[{\"properties\":{\"show\":{\"expr\":{\"Literal\":{\"Value\":\"true\"}}}}}],\"title\":[{\"properties\":{\"text\":{\"expr\":{\"Literal\":{\"Value\":\"'Slicer - Employee'\"}}}}}]}}}",
          "filters": "[]",
          "height": 64.00,
          "width": 192.00,
          "x": 1071.30,
          "y": 0.00,
          "z": 4000.00
        },
        {
          "config": "{\"name\":\"436002699e01853bddec\",\"layouts\":[{\"id\":0,\"position\":{\"x\":28.514851485148515,\"y\":0,\"z\":0,\"width\":378.0858085808581,\"height\":124.62046204620462,\"tabOrder\":0}}],\"singleVisual\":{\"visualType\":\"multiRowCard\",\"projections\":{\"Values\":[{\"queryRef\":\"TOOL_PBI_USER_USAGE.REPORT_MONTH\"},{\"queryRef\":\"Count(TOOL_PBI_USER_USAGE.PBI_WORKSPACEID)\"},{\"queryRef\":\"TOOL_PBI_USER_USAGE.PBI_DATASETID\"},{\"queryRef\":\"TOOL_PBI_USER_USAGE.PBI_ITEMNAME\"}]},\"prototypeQuery\":{\"Version\":2,\"From\":[{\"Name\":\"t\",\"Entity\":\"USER_OWNERSHIP\",\"Type\":0}],\"Select\":[{\"Aggregation\":{\"Expression\":{\"Column\":{\"Expression\":{\"SourceRef\":{\"Source\":\"t\"}},\"Property\":\"PBI_WORKSPACEID\"}},\"Function\":2},\"Name\":\"Count(TOOL_PBI_USER_USAGE.PBI_WORKSPACEID)\",\"NativeReferenceName\":\"Count of PBI_WORKSPACEID1\"},{\"Aggregation\":{\"Expression\":{\"Column\":{\"Expression\":{\"SourceRef\":{\"Source\":\"t\"}},\"Property\":\"PBI_DATASETID\"}},\"Function\":2},\"Name\":\"TOOL_PBI_USER_USAGE.PBI_DATASETID\",\"NativeReferenceName\":\"DATASETS\"},{\"Column\":{\"Expression\":{\"SourceRef\":{\"Source\":\"t\"}},\"Property\":\"REPORT_MONTH\"},\"Name\":\"TOOL_PBI_USER_USAGE.REPORT_MONTH\",\"NativeReferenceName\":\"REPORT_MONTH\"},{\"Aggregation\":{\"Expression\":{\"Column\":{\"Expression\":{\"SourceRef\":{\"Source\":\"t\"}},\"Property\":\"PBI_ITEMNAME\"}},\"Function\":2},\"Name\":\"TOOL_PBI_USER_USAGE.PBI_ITEMNAME\",\"NativeReferenceName\":\"ITEMS\"}],\"OrderBy\":[{\"Direction\":1,\"Expression\":{\"Column\":{\"Expression\":{\"SourceRef\":{\"Source\":\"t\"}},\"Property\":\"REPORT_MONTH\"}}}]},\"columnProperties\":{\"Count(TOOL_PBI_USER_USAGE.PBI_WORKSPACEID)\":{\"displayName\":\"WORKSPACES\"},\"TOOL_PBI_USER_USAGE.PBI_DATASETID\":{\"displayName\":\"DATASETS\"},\"TOOL_PBI_USER_USAGE.PBI_ITEMNAME\":{\"displayName\":\"ITEMS\"}},\"drillFilterOtherVisuals\":true,\"hasDefaultSort\":true,\"objects\":{\"card\":[{\"properties\":{\"barShow\":{\"expr\":{\"Literal\":{\"Value\":\"false\"}}},\"outlineStyle\":{\"expr\":{\"Literal\":{\"Value\":\"0D\"}}}}}],\"categoryLabels\":[{\"properties\":{\"show\":{\"expr\":{\"Literal\":{\"Value\":\"true\"}}}}}],\"dataLabels\":[{\"properties\":{\"fontSize\":{\"expr\":{\"Literal\":{\"Value\":\"20D\"}}}}}]},\"vcObjects\":{\"border\":[{\"properties\":{\"show\":{\"expr\":{\"Literal\":{\"Value\":\"true\"}}}}}]}}}",
          "filters": "[]",
          "height": 124.62,
          "width": 378.09,
          "x": 28.51,
          "y": 0.00,
          "z": 0.00
        },
        {
          "config": "{\"name\":\"6f54c8f108e79e9d7a36\",\"layouts\":[{\"id\":0,\"position\":{\"x\":28.514851485148515,\"y\":138.34983498349834,\"z\":1000,\"width\":1025.4785478547853,\"height\":277.75577557755776,\"tabOrder\":1000}}],\"singleVisual\":{\"visualType\":\"pivotTable\",\"projections\":{\"Rows\":[{\"queryRef\":\"USER_OWNERSHIP.PBI_WORKSPACENAME\",\"active\":true},{\"queryRef\":\"USER_OWNERSHIP.PBI_DATASETNAME\"}],\"Values\":[{\"queryRef\":\"Min(USER_OWNERSHIP.PBI_WORKSPACEID)\"},{\"queryRef\":\"Min(USER_OWNERSHIP.PBI_DATASETID)\"},{\"queryRef\":\"Min(USER_OWNERSHIP.PBI_ITEMNAME)\"}]},\"prototypeQuery\":{\"Version\":2,\"From\":[{\"Name\":\"t\",\"Entity\":\"USER_OWNERSHIP\",\"Type\":0}],\"Select\":[{\"Column\":{\"Expression\":{\"SourceRef\":{\"Source\":\"t\"}},\"Property\":\"PBI_DATASETNAME\"},\"Name\":\"USER_OWNERSHIP.PBI_DATASETNAME\",\"NativeReferenceName\":\"DATASETS 1\"},{\"Column\":{\"Expression\":{\"SourceRef\":{\"Source\":\"t\"}},\"Property\":\"PBI_WORKSPACENAME\"},\"Name\":\"USER_OWNERSHIP.PBI_WORKSPACENAME\",\"NativeReferenceName\":\"WORKSPACES\"},{\"Aggregation\":{\"Expression\":{\"Column\":{\"Expression\":{\"SourceRef\":{\"Source\":\"t\"}},\"Property\":\"PBI_WORKSPACEID\"}},\"Function\":2},\"Name\":\"Min(USER_OWNERSHIP.PBI_WORKSPACEID)\",\"NativeReferenceName\":\"WORKSPACE CNT\"},{\"Aggregation\":{\"Expression\":{\"Column\":{\"Expression\":{\"SourceRef\":{\"Source\":\"t\"}},\"Property\":\"PBI_DATASETID\"}},\"Function\":2},\"Name\":\"Min(USER_OWNERSHIP.PBI_DATASETID)\",\"NativeReferenceName\":\"DATASET CNT\"},{\"Aggregation\":{\"Expression\":{\"Column\":{\"Expression\":{\"SourceRef\":{\"Source\":\"t\"}},\"Property\":\"PBI_ITEMNAME\"}},\"Function\":2},\"Name\":\"Min(USER_OWNERSHIP.PBI_ITEMNAME)\",\"NativeReferenceName\":\"REPORT CNT\"}],\"OrderBy\":[{\"Direction\":1,\"Expression\":{\"Column\":{\"Expression\":{\"SourceRef\":{\"Source\":\"t\"}},\"Property\":\"PBI_WORKSPACENAME\"}}}]},\"expansionStates\":[{\"roles\":[\"Rows\"],\"levels\":[{\"queryRefs\":[\"USER_OWNERSHIP.PBI_WORKSPACENAME\"],\"isCollapsed\":true,\"identityKeys\":[{\"Column\":{\"Expression\":{\"SourceRef\":{\"Entity\":\"USER_OWNERSHIP\"}},\"Property\":\"PBI_WORKSPACENAME\"}}],\"isPinned\":true},{\"queryRefs\":[\"USER_OWNERSHIP.PBI_DATASETNAME\"],\"isCollapsed\":true,\"isPinned\":true}],\"root\":{\"identityValues\":null,\"children\":[{\"identityValues\":[{\"Literal\":{\"Value\":\"'My workspace'\"}}]}]}}],\"columnProperties\":{\"TOOL_PBI_USER_USAGE.PBI_WORKSPACENAME\":{\"displayName\":\"WORKSPACES\"},\"TOOL_PBI_USER_USAGE.PBI_WORKSPACESTATE\":{\"displayName\":\"STATE\"},\"TOOL_PBI_USER_USAGE.PBI_DATASETNAME\":{\"displayName\":\"DATASETS\"},\"TOOL_PBI_USER_USAGE.PBI_ITEMNAME\":{\"displayName\":\"ITEMS\"},\"TOOL_PBI_USER_USAGE.PBI_USAGE_ACTIVITY\":{\"displayName\":\"USAGE ACTIVITY\"},\"TOOL_PBI_USER_USAGE.PBI_USAGE_DATE\":{\"displayName\":\"USAGE DATE\"},\"TOOL_PBI_USER_USAGE.PBI_WORKSPACE_USER\":{\"displayName\":\"WORKSPACE OWNER\"},\"TOOL_PBI_USER_USAGE.PBI_DATASETCONFIGUREDBY\":{\"displayName\":\"DATASET OWNER\"},\"TOOL_PBI_USER_USAGE.PBI_DATASETCREATEDDATE\":{\"displayName\":\"DATASET CREATED DATE\"},\"TOOL_PBI_USER_USAGE.PBI_USAGE_USERID_EMAIL\":{\"displayName\":\"USER\"},\"USER_OWNERSHIP.PBI_WORKSPACENAME\":{\"displayName\":\"WORKSPACES\"},\"USER_OWNERSHIP.PBI_DATASETNAME\":{\"displayName\":\"DATASETS\"},\"Min(USER_OWNERSHIP.PBI_WORKSPACEID)\":{\"displayName\":\"WORKSPACE CNT\"},\"Min(USER_OWNERSHIP.PBI_DATASETID)\":{\"displayName\":\"DATASET CNT\"},\"Min(USER_OWNERSHIP.PBI_ITEMNAME)\":{\"displayName\":\"REPORT CNT\"}},\"drillFilterOtherVisuals\":true,\"objects\":{\"columnWidth\":[{\"properties\":{\"value\":{\"expr\":{\"Literal\":{\"Value\":\"290.2253603909946D\"}}}},\"selector\":{\"metadata\":\"TOOL_PBI_USER_USAGE.PBI_ITEMNAME\"}},{\"properties\":{\"value\":{\"expr\":{\"Literal\":{\"Value\":\"314.7016634617759D\"}}}},\"selector\":{\"metadata\":\"TOOL_PBI_USER_USAGE.PBI_WORKSPACENAME\"}},{\"properties\":{\"value\":{\"expr\":{\"Literal\":{\"Value\":\"149.19984079202897D\"}}}},\"selector\":{\"metadata\":\"TOOL_PBI_USER_USAGE.PBI_USAGE_ACTIVITY\"}},{\"properties\":{\"value\":{\"expr\":{\"Literal\":{\"Value\":\"298.34256059451167D\"}}}},\"selector\":{\"metadata\":\"USER_OWNERSHIP.PBI_DATASETNAME\"}},{\"properties\":{\"value\":{\"expr\":{\"Literal\":{\"Value\":\"283.22235715616137D\"}}}},\"selector\":{\"metadata\":\"USER_OWNERSHIP.PBI_WORKSPACENAME\"}}],\"values\":[{\"properties\":{\"fontSize\":{\"expr\":{\"Literal\":{\"Value\":\"9D\"}}}}},{\"properties\":{\"webURL\":{\"expr\":{\"Aggregation\":{\"Expression\":{\"Column\":{\"Expression\":{\"SourceRef\":{\"Entity\":\"USER_OWNERSHIP\"}},\"Property\":\"WS_Link\"}},\"Function\":3}}},\"fontColor\":{\"solid\":{\"color\":{\"expr\":{\"Conditional\":{\"Cases\":[{\"Condition\":{\"Not\":{\"Expression\":{\"Comparison\":{\"ComparisonKind\":0,\"Left\":{\"Aggregation\":{\"Expression\":{\"Column\":{\"Expression\":{\"SourceRef\":{\"Entity\":\"USER_OWNERSHIP\"}},\"Property\":\"PBI_WORKSPACENAME\"}},\"Function\":3}},\"Right\":{\"Literal\":{\"Value\":\"''\"}}},\"Annotations\":{\"PowerBI.SQExprEvaluationKind\":1,\"PowerBI.SQExprTextOperatorOption\":12}}}},\"Value\":{\"Literal\":{\"Value\":\"'#414fb1'\"}}}]}}}}}},\"selector\":{\"data\":[{\"dataViewWildcard\":{\"matchingOption\":1}}],\"metadata\":\"TOOL_PBI_USER_USAGE.PBI_WORKSPACENAME\"}},{\"properties\":{\"webURL\":{\"expr\":{\"Aggregation\":{\"Expression\":{\"Column\":{\"Expression\":{\"SourceRef\":{\"Entity\":\"USER_OWNERSHIP\"}},\"Property\":\"DS_Link\"}},\"Function\":3}}},\"fontColor\":{\"solid\":{\"color\":{\"expr\":{\"Conditional\":{\"Cases\":[{\"Condition\":{\"Not\":{\"Expression\":{\"Comparison\":{\"ComparisonKind\":0,\"Left\":{\"Aggregation\":{\"Expression\":{\"Column\":{\"Expression\":{\"SourceRef\":{\"Entity\":\"USER_OWNERSHIP\"}},\"Property\":\"PBI_DATASETNAME\"}},\"Function\":3}},\"Right\":{\"Literal\":{\"Value\":\"''\"}}},\"Annotations\":{\"PowerBI.SQExprEvaluationKind\":1,\"PowerBI.SQExprTextOperatorOption\":12}}}},\"Value\":{\"Literal\":{\"Value\":\"'#414fb1'\"}}}]}}}}}},\"selector\":{\"data\":[{\"dataViewWildcard\":{\"matchingOption\":1}}],\"metadata\":\"TOOL_PBI_USER_USAGE.PBI_DATASETNAME\"}},{\"properties\":{\"fontColor\":{\"solid\":{\"color\":{\"expr\":{\"Conditional\":{\"Cases\":[{\"Condition\":{\"Comparison\":{\"ComparisonKind\":0,\"Left\":{\"Aggregation\":{\"Expression\":{\"Column\":{\"Expression\":{\"SourceRef\":{\"Entity\":\"USER_OWNERSHIP\"}},\"Property\":\"PBI_WORKSPACESTATE\"}},\"Function\":3}},\"Right\":{\"Literal\":{\"Value\":\"'Deleted'\"}}},\"Annotations\":{\"PowerBI.SQExprEvaluationKind\":1,\"PowerBI.SQExprTextOperatorOption\":2}},\"Value\":{\"Literal\":{\"Value\":\"'#D64550'\"}}}]}}}}}},\"selector\":{\"data\":[{\"dataViewWildcard\":{\"matchingOption\":1}}],\"metadata\":\"TOOL_PBI_USER_USAGE.PBI_WORKSPACESTATE\"}}],\"rowHeaders\":[{\"properties\":{\"stepped\":{\"expr\":{\"Literal\":{\"Value\":\"false\"}}}}}],\"subTotals\":[{\"properties\":{\"rowSubtotals\":{\"expr\":{\"Literal\":{\"Value\":\"true\"}}},\"perRowLevel\":{\"expr\":{\"Literal\":{\"Value\":\"false\"}}},\"columnSubtotals\":{\"expr\":{\"Literal\":{\"Value\":\"false\"}}},\"rowSubtotalsLabel\":{\"expr\":{\"Literal\":{\"Value\":\"'Total'\"}}}}},{\"properties\":{\"levelSubtotalLabel\":{\"expr\":{\"Literal\":{\"Value\":\"'WT'\"}}},\"levelSubtotalEnabled\":{\"expr\":{\"Literal\":{\"Value\":\"false\"}}}},\"selector\":{\"metadata\":\"USER_OWNERSHIP.PBI_WORKSPACENAME\"}}],\"columnFormatting\":[{\"properties\":{\"styleValues\":{\"expr\":{\"Literal\":{\"Value\":\"false\"}}},\"styleTotal\":{\"expr\":{\"Literal\":{\"Value\":\"true\"}}},\"styleHeader\":{\"expr\":{\"Literal\":{\"Value\":\"false\"}}}},\"selector\":{\"metadata\":\"Min(USER_OWNERSHIP.PBI_WORKSPACEID)\"}}]},\"vcObjects\":{\"border\":[{\"properties\":{\"show\":{\"expr\":{\"Literal\":{\"Value\":\"true\"}}}}}]}}}",
          "filters": "[]",
          "height": 277.76,
          "width": 1025.48,
          "x": 28.51,
          "y": 138.35,
          "z": 1000.00
        },
        {
          "config": "{\"name\":\"7b2c20ded6fff5ac4498\",\"layouts\":[{\"id\":0,\"position\":{\"x\":28.753623188405797,\"y\":433.15942028985506,\"z\":3000,\"width\":1234.5507246376812,\"height\":286.60869565217394,\"tabOrder\":3000}}],\"singleVisual\":{\"visualType\":\"tableEx\",\"projections\":{\"Values\":[{\"queryRef\":\"Dim_Employee.EMPLOYEE_FULL_NAME\"},{\"queryRef\":\"USER_OWNERSHIP.TYPE\"},{\"queryRef\":\"USER_OWNERSHIP.PBI_WORKSPACENAME\"},{\"queryRef\":\"USER_OWNERSHIP.PBI_WORKSPACE_USER\"},{\"queryRef\":\"USER_OWNERSHIP.PBI_DATASETNAME\"},{\"queryRef\":\"USER_OWNERSHIP.PBI_DATASETCONFIGUREDBY\"},{\"queryRef\":\"USER_OWNERSHIP.PBI_DATASETCREATEDDATE\"},{\"queryRef\":\"USER_OWNERSHIP.PBI_ITEMNAME\"},{\"queryRef\":\"USER_OWNERSHIP.PBI_USAGE_USERID_EMAIL\"},{\"queryRef\":\"USER_OWNERSHIP.PBI_USAGE_ACTIVITY\"},{\"queryRef\":\"USER_OWNERSHIP.PBI_USAGE_DATE\"}]},\"prototypeQuery\":{\"Version\":2,\"From\":[{\"Name\":\"t\",\"Entity\":\"USER_OWNERSHIP\",\"Type\":0},{\"Name\":\"d\",\"Entity\":\"Dim_Employee\",\"Type\":0}],\"Select\":[{\"Column\":{\"Expression\":{\"SourceRef\":{\"Source\":\"t\"}},\"Property\":\"PBI_WORKSPACENAME\"},\"Name\":\"USER_OWNERSHIP.PBI_WORKSPACENAME\",\"NativeReferenceName\":\"WORKSPACES\"},{\"Column\":{\"Expression\":{\"SourceRef\":{\"Source\":\"t\"}},\"Property\":\"PBI_DATASETNAME\"},\"Name\":\"USER_OWNERSHIP.PBI_DATASETNAME\",\"NativeReferenceName\":\"DATASETS 1\"},{\"Column\":{\"Expression\":{\"SourceRef\":{\"Source\":\"d\"}},\"Property\":\"EMPLOYEE_FULL_NAME\"},\"Name\":\"Dim_Employee.EMPLOYEE_FULL_NAME\",\"NativeReferenceName\":\"EMPLOYEE\"},{\"Column\":{\"Expression\":{\"SourceRef\":{\"Source\":\"t\"}},\"Property\":\"PBI_WORKSPACE_USER\"},\"Name\":\"USER_OWNERSHIP.PBI_WORKSPACE_USER\",\"NativeReferenceName\":\"WORKSPACE OWNER\"},{\"Column\":{\"Expression\":{\"SourceRef\":{\"Source\":\"t\"}},\"Property\":\"PBI_DATASETCONFIGUREDBY\"},\"Name\":\"USER_OWNERSHIP.PBI_DATASETCONFIGUREDBY\",\"NativeReferenceName\":\"DATASET OWNER\"},{\"Column\":{\"Expression\":{\"SourceRef\":{\"Source\":\"t\"}},\"Property\":\"PBI_DATASETCREATEDDATE\"},\"Name\":\"USER_OWNERSHIP.PBI_DATASETCREATEDDATE\",\"NativeReferenceName\":\"DATASET CREATED DATE\"},{\"Column\":{\"Expression\":{\"SourceRef\":{\"Source\":\"t\"}},\"Property\":\"PBI_ITEMNAME\"},\"Name\":\"USER_OWNERSHIP.PBI_ITEMNAME\",\"NativeReferenceName\":\"REPORT\"},{\"Column\":{\"Expression\":{\"SourceRef\":{\"Source\":\"t\"}},\"Property\":\"PBI_USAGE_USERID_EMAIL\"},\"Name\":\"USER_OWNERSHIP.PBI_USAGE_USERID_EMAIL\",\"NativeReferenceName\":\"REPORT USER\"},{\"Column\":{\"Expression\":{\"SourceRef\":{\"Source\":\"t\"}},\"Property\":\"PBI_USAGE_ACTIVITY\"},\"Name\":\"USER_OWNERSHIP.PBI_USAGE_ACTIVITY\",\"NativeReferenceName\":\"ACTIVITY\"},{\"Column\":{\"Expression\":{\"SourceRef\":{\"Source\":\"t\"}},\"Property\":\"PBI_USAGE_DATE\"},\"Name\":\"USER_OWNERSHIP.PBI_USAGE_DATE\",\"NativeReferenceName\":\"ACTIVITY DATE\"},{\"Column\":{\"Expression\":{\"SourceRef\":{\"Source\":\"t\"}},\"Property\":\"TYPE\"},\"Name\":\"USER_OWNERSHIP.TYPE\",\"NativeReferenceName\":\"TYPE\"}],\"OrderBy\":[{\"Direction\":1,\"Expression\":{\"Column\":{\"Expression\":{\"SourceRef\":{\"Source\":\"t\"}},\"Property\":\"TYPE\"}}}]},\"columnProperties\":{\"TOOL_PBI_USER_USAGE.PBI_WORKSPACENAME\":{\"displayName\":\"WORKSPACES\"},\"TOOL_PBI_USER_USAGE.PBI_WORKSPACESTATE\":{\"displayName\":\"STATE\"},\"TOOL_PBI_USER_USAGE.PBI_DATASETNAME\":{\"displayName\":\"DATASETS\"},\"TOOL_PBI_USER_USAGE.PBI_ITEMNAME\":{\"displayName\":\"ITEMS\"},\"TOOL_PBI_USER_USAGE.PBI_USAGE_ACTIVITY\":{\"displayName\":\"USAGE ACTIVITY\"},\"TOOL_PBI_USER_USAGE.PBI_USAGE_DATE\":{\"displayName\":\"USAGE DATE\"},\"TOOL_PBI_USER_USAGE.PBI_WORKSPACE_USER\":{\"displayName\":\"WORKSPACE OWNER\"},\"TOOL_PBI_USER_USAGE.PBI_DATASETCONFIGUREDBY\":{\"displayName\":\"DATASET OWNER\"},\"TOOL_PBI_USER_USAGE.PBI_DATASETCREATEDDATE\":{\"displayName\":\"DATASET CREATED DATE\"},\"TOOL_PBI_USER_USAGE.PBI_USAGE_USERID_EMAIL\":{\"displayName\":\"USER\"},\"USER_OWNERSHIP.PBI_WORKSPACENAME\":{\"displayName\":\"WORKSPACES\"},\"USER_OWNERSHIP.PBI_DATASETNAME\":{\"displayName\":\"DATASETS\"},\"Min(USER_OWNERSHIP.PBI_WORKSPACEID)\":{\"displayName\":\"WORKSPACE CNT\"},\"Min(USER_OWNERSHIP.PBI_DATASETID)\":{\"displayName\":\"DATASET CNT\"},\"Min(USER_OWNERSHIP.PBI_ITEMNAME)\":{\"displayName\":\"REPORT CNT\"},\"Dim_Employee.EMPLOYEE_FULL_NAME\":{\"displayName\":\"EMPLOYEE\"},\"USER_OWNERSHIP.PBI_WORKSPACE_USER\":{\"displayName\":\"WORKSPACE OWNER\"},\"USER_OWNERSHIP.PBI_DATASETCONFIGUREDBY\":{\"displayName\":\"DATASET OWNER\"},\"USER_OWNERSHIP.PBI_DATASETCREATEDDATE\":{\"displayName\":\"DATASET CREATED DATE\"},\"USER_OWNERSHIP.PBI_ITEMNAME\":{\"displayName\":\"REPORT\"},\"USER_OWNERSHIP.PBI_USAGE_USERID_EMAIL\":{\"displayName\":\"REPORT USER\"},\"USER_OWNERSHIP.PBI_USAGE_ACTIVITY\":{\"displayName\":\"ACTIVITY\"},\"USER_OWNERSHIP.PBI_USAGE_DATE\":{\"displayName\":\"ACTIVITY DATE\"}},\"drillFilterOtherVisuals\":true,\"objects\":{\"columnWidth\":[{\"properties\":{\"value\":{\"expr\":{\"Literal\":{\"Value\":\"290.2253603909946D\"}}}},\"selector\":{\"metadata\":\"TOOL_PBI_USER_USAGE.PBI_ITEMNAME\"}},{\"properties\":{\"value\":{\"expr\":{\"Literal\":{\"Value\":\"314.7016634617759D\"}}}},\"selector\":{\"metadata\":\"TOOL_PBI_USER_USAGE.PBI_WORKSPACENAME\"}},{\"properties\":{\"value\":{\"expr\":{\"Literal\":{\"Value\":\"149.19984079202897D\"}}}},\"selector\":{\"metadata\":\"TOOL_PBI_USER_USAGE.PBI_USAGE_ACTIVITY\"}},{\"properties\":{\"value\":{\"expr\":{\"Literal\":{\"Value\":\"213.93836678496123D\"}}}},\"selector\":{\"metadata\":\"USER_OWNERSHIP.PBI_DATASETNAME\"}},{\"properties\":{\"value\":{\"expr\":{\"Literal\":{\"Value\":\"236.78959710789272D\"}}}},\"selector\":{\"metadata\":\"USER_OWNERSHIP.PBI_WORKSPACENAME\"}},{\"properties\":{\"value\":{\"expr\":{\"Literal\":{\"Value\":\"173.97030339526103D\"}}}},\"selector\":{\"metadata\":\"USER_OWNERSHIP.PBI_DATASETCONFIGUREDBY\"}},{\"properties\":{\"value\":{\"expr\":{\"Literal\":{\"Value\":\"89.59420289855072D\"}}}},\"selector\":{\"metadata\":\"USER_OWNERSHIP.TYPE\"}}],\"values\":[{\"properties\":{\"fontSize\":{\"expr\":{\"Literal\":{\"Value\":\"9D\"}}}}},{\"properties\":{\"webURL\":{\"expr\":{\"Aggregation\":{\"Expression\":{\"Column\":{\"Expression\":{\"SourceRef\":{\"Entity\":\"USER_OWNERSHIP\"}},\"Property\":\"WS_Link\"}},\"Function\":3}}},\"fontColor\":{\"solid\":{\"color\":{\"expr\":{\"Conditional\":{\"Cases\":[{\"Condition\":{\"Not\":{\"Expression\":{\"Comparison\":{\"ComparisonKind\":0,\"Left\":{\"Aggregation\":{\"Expression\":{\"Column\":{\"Expression\":{\"SourceRef\":{\"Entity\":\"USER_OWNERSHIP\"}},\"Property\":\"PBI_WORKSPACENAME\"}},\"Function\":3}},\"Right\":{\"Literal\":{\"Value\":\"''\"}}},\"Annotations\":{\"PowerBI.SQExprEvaluationKind\":1,\"PowerBI.SQExprTextOperatorOption\":12}}}},\"Value\":{\"Literal\":{\"Value\":\"'#414fb1'\"}}}]}}}}}},\"selector\":{\"data\":[{\"dataViewWildcard\":{\"matchingOption\":1}}],\"metadata\":\"TOOL_PBI_USER_USAGE.PBI_WORKSPACENAME\"}},{\"properties\":{\"webURL\":{\"expr\":{\"Aggregation\":{\"Expression\":{\"Column\":{\"Expression\":{\"SourceRef\":{\"Entity\":\"USER_OWNERSHIP\"}},\"Property\":\"DS_Link\"}},\"Function\":3}}},\"fontColor\":{\"solid\":{\"color\":{\"expr\":{\"Conditional\":{\"Cases\":[{\"Condition\":{\"Not\":{\"Expression\":{\"Comparison\":{\"ComparisonKind\":0,\"Left\":{\"Aggregation\":{\"Expression\":{\"Column\":{\"Expression\":{\"SourceRef\":{\"Entity\":\"USER_OWNERSHIP\"}},\"Property\":\"PBI_DATASETNAME\"}},\"Function\":3}},\"Right\":{\"Literal\":{\"Value\":\"''\"}}},\"Annotations\":{\"PowerBI.SQExprEvaluationKind\":1,\"PowerBI.SQExprTextOperatorOption\":12}}}},\"Value\":{\"Literal\":{\"Value\":\"'#414fb1'\"}}}]}}}}}},\"selector\":{\"data\":[{\"dataViewWildcard\":{\"matchingOption\":1}}],\"metadata\":\"TOOL_PBI_USER_USAGE.PBI_DATASETNAME\"}},{\"properties\":{\"fontColor\":{\"solid\":{\"color\":{\"expr\":{\"Conditional\":{\"Cases\":[{\"Condition\":{\"Comparison\":{\"ComparisonKind\":0,\"Left\":{\"Aggregation\":{\"Expression\":{\"Column\":{\"Expression\":{\"SourceRef\":{\"Entity\":\"USER_OWNERSHIP\"}},\"Property\":\"PBI_WORKSPACESTATE\"}},\"Function\":3}},\"Right\":{\"Literal\":{\"Value\":\"'Deleted'\"}}},\"Annotations\":{\"PowerBI.SQExprEvaluationKind\":1,\"PowerBI.SQExprTextOperatorOption\":2}},\"Value\":{\"Literal\":{\"Value\":\"'#D64550'\"}}}]}}}}}},\"selector\":{\"data\":[{\"dataViewWildcard\":{\"matchingOption\":1}}],\"metadata\":\"TOOL_PBI_USER_USAGE.PBI_WORKSPACESTATE\"}},{\"properties\":{\"webURL\":{\"expr\":{\"Aggregation\":{\"Expression\":{\"Column\":{\"Expression\":{\"SourceRef\":{\"Entity\":\"USER_OWNERSHIP\"}},\"Property\":\"WS_Link\"}},\"Function\":3}}},\"fontColor\":{\"solid\":{\"color\":{\"expr\":{\"Conditional\":{\"Cases\":[{\"Condition\":{\"Not\":{\"Expression\":{\"Comparison\":{\"ComparisonKind\":0,\"Left\":{\"Aggregation\":{\"Expression\":{\"Column\":{\"Expression\":{\"SourceRef\":{\"Entity\":\"USER_OWNERSHIP\"}},\"Property\":\"PBI_WORKSPACENAME\"}},\"Function\":3}},\"Right\":{\"Literal\":{\"Value\":\"''\"}}},\"Annotations\":{\"PowerBI.SQExprEvaluationKind\":1,\"PowerBI.SQExprTextOperatorOption\":12}}}},\"Value\":{\"Literal\":{\"Value\":\"'#414fb1'\"}}}]}}}}}},\"selector\":{\"data\":[{\"dataViewWildcard\":{\"matchingOption\":1}}],\"metadata\":\"USER_OWNERSHIP.PBI_WORKSPACENAME\"}},{\"properties\":{\"webURL\":{\"expr\":{\"Aggregation\":{\"Expression\":{\"Column\":{\"Expression\":{\"SourceRef\":{\"Entity\":\"USER_OWNERSHIP\"}},\"Property\":\"DS_Link\"}},\"Function\":3}}},\"fontColor\":{\"solid\":{\"color\":{\"expr\":{\"Conditional\":{\"Cases\":[{\"Condition\":{\"Not\":{\"Expression\":{\"Comparison\":{\"ComparisonKind\":0,\"Left\":{\"Aggregation\":{\"Expression\":{\"Column\":{\"Expression\":{\"SourceRef\":{\"Entity\":\"USER_OWNERSHIP\"}},\"Property\":\"PBI_DATASETNAME\"}},\"Function\":3}},\"Right\":{\"Literal\":{\"Value\":\"''\"}}},\"Annotations\":{\"PowerBI.SQExprEvaluationKind\":1,\"PowerBI.SQExprTextOperatorOption\":12}}}},\"Value\":{\"Literal\":{\"Value\":\"'#414fb1'\"}}}]}}}}}},\"selector\":{\"data\":[{\"dataViewWildcard\":{\"matchingOption\":1}}],\"metadata\":\"USER_OWNERSHIP.PBI_DATASETNAME\"}}],\"columnFormatting\":[{\"properties\":{\"styleValues\":{\"expr\":{\"Literal\":{\"Value\":\"false\"}}},\"styleTotal\":{\"expr\":{\"Literal\":{\"Value\":\"true\"}}},\"styleHeader\":{\"expr\":{\"Literal\":{\"Value\":\"false\"}}}},\"selector\":{\"metadata\":\"Min(USER_OWNERSHIP.PBI_WORKSPACEID)\"}}]},\"vcObjects\":{\"border\":[{\"properties\":{\"show\":{\"expr\":{\"Literal\":{\"Value\":\"true\"}}}}}]}}}",
          "filters": "[]",
          "height": 286.61,
          "width": 1234.55,
          "x": 28.75,
          "y": 433.16,
          "z": 3000.00
        },
        {
          "config": "{\"name\":\"7d3d5a5e9b47c95786e4\",\"layouts\":[{\"id\":0,\"position\":{\"x\":1071.304347826087,\"y\":85.33333333333333,\"z\":7000,\"width\":192,\"height\":64,\"tabOrder\":7000}}],\"singleVisual\":{\"visualType\":\"slicer\",\"projections\":{\"Values\":[{\"queryRef\":\"Dim_Employee.EMPLOYEE_FULL_NAME\",\"active\":true}]},\"prototypeQuery\":{\"Version\":2,\"From\":[{\"Name\":\"v\",\"Entity\":\"V_MIGR_SCORECARD_ZID_MONTH\",\"Type\":0},{\"Name\":\"d\",\"Entity\":\"Dim_Employee\",\"Type\":0}],\"Select\":[{\"Column\":{\"Expression\":{\"SourceRef\":{\"Source\":\"d\"}},\"Property\":\"EMPLOYEE_FULL_NAME\"},\"Name\":\"Dim_Employee.EMPLOYEE_FULL_NAME\",\"NativeReferenceName\":\"DATASET OWNER\"}],\"OrderBy\":[{\"Direction\":1,\"Expression\":{\"Column\":{\"Expression\":{\"SourceRef\":{\"Source\":\"v\"}},\"Property\":\"SR_DIR_OR_DIR\"}}}]},\"columnProperties\":{\"Dim_Employee.EMPLOYEE_FULL_NAME\":{\"displayName\":\"DATASET OWNER\"}},\"drillFilterOtherVisuals\":true,\"hasDefaultSort\":true,\"objects\":{\"data\":[{\"properties\":{\"mode\":{\"expr\":{\"Literal\":{\"Value\":\"'Dropdown'\"}}}}}],\"general\":[{\"properties\":{\"selfFilterEnabled\":{\"expr\":{\"Literal\":{\"Value\":\"true\"}}}}}]},\"vcObjects\":{\"border\":[{\"properties\":{\"show\":{\"expr\":{\"Literal\":{\"Value\":\"true\"}}}}}],\"title\":[{\"properties\":{\"text\":{\"expr\":{\"Literal\":{\"Value\":\"'Slicer - Employee'\"}}}}}]}}}",
          "filters": "[]",
          "height": 64.00,
          "width": 192.00,
          "x": 1071.30,
          "y": 85.33,
          "z": 7000.00
        },
        {
          "config": "{\"name\":\"af06a96845006ebeb21e\",\"layouts\":[{\"id\":0,\"position\":{\"x\":419.27392739273927,\"y\":0,\"z\":2000,\"width\":368.5808580858086,\"height\":124.62046204620462,\"tabOrder\":2000}}],\"singleVisual\":{\"visualType\":\"barChart\",\"projections\":{\"Y\":[{\"queryRef\":\"Count(USER_OWNERSHIP.PBI_WORKSPACEID)\"},{\"queryRef\":\"Count(USER_OWNERSHIP.PBI_DATASETID)\"},{\"queryRef\":\"Count(USER_OWNERSHIP.PBI_ITEMNAME)\"}]},\"prototypeQuery\":{\"Version\":2,\"From\":[{\"Name\":\"t\",\"Entity\":\"USER_OWNERSHIP\",\"Type\":0}],\"Select\":[{\"Aggregation\":{\"Expression\":{\"Column\":{\"Expression\":{\"SourceRef\":{\"Source\":\"t\"}},\"Property\":\"PBI_WORKSPACEID\"}},\"Function\":2},\"Name\":\"Count(USER_OWNERSHIP.PBI_WORKSPACEID)\",\"NativeReferenceName\":\"WORKSPACES\"},{\"Aggregation\":{\"Expression\":{\"Column\":{\"Expression\":{\"SourceRef\":{\"Source\":\"t\"}},\"Property\":\"PBI_DATASETID\"}},\"Function\":2},\"Name\":\"Count(USER_OWNERSHIP.PBI_DATASETID)\",\"NativeReferenceName\":\"DATASETS\"},{\"Aggregation\":{\"Expression\":{\"Column\":{\"Expression\":{\"SourceRef\":{\"Source\":\"t\"}},\"Property\":\"PBI_ITEMNAME\"}},\"Function\":2},\"Name\":\"Count(USER_OWNERSHIP.PBI_ITEMNAME)\",\"NativeReferenceName\":\"REPORTS\"}],\"OrderBy\":[{\"Direction\":2,\"Expression\":{\"Aggregation\":{\"Expression\":{\"Column\":{\"Expression\":{\"SourceRef\":{\"Source\":\"t\"}},\"Property\":\"PBI_WORKSPACEID\"}},\"Function\":2}}}]},\"columnProperties\":{\"TOOL_PBI_USER_USAGE.PBI_WORKSPACENAME\":{\"displayName\":\"WORKSPACES\"},\"TOOL_PBI_USER_USAGE.PBI_WORKSPACESTATE\":{\"displayName\":\"STATE\"},\"TOOL_PBI_USER_USAGE.PBI_DATASETNAME\":{\"displayName\":\"DATASETS\"},\"TOOL_PBI_USER_USAGE.PBI_ITEMNAME\":{\"displayName\":\"ITEMS\"},\"TOOL_PBI_USER_USAGE.PBI_USAGE_ACTIVITY\":{\"displayName\":\"USAGE ACTIVITY\"},\"TOOL_PBI_USER_USAGE.PBI_USAGE_DATE\":{\"displayName\":\"USAGE DATE\"},\"TOOL_PBI_USER_USAGE.PBI_WORKSPACE_USER\":{\"displayName\":\"WORKSPACE OWNER\"},\"TOOL_PBI_USER_USAGE.PBI_DATASETCONFIGUREDBY\":{\"displayName\":\"DATASET OWNER\"},\"TOOL_PBI_USER_USAGE.PBI_DATASETCREATEDDATE\":{\"displayName\":\"DATASET CREATED DATE\"},\"TOOL_PBI_USER_USAGE.PBI_USAGE_USERID_EMAIL\":{\"displayName\":\"USER\"},\"Min(USER_OWNERSHIP.PBI_WORKSPACEID)\":{\"displayName\":\"WORKSPACE CNT\"},\"Min(USER_OWNERSHIP.PBI_DATASETID)\":{\"displayName\":\"DATASET CNT\"},\"Min(USER_OWNERSHIP.PBI_ITEMNAME)\":{\"displayName\":\"REPORT CNT\"},\"Count(USER_OWNERSHIP.PBI_WORKSPACEID)\":{\"displayName\":\"WORKSPACES\"},\"Count(USER_OWNERSHIP.PBI_DATASETID)\":{\"displayName\":\"DATASETS\"},\"Count(USER_OWNERSHIP.PBI_ITEMNAME)\":{\"displayName\":\"REPORTS\"}},\"drillFilterOtherVisuals\":true,\"hasDefaultSort\":true,\"objects\":{\"labels\":[{\"properties\":{\"show\":{\"expr\":{\"Literal\":{\"Value\":\"true\"}}},\"fontSize\":{\"expr\":{\"Literal\":{\"Value\":\"8D\"}}},\"labelOverflow\":{\"expr\":{\"Literal\":{\"Value\":\"true\"}}}}}],\"valueAxis\":[{\"properties\":{\"show\":{\"expr\":{\"Literal\":{\"Value\":\"true\"}}},\"showAxisTitle\":{\"expr\":{\"Literal\":{\"Value\":\"false\"}}}}}],\"totals\":[{\"properties\":{\"show\":{\"expr\":{\"Literal\":{\"Value\":\"false\"}}}}}],\"categoryAxis\":[{\"properties\":{\"preferredCategoryWidth\":{\"expr\":{\"Literal\":{\"Value\":\"36D\"}}},\"innerPadding\":{\"expr\":{\"Literal\":{\"Value\":\"20L\"}}}}}]},\"vcObjects\":{\"title\":[{\"properties\":{\"text\":{\"expr\":{\"Literal\":{\"Value\":\"'Summary'\"}}},\"show\":{\"expr\":{\"Literal\":{\"Value\":\"false\"}}}}}],\"border\":[{\"properties\":{\"show\":{\"expr\":{\"Literal\":{\"Value\":\"true\"}}}}}]}}}",
          "filters": "[]",
          "height": 124.62,
          "width": 368.58,
          "x": 419.27,
          "y": 0.00,
          "z": 2000.00
        },
        {
          "config": "{\"name\":\"d206312b9902d4e80251\",\"layouts\":[{\"id\":0,\"position\":{\"x\":1071.304347826087,\"y\":166.95652173913044,\"z\":8000,\"width\":192,\"height\":64,\"tabOrder\":8000}}],\"singleVisual\":{\"visualType\":\"slicer\",\"projections\":{\"Values\":[{\"queryRef\":\"Dim_Employee.EMPLOYEE_FULL_NAME\",\"active\":true}]},\"prototypeQuery\":{\"Version\":2,\"From\":[{\"Name\":\"v\",\"Entity\":\"V_MIGR_SCORECARD_ZID_MONTH\",\"Type\":0},{\"Name\":\"d\",\"Entity\":\"Dim_Employee\",\"Type\":0}],\"Select\":[{\"Column\":{\"Expression\":{\"SourceRef\":{\"Source\":\"d\"}},\"Property\":\"EMPLOYEE_FULL_NAME\"},\"Name\":\"Dim_Employee.EMPLOYEE_FULL_NAME\",\"NativeReferenceName\":\"REPORT USER\"}],\"OrderBy\":[{\"Direction\":1,\"Expression\":{\"Column\":{\"Expression\":{\"SourceRef\":{\"Source\":\"v\"}},\"Property\":\"SR_DIR_OR_DIR\"}}}]},\"columnProperties\":{\"Dim_Employee.EMPLOYEE_FULL_NAME\":{\"displayName\":\"REPORT USER\"}},\"drillFilterOtherVisuals\":true,\"hasDefaultSort\":true,\"objects\":{\"data\":[{\"properties\":{\"mode\":{\"expr\":{\"Literal\":{\"Value\":\"'Dropdown'\"}}}}}],\"general\":[{\"properties\":{\"selfFilterEnabled\":{\"expr\":{\"Literal\":{\"Value\":\"true\"}}}}}]},\"vcObjects\":{\"border\":[{\"properties\":{\"show\":{\"expr\":{\"Literal\":{\"Value\":\"true\"}}}}}],\"title\":[{\"properties\":{\"text\":{\"expr\":{\"Literal\":{\"Value\":\"'Slicer - Employee'\"}}}}}]}}}",
          "filters": "[]",
          "height": 64.00,
          "width": 192.00,
          "x": 1071.30,
          "y": 166.96,
          "z": 8000.00
        }
      ],
      "width": 1280.00
    },
    {
      "config": "{\"relationships\":[{\"source\":\"43614b9508a0c3b05204\",\"target\":\"0dba3a1bbc5ed7be3000\",\"type\":3}]}",
      "displayName": "Home",
      "displayOption": 1,
      "filters": "[]",
      "height": 720.00,
      "name": "ReportSection49215fd3124c1c49303e",
      "visualContainers": [
        {
          "config": "{\"name\":\"037ebf4aeb17e851a02b\",\"layouts\":[{\"id\":0,\"position\":{\"x\":1071.304347826087,\"y\":85.33333333333333,\"z\":7000,\"width\":192,\"height\":64,\"tabOrder\":7000}}],\"singleVisual\":{\"visualType\":\"slicer\",\"projections\":{\"Values\":[{\"queryRef\":\"USER_OWNERSHIP.PBI_DATASETCONFIGUREDBY\",\"active\":true}]},\"prototypeQuery\":{\"Version\":2,\"From\":[{\"Name\":\"v\",\"Entity\":\"V_MIGR_SCORECARD_ZID_MONTH\",\"Type\":0},{\"Name\":\"u\",\"Entity\":\"USER_OWNERSHIP\",\"Type\":0}],\"Select\":[{\"Column\":{\"Expression\":{\"SourceRef\":{\"Source\":\"u\"}},\"Property\":\"PBI_DATASETCONFIGUREDBY\"},\"Name\":\"USER_OWNERSHIP.PBI_DATASETCONFIGUREDBY\",\"NativeReferenceName\":\"DATASET OWNER\"}],\"OrderBy\":[{\"Direction\":1,\"Expression\":{\"Column\":{\"Expression\":{\"SourceRef\":{\"Source\":\"v\"}},\"Property\":\"SR_DIR_OR_DIR\"}}}]},\"columnProperties\":{\"USER_OWNERSHIP.PBI_DATASETCONFIGUREDBY\":{\"displayName\":\"DATASET OWNER\"}},\"drillFilterOtherVisuals\":true,\"hasDefaultSort\":true,\"objects\":{\"data\":[{\"properties\":{\"mode\":{\"expr\":{\"Literal\":{\"Value\":\"'Dropdown'\"}}}}}],\"general\":[{\"properties\":{\"selfFilterEnabled\":{\"expr\":{\"Literal\":{\"Value\":\"true\"}}}}}]},\"vcObjects\":{\"border\":[{\"properties\":{\"show\":{\"expr\":{\"Literal\":{\"Value\":\"true\"}}}}}],\"title\":[{\"properties\":{\"text\":{\"expr\":{\"Literal\":{\"Value\":\"'Slicer - Employee'\"}}}}}]}}}",
          "filters": "[]",
          "height": 64.00,
          "width": 192.00,
          "x": 1071.30,
          "y": 85.33,
          "z": 7000.00
        },
        {
          "config": "{\"name\":\"0dba3a1bbc5ed7be3000\",\"layouts\":[{\"id\":0,\"position\":{\"x\":419.27392739273927,\"y\":0,\"z\":2000,\"width\":368.5808580858086,\"height\":124.62046204620462,\"tabOrder\":2000}}],\"singleVisual\":{\"visualType\":\"barChart\",\"projections\":{\"Y\":[{\"queryRef\":\"Count(USER_OWNERSHIP.PBI_WORKSPACEID)\"},{\"queryRef\":\"Count(USER_OWNERSHIP.PBI_DATASETID)\"},{\"queryRef\":\"Count(USER_OWNERSHIP.PBI_ITEMNAME)\"}]},\"prototypeQuery\":{\"Version\":2,\"From\":[{\"Name\":\"t\",\"Entity\":\"USER_OWNERSHIP\",\"Type\":0}],\"Select\":[{\"Aggregation\":{\"Expression\":{\"Column\":{\"Expression\":{\"SourceRef\":{\"Source\":\"t\"}},\"Property\":\"PBI_WORKSPACEID\"}},\"Function\":2},\"Name\":\"Count(USER_OWNERSHIP.PBI_WORKSPACEID)\",\"NativeReferenceName\":\"WORKSPACES\"},{\"Aggregation\":{\"Expression\":{\"Column\":{\"Expression\":{\"SourceRef\":{\"Source\":\"t\"}},\"Property\":\"PBI_DATASETID\"}},\"Function\":2},\"Name\":\"Count(USER_OWNERSHIP.PBI_DATASETID)\",\"NativeReferenceName\":\"DATASETS\"},{\"Aggregation\":{\"Expression\":{\"Column\":{\"Expression\":{\"SourceRef\":{\"Source\":\"t\"}},\"Property\":\"PBI_ITEMNAME\"}},\"Function\":2},\"Name\":\"Count(USER_OWNERSHIP.PBI_ITEMNAME)\",\"NativeReferenceName\":\"REPORTS\"}],\"OrderBy\":[{\"Direction\":2,\"Expression\":{\"Aggregation\":{\"Expression\":{\"Column\":{\"Expression\":{\"SourceRef\":{\"Source\":\"t\"}},\"Property\":\"PBI_WORKSPACEID\"}},\"Function\":2}}}]},\"columnProperties\":{\"TOOL_PBI_USER_USAGE.PBI_WORKSPACENAME\":{\"displayName\":\"WORKSPACES\"},\"TOOL_PBI_USER_USAGE.PBI_WORKSPACESTATE\":{\"displayName\":\"STATE\"},\"TOOL_PBI_USER_USAGE.PBI_DATASETNAME\":{\"displayName\":\"DATASETS\"},\"TOOL_PBI_USER_USAGE.PBI_ITEMNAME\":{\"displayName\":\"ITEMS\"},\"TOOL_PBI_USER_USAGE.PBI_USAGE_ACTIVITY\":{\"displayName\":\"USAGE ACTIVITY\"},\"TOOL_PBI_USER_USAGE.PBI_USAGE_DATE\":{\"displayName\":\"USAGE DATE\"},\"TOOL_PBI_USER_USAGE.PBI_WORKSPACE_USER\":{\"displayName\":\"WORKSPACE OWNER\"},\"TOOL_PBI_USER_USAGE.PBI_DATASETCONFIGUREDBY\":{\"displayName\":\"DATASET OWNER\"},\"TOOL_PBI_USER_USAGE.PBI_DATASETCREATEDDATE\":{\"displayName\":\"DATASET CREATED DATE\"},\"TOOL_PBI_USER_USAGE.PBI_USAGE_USERID_EMAIL\":{\"displayName\":\"USER\"},\"Min(USER_OWNERSHIP.PBI_WORKSPACEID)\":{\"displayName\":\"WORKSPACE CNT\"},\"Min(USER_OWNERSHIP.PBI_DATASETID)\":{\"displayName\":\"DATASET CNT\"},\"Min(USER_OWNERSHIP.PBI_ITEMNAME)\":{\"displayName\":\"REPORT CNT\"},\"Count(USER_OWNERSHIP.PBI_WORKSPACEID)\":{\"displayName\":\"WORKSPACES\"},\"Count(USER_OWNERSHIP.PBI_DATASETID)\":{\"displayName\":\"DATASETS\"},\"Count(USER_OWNERSHIP.PBI_ITEMNAME)\":{\"displayName\":\"REPORTS\"}},\"drillFilterOtherVisuals\":true,\"hasDefaultSort\":true,\"objects\":{\"labels\":[{\"properties\":{\"show\":{\"expr\":{\"Literal\":{\"Value\":\"true\"}}},\"fontSize\":{\"expr\":{\"Literal\":{\"Value\":\"8D\"}}},\"labelOverflow\":{\"expr\":{\"Literal\":{\"Value\":\"true\"}}}}}],\"valueAxis\":[{\"properties\":{\"show\":{\"expr\":{\"Literal\":{\"Value\":\"true\"}}},\"showAxisTitle\":{\"expr\":{\"Literal\":{\"Value\":\"false\"}}}}}],\"totals\":[{\"properties\":{\"show\":{\"expr\":{\"Literal\":{\"Value\":\"false\"}}}}}],\"categoryAxis\":[{\"properties\":{\"preferredCategoryWidth\":{\"expr\":{\"Literal\":{\"Value\":\"36D\"}}},\"innerPadding\":{\"expr\":{\"Literal\":{\"Value\":\"20L\"}}}}}]},\"vcObjects\":{\"title\":[{\"properties\":{\"text\":{\"expr\":{\"Literal\":{\"Value\":\"'Summary'\"}}},\"show\":{\"expr\":{\"Literal\":{\"Value\":\"false\"}}}}}],\"border\":[{\"properties\":{\"show\":{\"expr\":{\"Literal\":{\"Value\":\"true\"}}}}}]}}}",
          "filters": "[]",
          "height": 124.62,
          "width": 368.58,
          "x": 419.27,
          "y": 0.00,
          "z": 2000.00
        },
        {
          "config": "{\"name\":\"36d66d22357d300013e2\",\"layouts\":[{\"id\":0,\"position\":{\"x\":28.514851485148515,\"y\":0,\"z\":0,\"width\":378.0858085808581,\"height\":124.62046204620462,\"tabOrder\":0}}],\"singleVisual\":{\"visualType\":\"multiRowCard\",\"projections\":{\"Values\":[{\"queryRef\":\"TOOL_PBI_USER_USAGE.REPORT_MONTH\"},{\"queryRef\":\"Count(TOOL_PBI_USER_USAGE.PBI_WORKSPACEID)\"},{\"queryRef\":\"TOOL_PBI_USER_USAGE.PBI_DATASETID\"},{\"queryRef\":\"TOOL_PBI_USER_USAGE.PBI_ITEMNAME\"}]},\"prototypeQuery\":{\"Version\":2,\"From\":[{\"Name\":\"t\",\"Entity\":\"USER_OWNERSHIP\",\"Type\":0}],\"Select\":[{\"Aggregation\":{\"Expression\":{\"Column\":{\"Expression\":{\"SourceRef\":{\"Source\":\"t\"}},\"Property\":\"PBI_WORKSPACEID\"}},\"Function\":2},\"Name\":\"Count(TOOL_PBI_USER_USAGE.PBI_WORKSPACEID)\",\"NativeReferenceName\":\"Count of PBI_WORKSPACEID1\"},{\"Aggregation\":{\"Expression\":{\"Column\":{\"Expression\":{\"SourceRef\":{\"Source\":\"t\"}},\"Property\":\"PBI_DATASETID\"}},\"Function\":2},\"Name\":\"TOOL_PBI_USER_USAGE.PBI_DATASETID\",\"NativeReferenceName\":\"DATASETS\"},{\"Column\":{\"Expression\":{\"SourceRef\":{\"Source\":\"t\"}},\"Property\":\"REPORT_MONTH\"},\"Name\":\"TOOL_PBI_USER_USAGE.REPORT_MONTH\",\"NativeReferenceName\":\"REPORT_MONTH\"},{\"Aggregation\":{\"Expression\":{\"Column\":{\"Expression\":{\"SourceRef\":{\"Source\":\"t\"}},\"Property\":\"PBI_ITEMNAME\"}},\"Function\":2},\"Name\":\"TOOL_PBI_USER_USAGE.PBI_ITEMNAME\",\"NativeReferenceName\":\"ITEMS\"}],\"OrderBy\":[{\"Direction\":1,\"Expression\":{\"Column\":{\"Expression\":{\"SourceRef\":{\"Source\":\"t\"}},\"Property\":\"REPORT_MONTH\"}}}]},\"columnProperties\":{\"Count(TOOL_PBI_USER_USAGE.PBI_WORKSPACEID)\":{\"displayName\":\"WORKSPACES\"},\"TOOL_PBI_USER_USAGE.PBI_DATASETID\":{\"displayName\":\"DATASETS\"},\"TOOL_PBI_USER_USAGE.PBI_ITEMNAME\":{\"displayName\":\"ITEMS\"}},\"drillFilterOtherVisuals\":true,\"hasDefaultSort\":true,\"objects\":{\"card\":[{\"properties\":{\"barShow\":{\"expr\":{\"Literal\":{\"Value\":\"false\"}}},\"outlineStyle\":{\"expr\":{\"Literal\":{\"Value\":\"0D\"}}}}}],\"categoryLabels\":[{\"properties\":{\"show\":{\"expr\":{\"Literal\":{\"Value\":\"true\"}}}}}],\"dataLabels\":[{\"properties\":{\"fontSize\":{\"expr\":{\"Literal\":{\"Value\":\"20D\"}}}}}]},\"vcObjects\":{\"border\":[{\"properties\":{\"show\":{\"expr\":{\"Literal\":{\"Value\":\"true\"}}}}}]}}}",
          "filters": "[]",
          "height": 124.62,
          "width": 378.09,
          "x": 28.51,
          "y": 0.00,
          "z": 0.00
        },
        {
          "config": "{\"name\":\"406436f7a7c17e68924c\",\"layouts\":[{\"id\":0,\"position\":{\"x\":804.7524752475248,\"y\":62.31023102310231,\"z\":6000,\"width\":249.24092409240924,\"height\":62.31023102310231,\"tabOrder\":6000}}],\"singleVisual\":{\"visualType\":\"slicer\",\"projections\":{\"Values\":[{\"queryRef\":\"USER_OWNERSHIP.PBI_DATASETNAME\",\"active\":true}]},\"prototypeQuery\":{\"Version\":2,\"From\":[{\"Name\":\"v\",\"Entity\":\"V_MIGR_SCORECARD_ZID_MONTH\",\"Type\":0},{\"Name\":\"u\",\"Entity\":\"USER_OWNERSHIP\",\"Type\":0}],\"Select\":[{\"Column\":{\"Expression\":{\"SourceRef\":{\"Source\":\"u\"}},\"Property\":\"PBI_DATASETNAME\"},\"Name\":\"USER_OWNERSHIP.PBI_DATASETNAME\",\"NativeReferenceName\":\"DATASET\"}],\"OrderBy\":[{\"Direction\":1,\"Expression\":{\"Column\":{\"Expression\":{\"SourceRef\":{\"Source\":\"v\"}},\"Property\":\"SR_DIR_OR_DIR\"}}}]},\"columnProperties\":{\"USER_OWNERSHIP.PBI_DATASETNAME\":{\"displayName\":\"DATASET\"}},\"drillFilterOtherVisuals\":true,\"hasDefaultSort\":true,\"objects\":{\"data\":[{\"properties\":{\"mode\":{\"expr\":{\"Literal\":{\"Value\":\"'Dropdown'\"}}}}}],\"general\":[{\"properties\":{\"selfFilterEnabled\":{\"expr\":{\"Literal\":{\"Value\":\"true\"}}}}}]},\"vcObjects\":{\"border\":[{\"properties\":{\"show\":{\"expr\":{\"Literal\":{\"Value\":\"true\"}}}}}],\"title\":[{\"properties\":{\"text\":{\"expr\":{\"Literal\":{\"Value\":\"'Slicer - EC Member'\"}}}}}]}}}",
          "filters": "[]",
          "height": 62.31,
          "width": 249.24,
          "x": 804.75,
          "y": 62.31,
          "z": 6000.00
        },
        {
          "config": "{\"name\":\"43614b9508a0c3b05204\",\"layouts\":[{\"id\":0,\"position\":{\"x\":28.514851485148515,\"y\":138.34983498349834,\"z\":1000,\"width\":1025.4785478547853,\"height\":277.75577557755776,\"tabOrder\":1000}}],\"singleVisual\":{\"visualType\":\"pivotTable\",\"projections\":{\"Rows\":[{\"queryRef\":\"USER_OWNERSHIP.PBI_WORKSPACENAME\",\"active\":true},{\"queryRef\":\"USER_OWNERSHIP.PBI_DATASETNAME\"}],\"Values\":[{\"queryRef\":\"Min(USER_OWNERSHIP.PBI_WORKSPACEID)\"},{\"queryRef\":\"Min(USER_OWNERSHIP.PBI_DATASETID)\"},{\"queryRef\":\"Min(USER_OWNERSHIP.PBI_ITEMNAME)\"}]},\"prototypeQuery\":{\"Version\":2,\"From\":[{\"Name\":\"t\",\"Entity\":\"USER_OWNERSHIP\",\"Type\":0}],\"Select\":[{\"Column\":{\"Expression\":{\"SourceRef\":{\"Source\":\"t\"}},\"Property\":\"PBI_DATASETNAME\"},\"Name\":\"USER_OWNERSHIP.PBI_DATASETNAME\",\"NativeReferenceName\":\"DATASETS 1\"},{\"Column\":{\"Expression\":{\"SourceRef\":{\"Source\":\"t\"}},\"Property\":\"PBI_WORKSPACENAME\"},\"Name\":\"USER_OWNERSHIP.PBI_WORKSPACENAME\",\"NativeReferenceName\":\"WORKSPACES\"},{\"Aggregation\":{\"Expression\":{\"Column\":{\"Expression\":{\"SourceRef\":{\"Source\":\"t\"}},\"Property\":\"PBI_WORKSPACEID\"}},\"Function\":2},\"Name\":\"Min(USER_OWNERSHIP.PBI_WORKSPACEID)\",\"NativeReferenceName\":\"WORKSPACE CNT\"},{\"Aggregation\":{\"Expression\":{\"Column\":{\"Expression\":{\"SourceRef\":{\"Source\":\"t\"}},\"Property\":\"PBI_DATASETID\"}},\"Function\":2},\"Name\":\"Min(USER_OWNERSHIP.PBI_DATASETID)\",\"NativeReferenceName\":\"DATASET CNT\"},{\"Aggregation\":{\"Expression\":{\"Column\":{\"Expression\":{\"SourceRef\":{\"Source\":\"t\"}},\"Property\":\"PBI_ITEMNAME\"}},\"Function\":2},\"Name\":\"Min(USER_OWNERSHIP.PBI_ITEMNAME)\",\"NativeReferenceName\":\"REPORT CNT\"}],\"OrderBy\":[{\"Direction\":1,\"Expression\":{\"Column\":{\"Expression\":{\"SourceRef\":{\"Source\":\"t\"}},\"Property\":\"PBI_WORKSPACENAME\"}}}]},\"expansionStates\":[{\"roles\":[\"Rows\"],\"levels\":[{\"queryRefs\":[\"USER_OWNERSHIP.PBI_WORKSPACENAME\"],\"isCollapsed\":true,\"identityKeys\":[{\"Column\":{\"Expression\":{\"SourceRef\":{\"Entity\":\"USER_OWNERSHIP\"}},\"Property\":\"PBI_WORKSPACENAME\"}}],\"isPinned\":true},{\"queryRefs\":[\"USER_OWNERSHIP.PBI_DATASETNAME\"],\"isCollapsed\":true,\"isPinned\":true}],\"root\":{\"identityValues\":null,\"children\":[{\"identityValues\":[{\"Literal\":{\"Value\":\"'My workspace'\"}}]}]}}],\"columnProperties\":{\"TOOL_PBI_USER_USAGE.PBI_WORKSPACENAME\":{\"displayName\":\"WORKSPACES\"},\"TOOL_PBI_USER_USAGE.PBI_WORKSPACESTATE\":{\"displayName\":\"STATE\"},\"TOOL_PBI_USER_USAGE.PBI_DATASETNAME\":{\"displayName\":\"DATASETS\"},\"TOOL_PBI_USER_USAGE.PBI_ITEMNAME\":{\"displayName\":\"ITEMS\"},\"TOOL_PBI_USER_USAGE.PBI_USAGE_ACTIVITY\":{\"displayName\":\"USAGE ACTIVITY\"},\"TOOL_PBI_USER_USAGE.PBI_USAGE_DATE\":{\"displayName\":\"USAGE DATE\"},\"TOOL_PBI_USER_USAGE.PBI_WORKSPACE_USER\":{\"displayName\":\"WORKSPACE OWNER\"},\"TOOL_PBI_USER_USAGE.PBI_DATASETCONFIGUREDBY\":{\"displayName\":\"DATASET OWNER\"},\"TOOL_PBI_USER_USAGE.PBI_DATASETCREATEDDATE\":{\"displayName\":\"DATASET CREATED DATE\"},\"TOOL_PBI_USER_USAGE.PBI_USAGE_USERID_EMAIL\":{\"displayName\":\"USER\"},\"USER_OWNERSHIP.PBI_WORKSPACENAME\":{\"displayName\":\"WORKSPACES\"},\"USER_OWNERSHIP.PBI_DATASETNAME\":{\"displayName\":\"DATASETS\"},\"Min(USER_OWNERSHIP.PBI_WORKSPACEID)\":{\"displayName\":\"WORKSPACE CNT\"},\"Min(USER_OWNERSHIP.PBI_DATASETID)\":{\"displayName\":\"DATASET CNT\"},\"Min(USER_OWNERSHIP.PBI_ITEMNAME)\":{\"displayName\":\"REPORT CNT\"}},\"drillFilterOtherVisuals\":true,\"objects\":{\"columnWidth\":[{\"properties\":{\"value\":{\"expr\":{\"Literal\":{\"Value\":\"290.2253603909946D\"}}}},\"selector\":{\"metadata\":\"TOOL_PBI_USER_USAGE.PBI_ITEMNAME\"}},{\"properties\":{\"value\":{\"expr\":{\"Literal\":{\"Value\":\"314.7016634617759D\"}}}},\"selector\":{\"metadata\":\"TOOL_PBI_USER_USAGE.PBI_WORKSPACENAME\"}},{\"properties\":{\"value\":{\"expr\":{\"Literal\":{\"Value\":\"149.19984079202897D\"}}}},\"selector\":{\"metadata\":\"TOOL_PBI_USER_USAGE.PBI_USAGE_ACTIVITY\"}},{\"properties\":{\"value\":{\"expr\":{\"Literal\":{\"Value\":\"298.34256059451167D\"}}}},\"selector\":{\"metadata\":\"USER_OWNERSHIP.PBI_DATASETNAME\"}},{\"properties\":{\"value\":{\"expr\":{\"Literal\":{\"Value\":\"283.22235715616137D\"}}}},\"selector\":{\"metadata\":\"USER_OWNERSHIP.PBI_WORKSPACENAME\"}}],\"values\":[{\"properties\":{\"fontSize\":{\"expr\":{\"Literal\":{\"Value\":\"9D\"}}}}},{\"properties\":{\"webURL\":{\"expr\":{\"Aggregation\":{\"Expression\":{\"Column\":{\"Expression\":{\"SourceRef\":{\"Entity\":\"USER_OWNERSHIP\"}},\"Property\":\"WS_Link\"}},\"Function\":3}}},\"fontColor\":{\"solid\":{\"color\":{\"expr\":{\"Conditional\":{\"Cases\":[{\"Condition\":{\"Not\":{\"Expression\":{\"Comparison\":{\"ComparisonKind\":0,\"Left\":{\"Aggregation\":{\"Expression\":{\"Column\":{\"Expression\":{\"SourceRef\":{\"Entity\":\"USER_OWNERSHIP\"}},\"Property\":\"PBI_WORKSPACENAME\"}},\"Function\":3}},\"Right\":{\"Literal\":{\"Value\":\"''\"}}},\"Annotations\":{\"PowerBI.SQExprEvaluationKind\":1,\"PowerBI.SQExprTextOperatorOption\":12}}}},\"Value\":{\"Literal\":{\"Value\":\"'#414fb1'\"}}}]}}}}}},\"selector\":{\"data\":[{\"dataViewWildcard\":{\"matchingOption\":1}}],\"metadata\":\"TOOL_PBI_USER_USAGE.PBI_WORKSPACENAME\"}},{\"properties\":{\"webURL\":{\"expr\":{\"Aggregation\":{\"Expression\":{\"Column\":{\"Expression\":{\"SourceRef\":{\"Entity\":\"USER_OWNERSHIP\"}},\"Property\":\"DS_Link\"}},\"Function\":3}}},\"fontColor\":{\"solid\":{\"color\":{\"expr\":{\"Conditional\":{\"Cases\":[{\"Condition\":{\"Not\":{\"Expression\":{\"Comparison\":{\"ComparisonKind\":0,\"Left\":{\"Aggregation\":{\"Expression\":{\"Column\":{\"Expression\":{\"SourceRef\":{\"Entity\":\"USER_OWNERSHIP\"}},\"Property\":\"PBI_DATASETNAME\"}},\"Function\":3}},\"Right\":{\"Literal\":{\"Value\":\"''\"}}},\"Annotations\":{\"PowerBI.SQExprEvaluationKind\":1,\"PowerBI.SQExprTextOperatorOption\":12}}}},\"Value\":{\"Literal\":{\"Value\":\"'#414fb1'\"}}}]}}}}}},\"selector\":{\"data\":[{\"dataViewWildcard\":{\"matchingOption\":1}}],\"metadata\":\"TOOL_PBI_USER_USAGE.PBI_DATASETNAME\"}},{\"properties\":{\"fontColor\":{\"solid\":{\"color\":{\"expr\":{\"Conditional\":{\"Cases\":[{\"Condition\":{\"Comparison\":{\"ComparisonKind\":0,\"Left\":{\"Aggregation\":{\"Expression\":{\"Column\":{\"Expression\":{\"SourceRef\":{\"Entity\":\"USER_OWNERSHIP\"}},\"Property\":\"PBI_WORKSPACESTATE\"}},\"Function\":3}},\"Right\":{\"Literal\":{\"Value\":\"'Deleted'\"}}},\"Annotations\":{\"PowerBI.SQExprEvaluationKind\":1,\"PowerBI.SQExprTextOperatorOption\":2}},\"Value\":{\"Literal\":{\"Value\":\"'#D64550'\"}}}]}}}}}},\"selector\":{\"data\":[{\"dataViewWildcard\":{\"matchingOption\":1}}],\"metadata\":\"TOOL_PBI_USER_USAGE.PBI_WORKSPACESTATE\"}}],\"rowHeaders\":[{\"properties\":{\"stepped\":{\"expr\":{\"Literal\":{\"Value\":\"false\"}}}}}],\"subTotals\":[{\"properties\":{\"rowSubtotals\":{\"expr\":{\"Literal\":{\"Value\":\"true\"}}},\"perRowLevel\":{\"expr\":{\"Literal\":{\"Value\":\"false\"}}},\"columnSubtotals\":{\"expr\":{\"Literal\":{\"Value\":\"false\"}}},\"rowSubtotalsLabel\":{\"expr\":{\"Literal\":{\"Value\":\"'Total'\"}}}}},{\"properties\":{\"levelSubtotalLabel\":{\"expr\":{\"Literal\":{\"Value\":\"'WT'\"}}},\"levelSubtotalEnabled\":{\"expr\":{\"Literal\":{\"Value\":\"false\"}}}},\"selector\":{\"metadata\":\"USER_OWNERSHIP.PBI_WORKSPACENAME\"}}],\"columnFormatting\":[{\"properties\":{\"styleValues\":{\"expr\":{\"Literal\":{\"Value\":\"false\"}}},\"styleTotal\":{\"expr\":{\"Literal\":{\"Value\":\"true\"}}},\"styleHeader\":{\"expr\":{\"Literal\":{\"Value\":\"false\"}}}},\"selector\":{\"metadata\":\"Min(USER_OWNERSHIP.PBI_WORKSPACEID)\"}}]},\"vcObjects\":{\"border\":[{\"properties\":{\"show\":{\"expr\":{\"Literal\":{\"Value\":\"true\"}}}}}]}}}",
          "filters": "[]",
          "height": 277.76,
          "width": 1025.48,
          "x": 28.51,
          "y": 138.35,
          "z": 1000.00
        },
        {
          "config": "{\"name\":\"62458b91b05000b8d550\",\"layouts\":[{\"id\":0,\"position\":{\"x\":28.753623188405797,\"y\":433.15942028985506,\"z\":3000,\"width\":1234.5507246376812,\"height\":286.60869565217394,\"tabOrder\":3000}}],\"singleVisual\":{\"visualType\":\"tableEx\",\"projections\":{\"Values\":[{\"queryRef\":\"USER_OWNERSHIP.PBI_WORKSPACENAME\"},{\"queryRef\":\"USER_OWNERSHIP.PBI_WORKSPACE_USER\"},{\"queryRef\":\"USER_OWNERSHIP.PBI_DATASETNAME\"},{\"queryRef\":\"USER_OWNERSHIP.PBI_DATASETCONFIGUREDBY\"},{\"queryRef\":\"USER_OWNERSHIP.PBI_DATASETCREATEDDATE\"},{\"queryRef\":\"USER_OWNERSHIP.PBI_ITEMNAME\"},{\"queryRef\":\"USER_OWNERSHIP.PBI_USAGE_USERID_EMAIL\"},{\"queryRef\":\"USER_OWNERSHIP.PBI_USAGE_ACTIVITY\"},{\"queryRef\":\"USER_OWNERSHIP.PBI_USAGE_DATE\"}]},\"prototypeQuery\":{\"Version\":2,\"From\":[{\"Name\":\"t\",\"Entity\":\"USER_OWNERSHIP\",\"Type\":0}],\"Select\":[{\"Column\":{\"Expression\":{\"SourceRef\":{\"Source\":\"t\"}},\"Property\":\"PBI_WORKSPACENAME\"},\"Name\":\"USER_OWNERSHIP.PBI_WORKSPACENAME\",\"NativeReferenceName\":\"WORKSPACES\"},{\"Column\":{\"Expression\":{\"SourceRef\":{\"Source\":\"t\"}},\"Property\":\"PBI_DATASETNAME\"},\"Name\":\"USER_OWNERSHIP.PBI_DATASETNAME\",\"NativeReferenceName\":\"DATASETS 1\"},{\"Column\":{\"Expression\":{\"SourceRef\":{\"Source\":\"t\"}},\"Property\":\"PBI_WORKSPACE_USER\"},\"Name\":\"USER_OWNERSHIP.PBI_WORKSPACE_USER\",\"NativeReferenceName\":\"WORKSPACE OWNER\"},{\"Column\":{\"Expression\":{\"SourceRef\":{\"Source\":\"t\"}},\"Property\":\"PBI_DATASETCONFIGUREDBY\"},\"Name\":\"USER_OWNERSHIP.PBI_DATASETCONFIGUREDBY\",\"NativeReferenceName\":\"DATASET OWNER\"},{\"Column\":{\"Expression\":{\"SourceRef\":{\"Source\":\"t\"}},\"Property\":\"PBI_DATASETCREATEDDATE\"},\"Name\":\"USER_OWNERSHIP.PBI_DATASETCREATEDDATE\",\"NativeReferenceName\":\"DATASET CREATED DATE\"},{\"Column\":{\"Expression\":{\"SourceRef\":{\"Source\":\"t\"}},\"Property\":\"PBI_ITEMNAME\"},\"Name\":\"USER_OWNERSHIP.PBI_ITEMNAME\",\"NativeReferenceName\":\"REPORT\"},{\"Column\":{\"Expression\":{\"SourceRef\":{\"Source\":\"t\"}},\"Property\":\"PBI_USAGE_USERID_EMAIL\"},\"Name\":\"USER_OWNERSHIP.PBI_USAGE_USERID_EMAIL\",\"NativeReferenceName\":\"REPORT USER\"},{\"Column\":{\"Expression\":{\"SourceRef\":{\"Source\":\"t\"}},\"Property\":\"PBI_USAGE_ACTIVITY\"},\"Name\":\"USER_OWNERSHIP.PBI_USAGE_ACTIVITY\",\"NativeReferenceName\":\"ACTIVITY\"},{\"Column\":{\"Expression\":{\"SourceRef\":{\"Source\":\"t\"}},\"Property\":\"PBI_USAGE_DATE\"},\"Name\":\"USER_OWNERSHIP.PBI_USAGE_DATE\",\"NativeReferenceName\":\"ACTIVITY DATE\"}],\"OrderBy\":[{\"Direction\":2,\"Expression\":{\"Column\":{\"Expression\":{\"SourceRef\":{\"Source\":\"t\"}},\"Property\":\"PBI_USAGE_DATE\"}}}]},\"columnProperties\":{\"TOOL_PBI_USER_USAGE.PBI_WORKSPACENAME\":{\"displayName\":\"WORKSPACES\"},\"TOOL_PBI_USER_USAGE.PBI_WORKSPACESTATE\":{\"displayName\":\"STATE\"},\"TOOL_PBI_USER_USAGE.PBI_DATASETNAME\":{\"displayName\":\"DATASETS\"},\"TOOL_PBI_USER_USAGE.PBI_ITEMNAME\":{\"displayName\":\"ITEMS\"},\"TOOL_PBI_USER_USAGE.PBI_USAGE_ACTIVITY\":{\"displayName\":\"USAGE ACTIVITY\"},\"TOOL_PBI_USER_USAGE.PBI_USAGE_DATE\":{\"displayName\":\"USAGE DATE\"},\"TOOL_PBI_USER_USAGE.PBI_WORKSPACE_USER\":{\"displayName\":\"WORKSPACE OWNER\"},\"TOOL_PBI_USER_USAGE.PBI_DATASETCONFIGUREDBY\":{\"displayName\":\"DATASET OWNER\"},\"TOOL_PBI_USER_USAGE.PBI_DATASETCREATEDDATE\":{\"displayName\":\"DATASET CREATED DATE\"},\"TOOL_PBI_USER_USAGE.PBI_USAGE_USERID_EMAIL\":{\"displayName\":\"USER\"},\"USER_OWNERSHIP.PBI_WORKSPACENAME\":{\"displayName\":\"WORKSPACES\"},\"USER_OWNERSHIP.PBI_DATASETNAME\":{\"displayName\":\"DATASETS\"},\"Min(USER_OWNERSHIP.PBI_WORKSPACEID)\":{\"displayName\":\"WORKSPACE CNT\"},\"Min(USER_OWNERSHIP.PBI_DATASETID)\":{\"displayName\":\"DATASET CNT\"},\"Min(USER_OWNERSHIP.PBI_ITEMNAME)\":{\"displayName\":\"REPORT CNT\"},\"USER_OWNERSHIP.PBI_WORKSPACE_USER\":{\"displayName\":\"WORKSPACE OWNER\"},\"USER_OWNERSHIP.PBI_DATASETCONFIGUREDBY\":{\"displayName\":\"DATASET OWNER\"},\"USER_OWNERSHIP.PBI_DATASETCREATEDDATE\":{\"displayName\":\"DATASET CREATED DATE\"},\"USER_OWNERSHIP.PBI_ITEMNAME\":{\"displayName\":\"REPORT\"},\"USER_OWNERSHIP.PBI_USAGE_USERID_EMAIL\":{\"displayName\":\"REPORT USER\"},\"USER_OWNERSHIP.PBI_USAGE_ACTIVITY\":{\"displayName\":\"ACTIVITY\"},\"USER_OWNERSHIP.PBI_USAGE_DATE\":{\"displayName\":\"ACTIVITY DATE\"}},\"drillFilterOtherVisuals\":true,\"objects\":{\"columnWidth\":[{\"properties\":{\"value\":{\"expr\":{\"Literal\":{\"Value\":\"290.2253603909946D\"}}}},\"selector\":{\"metadata\":\"TOOL_PBI_USER_USAGE.PBI_ITEMNAME\"}},{\"properties\":{\"value\":{\"expr\":{\"Literal\":{\"Value\":\"314.7016634617759D\"}}}},\"selector\":{\"metadata\":\"TOOL_PBI_USER_USAGE.PBI_WORKSPACENAME\"}},{\"properties\":{\"value\":{\"expr\":{\"Literal\":{\"Value\":\"149.19984079202897D\"}}}},\"selector\":{\"metadata\":\"TOOL_PBI_USER_USAGE.PBI_USAGE_ACTIVITY\"}},{\"properties\":{\"value\":{\"expr\":{\"Literal\":{\"Value\":\"213.93836678496123D\"}}}},\"selector\":{\"metadata\":\"USER_OWNERSHIP.PBI_DATASETNAME\"}},{\"properties\":{\"value\":{\"expr\":{\"Literal\":{\"Value\":\"236.78959710789272D\"}}}},\"selector\":{\"metadata\":\"USER_OWNERSHIP.PBI_WORKSPACENAME\"}},{\"properties\":{\"value\":{\"expr\":{\"Literal\":{\"Value\":\"259.108760310454D\"}}}},\"selector\":{\"metadata\":\"USER_OWNERSHIP.PBI_DATASETCONFIGUREDBY\"}}],\"values\":[{\"properties\":{\"fontSize\":{\"expr\":{\"Literal\":{\"Value\":\"9D\"}}}}},{\"properties\":{\"webURL\":{\"expr\":{\"Aggregation\":{\"Expression\":{\"Column\":{\"Expression\":{\"SourceRef\":{\"Entity\":\"USER_OWNERSHIP\"}},\"Property\":\"WS_Link\"}},\"Function\":3}}},\"fontColor\":{\"solid\":{\"color\":{\"expr\":{\"Conditional\":{\"Cases\":[{\"Condition\":{\"Not\":{\"Expression\":{\"Comparison\":{\"ComparisonKind\":0,\"Left\":{\"Aggregation\":{\"Expression\":{\"Column\":{\"Expression\":{\"SourceRef\":{\"Entity\":\"USER_OWNERSHIP\"}},\"Property\":\"PBI_WORKSPACENAME\"}},\"Function\":3}},\"Right\":{\"Literal\":{\"Value\":\"''\"}}},\"Annotations\":{\"PowerBI.SQExprEvaluationKind\":1,\"PowerBI.SQExprTextOperatorOption\":12}}}},\"Value\":{\"Literal\":{\"Value\":\"'#414fb1'\"}}}]}}}}}},\"selector\":{\"data\":[{\"dataViewWildcard\":{\"matchingOption\":1}}],\"metadata\":\"TOOL_PBI_USER_USAGE.PBI_WORKSPACENAME\"}},{\"properties\":{\"webURL\":{\"expr\":{\"Aggregation\":{\"Expression\":{\"Column\":{\"Expression\":{\"SourceRef\":{\"Entity\":\"USER_OWNERSHIP\"}},\"Property\":\"DS_Link\"}},\"Function\":3}}},\"fontColor\":{\"solid\":{\"color\":{\"expr\":{\"Conditional\":{\"Cases\":[{\"Condition\":{\"Not\":{\"Expression\":{\"Comparison\":{\"ComparisonKind\":0,\"Left\":{\"Aggregation\":{\"Expression\":{\"Column\":{\"Expression\":{\"SourceRef\":{\"Entity\":\"USER_OWNERSHIP\"}},\"Property\":\"PBI_DATASETNAME\"}},\"Function\":3}},\"Right\":{\"Literal\":{\"Value\":\"''\"}}},\"Annotations\":{\"PowerBI.SQExprEvaluationKind\":1,\"PowerBI.SQExprTextOperatorOption\":12}}}},\"Value\":{\"Literal\":{\"Value\":\"'#414fb1'\"}}}]}}}}}},\"selector\":{\"data\":[{\"dataViewWildcard\":{\"matchingOption\":1}}],\"metadata\":\"TOOL_PBI_USER_USAGE.PBI_DATASETNAME\"}},{\"properties\":{\"fontColor\":{\"solid\":{\"color\":{\"expr\":{\"Conditional\":{\"Cases\":[{\"Condition\":{\"Comparison\":{\"ComparisonKind\":0,\"Left\":{\"Aggregation\":{\"Expression\":{\"Column\":{\"Expression\":{\"SourceRef\":{\"Entity\":\"USER_OWNERSHIP\"}},\"Property\":\"PBI_WORKSPACESTATE\"}},\"Function\":3}},\"Right\":{\"Literal\":{\"Value\":\"'Deleted'\"}}},\"Annotations\":{\"PowerBI.SQExprEvaluationKind\":1,\"PowerBI.SQExprTextOperatorOption\":2}},\"Value\":{\"Literal\":{\"Value\":\"'#D64550'\"}}}]}}}}}},\"selector\":{\"data\":[{\"dataViewWildcard\":{\"matchingOption\":1}}],\"metadata\":\"TOOL_PBI_USER_USAGE.PBI_WORKSPACESTATE\"}},{\"properties\":{\"webURL\":{\"expr\":{\"Aggregation\":{\"Expression\":{\"Column\":{\"Expression\":{\"SourceRef\":{\"Entity\":\"USER_OWNERSHIP\"}},\"Property\":\"WS_Link\"}},\"Function\":3}}},\"fontColor\":{\"solid\":{\"color\":{\"expr\":{\"Conditional\":{\"Cases\":[{\"Condition\":{\"Not\":{\"Expression\":{\"Comparison\":{\"ComparisonKind\":0,\"Left\":{\"Aggregation\":{\"Expression\":{\"Column\":{\"Expression\":{\"SourceRef\":{\"Entity\":\"USER_OWNERSHIP\"}},\"Property\":\"PBI_WORKSPACENAME\"}},\"Function\":3}},\"Right\":{\"Literal\":{\"Value\":\"''\"}}},\"Annotations\":{\"PowerBI.SQExprEvaluationKind\":1,\"PowerBI.SQExprTextOperatorOption\":12}}}},\"Value\":{\"Literal\":{\"Value\":\"'#414fb1'\"}}}]}}}}}},\"selector\":{\"data\":[{\"dataViewWildcard\":{\"matchingOption\":1}}],\"metadata\":\"USER_OWNERSHIP.PBI_WORKSPACENAME\"}},{\"properties\":{\"webURL\":{\"expr\":{\"Aggregation\":{\"Expression\":{\"Column\":{\"Expression\":{\"SourceRef\":{\"Entity\":\"USER_OWNERSHIP\"}},\"Property\":\"DS_Link\"}},\"Function\":3}}},\"fontColor\":{\"solid\":{\"color\":{\"expr\":{\"Conditional\":{\"Cases\":[{\"Condition\":{\"Not\":{\"Expression\":{\"Comparison\":{\"ComparisonKind\":0,\"Left\":{\"Aggregation\":{\"Expression\":{\"Column\":{\"Expression\":{\"SourceRef\":{\"Entity\":\"USER_OWNERSHIP\"}},\"Property\":\"PBI_DATASETNAME\"}},\"Function\":3}},\"Right\":{\"Literal\":{\"Value\":\"''\"}}},\"Annotations\":{\"PowerBI.SQExprEvaluationKind\":1,\"PowerBI.SQExprTextOperatorOption\":12}}}},\"Value\":{\"Literal\":{\"Value\":\"'#414fb1'\"}}}]}}}}}},\"selector\":{\"data\":[{\"dataViewWildcard\":{\"matchingOption\":1}}],\"metadata\":\"USER_OWNERSHIP.PBI_DATASETNAME\"}}],\"columnFormatting\":[{\"properties\":{\"styleValues\":{\"expr\":{\"Literal\":{\"Value\":\"false\"}}},\"styleTotal\":{\"expr\":{\"Literal\":{\"Value\":\"true\"}}},\"styleHeader\":{\"expr\":{\"Literal\":{\"Value\":\"false\"}}}},\"selector\":{\"metadata\":\"Min(USER_OWNERSHIP.PBI_WORKSPACEID)\"}}]},\"vcObjects\":{\"border\":[{\"properties\":{\"show\":{\"expr\":{\"Literal\":{\"Value\":\"true\"}}}}}]}}}",
          "filters": "[]",
          "height": 286.61,
          "width": 1234.55,
          "x": 28.75,
          "y": 433.16,
          "z": 3000.00
        },
        {
          "config": "{\"name\":\"a881144ac559c7096252\",\"layouts\":[{\"id\":0,\"position\":{\"x\":1071.304347826087,\"y\":0,\"z\":4000,\"width\":192,\"height\":64,\"tabOrder\":4000}}],\"singleVisual\":{\"visualType\":\"slicer\",\"projections\":{\"Values\":[{\"queryRef\":\"USER_OWNERSHIP.PBI_WORKSPACE_USER\",\"active\":true}]},\"prototypeQuery\":{\"Version\":2,\"From\":[{\"Name\":\"v\",\"Entity\":\"V_MIGR_SCORECARD_ZID_MONTH\",\"Type\":0},{\"Name\":\"u\",\"Entity\":\"USER_OWNERSHIP\",\"Type\":0}],\"Select\":[{\"Column\":{\"Expression\":{\"SourceRef\":{\"Source\":\"u\"}},\"Property\":\"PBI_WORKSPACE_USER\"},\"Name\":\"USER_OWNERSHIP.PBI_WORKSPACE_USER\",\"NativeReferenceName\":\"WORKSPACE OWNER\"}],\"OrderBy\":[{\"Direction\":1,\"Expression\":{\"Column\":{\"Expression\":{\"SourceRef\":{\"Source\":\"v\"}},\"Property\":\"SR_DIR_OR_DIR\"}}}]},\"columnProperties\":{\"USER_OWNERSHIP.PBI_WORKSPACE_USER\":{\"displayName\":\"WORKSPACE OWNER\"}},\"drillFilterOtherVisuals\":true,\"hasDefaultSort\":true,\"objects\":{\"data\":[{\"properties\":{\"mode\":{\"expr\":{\"Literal\":{\"Value\":\"'Dropdown'\"}}}}}],\"general\":[{\"properties\":{\"selfFilterEnabled\":{\"expr\":{\"Literal\":{\"Value\":\"true\"}}},\"selfFilter\":{\"filter\":{\"Version\":2,\"From\":[{\"Name\":\"u\",\"Entity\":\"USER_OWNERSHIP\",\"Type\":0}],\"Where\":[{\"Condition\":{\"Contains\":{\"Left\":{\"Column\":{\"Expression\":{\"SourceRef\":{\"Source\":\"u\"}},\"Property\":\"PBI_WORKSPACE_USER\"}},\"Right\":{\"Literal\":{\"Value\":\"'prehoda'\"}}}},\"Annotations\":{\"PowerBI.MParameterBehavior\":1}}]}}}}]},\"vcObjects\":{\"border\":[{\"properties\":{\"show\":{\"expr\":{\"Literal\":{\"Value\":\"true\"}}}}}],\"title\":[{\"properties\":{\"text\":{\"expr\":{\"Literal\":{\"Value\":\"'Slicer - Employee'\"}}}}}]}}}",
          "filters": "[]",
          "height": 64.00,
          "width": 192.00,
          "x": 1071.30,
          "y": 0.00,
          "z": 4000.00
        },
        {
          "config": "{\"name\":\"d05e13aca3d13202243d\",\"layouts\":[{\"id\":0,\"position\":{\"x\":804.7524752475248,\"y\":0,\"z\":5000,\"width\":249.24092409240924,\"height\":62.31023102310231,\"tabOrder\":5000}}],\"singleVisual\":{\"visualType\":\"slicer\",\"projections\":{\"Values\":[{\"queryRef\":\"USER_OWNERSHIP.PBI_WORKSPACENAME\",\"active\":true}]},\"prototypeQuery\":{\"Version\":2,\"From\":[{\"Name\":\"v\",\"Entity\":\"V_MIGR_SCORECARD_ZID_MONTH\",\"Type\":0},{\"Name\":\"u\",\"Entity\":\"USER_OWNERSHIP\",\"Type\":0}],\"Select\":[{\"Column\":{\"Expression\":{\"SourceRef\":{\"Source\":\"u\"}},\"Property\":\"PBI_WORKSPACENAME\"},\"Name\":\"USER_OWNERSHIP.PBI_WORKSPACENAME\",\"NativeReferenceName\":\"WORKSPACE\"}],\"OrderBy\":[{\"Direction\":1,\"Expression\":{\"Column\":{\"Expression\":{\"SourceRef\":{\"Source\":\"v\"}},\"Property\":\"SR_DIR_OR_DIR\"}}}]},\"columnProperties\":{\"USER_OWNERSHIP.PBI_WORKSPACENAME\":{\"displayName\":\"WORKSPACE\"}},\"drillFilterOtherVisuals\":true,\"hasDefaultSort\":true,\"objects\":{\"data\":[{\"properties\":{\"mode\":{\"expr\":{\"Literal\":{\"Value\":\"'Dropdown'\"}}}}}],\"general\":[{\"properties\":{\"selfFilterEnabled\":{\"expr\":{\"Literal\":{\"Value\":\"true\"}}}}}]},\"vcObjects\":{\"border\":[{\"properties\":{\"show\":{\"expr\":{\"Literal\":{\"Value\":\"true\"}}}}}],\"title\":[{\"properties\":{\"text\":{\"expr\":{\"Literal\":{\"Value\":\"'Slicer - EC Member'\"}}}}}]}}}",
          "filters": "[]",
          "height": 62.31,
          "width": 249.24,
          "x": 804.75,
          "y": 0.00,
          "z": 5000.00
        },
        {
          "config": "{\"name\":\"f18ed662322e925c6033\",\"layouts\":[{\"id\":0,\"position\":{\"x\":1071.304347826087,\"y\":166.95652173913044,\"z\":8000,\"width\":192,\"height\":64,\"tabOrder\":8000}}],\"singleVisual\":{\"visualType\":\"slicer\",\"projections\":{\"Values\":[{\"queryRef\":\"USER_OWNERSHIP.PBI_USAGE_USERID_EMAIL\",\"active\":true}]},\"prototypeQuery\":{\"Version\":2,\"From\":[{\"Name\":\"v\",\"Entity\":\"V_MIGR_SCORECARD_ZID_MONTH\",\"Type\":0},{\"Name\":\"u\",\"Entity\":\"USER_OWNERSHIP\",\"Type\":0}],\"Select\":[{\"Column\":{\"Expression\":{\"SourceRef\":{\"Source\":\"u\"}},\"Property\":\"PBI_USAGE_USERID_EMAIL\"},\"Name\":\"USER_OWNERSHIP.PBI_USAGE_USERID_EMAIL\",\"NativeReferenceName\":\"REPORT USER\"}],\"OrderBy\":[{\"Direction\":1,\"Expression\":{\"Column\":{\"Expression\":{\"SourceRef\":{\"Source\":\"v\"}},\"Property\":\"SR_DIR_OR_DIR\"}}}]},\"columnProperties\":{\"USER_OWNERSHIP.PBI_USAGE_USERID_EMAIL\":{\"displayName\":\"REPORT USER\"}},\"drillFilterOtherVisuals\":true,\"hasDefaultSort\":true,\"objects\":{\"data\":[{\"properties\":{\"mode\":{\"expr\":{\"Literal\":{\"Value\":\"'Dropdown'\"}}}}}],\"general\":[{\"properties\":{\"selfFilterEnabled\":{\"expr\":{\"Literal\":{\"Value\":\"true\"}}}}}]},\"vcObjects\":{\"border\":[{\"properties\":{\"show\":{\"expr\":{\"Literal\":{\"Value\":\"true\"}}}}}],\"title\":[{\"properties\":{\"text\":{\"expr\":{\"Literal\":{\"Value\":\"'Slicer - Employee'\"}}}}}]}}}",
          "filters": "[]",
          "height": 64.00,
          "width": 192.00,
          "x": 1071.30,
          "y": 166.96,
          "z": 8000.00
        }
      ],
      "width": 1280.00
    },
    {
      "config": "{\"visibility\":1}",
      "displayName": "Page 2",
      "displayOption": 1,
      "filters": "[]",
      "height": 720.00,
      "name": "ReportSectionbd1b15e322f9e1f5215a",
      "ordinal": 2,
      "visualContainers": [
        {
          "config": "{\"name\":\"46e51fad4525028209b0\",\"layouts\":[{\"id\":0,\"position\":{\"x\":908.8669950738916,\"y\":31.921182266009854,\"z\":0,\"width\":361.7733990147783,\"height\":377.73399014778323,\"tabOrder\":0}}],\"singleVisual\":{\"visualType\":\"textbox\",\"drillFilterOtherVisuals\":true,\"objects\":{\"general\":[{\"properties\":{\"paragraphs\":[{\"textRuns\":[{\"value\":\"What Dataset I own?\"}],\"listType\":\"ordered\"},{\"textRuns\":[{\"value\":\"How many and which ITEMS I interacted with?\"}],\"listType\":\"ordered\"},{\"textRuns\":[{\"value\":\"Who has interacted with which Items, How many times?\"}],\"listType\":\"ordered\"},{\"textRuns\":[{\"value\":\"Who's using a Report and a Dataset?\"}],\"listType\":\"ordered\"},{\"textRuns\":[{\"value\":\"Add Filters.\"}],\"listType\":\"ordered\"},{\"textRuns\":[{\"value\":\"\"}]},{\"textRuns\":[{\"value\":\"\"}]},{\"textRuns\":[{\"value\":\"\"}]},{\"textRuns\":[{\"value\":\"PAGE 1 :\"}]},{\"textRuns\":[{\"value\":\"-- My Ownership\"}]},{\"textRuns\":[{\"value\":\"-- Filters\"}]},{\"textRuns\":[{\"value\":\"\\t-WS Owner\"}]},{\"textRuns\":[{\"value\":\"\\t-DS Owner\"}]},{\"textRuns\":[{\"value\":\"\\t-USER\"}]},{\"textRuns\":[{\"value\":\"\"}]},{\"textRuns\":[{\"value\":\"PAGE 2:\"}]},{\"textRuns\":[{\"value\":\"-- My Interaction\"}]},{\"textRuns\":[{\"value\":\"\"}]},{\"textRuns\":[{\"value\":\"\"}]},{\"textRuns\":[{\"value\":\"\"}]},{\"textRuns\":[{\"value\":\"\"}]},{\"textRuns\":[{\"value\":\"\"}]},{\"textRuns\":[{\"value\":\"\"}]},{\"textRuns\":[{\"value\":\"\"}]},{\"textRuns\":[{\"value\":\"\"}]},{\"textRuns\":[{\"value\":\"\"}]}]}}]}}}",
          "filters": "[]",
          "height": 377.73,
          "width": 361.77,
          "x": 908.87,
          "y": 31.92,
          "z": 0.00
        }
      ],
      "width": 1280.00
    }
  ]
}