{
  "basic": {
    "cpu": "Snapdragon 730G",
    "battery": "5260mAh",
    "camera": "108MP+20MP+12MP\\n+5MP+2MP",
    "screen": "6.47″ AMOLED",
    "resolution": "2340×1080"
  },
  "camera": {
    "front_camera": "32MP",
    "rear_camera": "108MP+20MP+12MP+5MP+2MP"
  }
}