{
	"AlgoMap255BrLevel": {
		"sectionone": [0.006667,1.993],
		"sectiontwo": [0.05034,-194.6],
		"sectionthree": [0.01582516956,41.62923888],
		"sectionkeypoint": [4501,6848]
	},
	"LcmMapAlgoBrLevel": [
		[1,1],
		[2,76],
		[3,226],
		[4,376],
		[5,526],
		[6,676],
		[7,826],
		[8,976],
		[9,1125],
		[10,1275],
		[11,1425],
		[12,1575],
		[13,1725],
		[14,1875],
		[15,2025],
		[16,2175],
		[17,2325],
		[18,2475],
		[19,2625],
		[20,2775],
		[21,2925],
		[22,3075],
		[23,3225],
		[24,3375],
		[25,3525],
		[26,3675],
		[27,3825],
		[28,3975],
		[29,4125],
		[30,4275],
		[31,4425],
		[32,4511],
		[33,4531],
		[34,4551],
		[35,4570],
		[36,4590],
		[37,4610],
		[38,4630],
		[39,4650],
		[40,4670],
		[41,4690],
		[42,4710],
		[43,4729],
		[44,4749],
		[45,4769],
		[46,4789],
		[47,4809],
		[48,4829],
		[49,4849],
		[50,4868],
		[51,4888],
		[52,4908],
		[53,4928],
		[54,4948],
		[55,4968],
		[56,4988],
		[57,5008],
		[58,5027],
		[59,5047],
		[60,5067],
		[61,5087],
		[62,5107],
		[63,5127],
		[64,5147],
		[65,5166],
		[66,5186],
		[67,5206],
		[68,5226],
		[69,5246],
		[70,5266],
		[71,5286],
		[72,5305],
		[73,5325],
		[74,5345],
		[75,5365],
		[76,5385],
		[77,5405],
		[78,5425],
		[79,5445],
		[80,5464],
		[81,5484],
		[82,5504],
		[83,5524],
		[84,5544],
		[85,5564],
		[86,5584],
		[87,5603],
		[88,5623],
		[89,5643],
		[90,5663],
		[91,5683],
		[92,5703],
		[93,5723],
		[94,5743],
		[95,5762],
		[96,5782],
		[97,5802],
		[98,5822],
		[99,5842],
		[100,5862],
		[101,5882],
		[102,5901],
		[103,5921],
		[104,5941],
		[105,5961],
		[106,5981],
		[107,6001],
		[108,6021],
		[109,6040],
		[110,6060],
		[111,6080],
		[112,6100],
		[113,6120],
		[114,6140],
		[115,6160],
		[116,6180],
		[117,6199],
		[118,6219],
		[119,6239],
		[120,6259],
		[121,6279],
		[122,6299],
		[123,6319],
		[124,6338],
		[125,6358],
		[126,6378],
		[127,6398],
		[128,6418],
		[129,6438],
		[130,6458],
		[131,6478],
		[132,6497],
		[133,6517],
		[134,6537],
		[135,6557],
		[136,6577],
		[137,6597],
		[138,6617],
		[139,6636],
		[140,6656],
		[141,6676],
		[142,6696],
		[143,6716],
		[144,6736],
		[145,6756],
		[146,6775],
		[147,6795],
		[148,6815],
		[149,6835],
		[150,6878],
		[151,6943],
		[152,7006],
		[153,7069],
		[154,7132],
		[155,7195],
		[156,7259],
		[157,7322],
		[158,7385],
		[159,7448],
		[160,7511],
		[161,7575],
		[162,7638],
		[163,7701],
		[164,7764],
		[165,7827],
		[166,7891],
		[167,7954],
		[168,8017],
		[169,8080],
		[170,8143],
		[171,8207],
		[172,8270],
		[173,8333],
		[174,8396],
		[175,8459],
		[176,8522],
		[177,8586],
		[178,8649],
		[179,8712],
		[180,8775],
		[181,8838],
		[182,8902],
		[183,8965],
		[184,9028],
		[185,9091],
		[186,9154],
		[187,9218],
		[188,9281],
		[189,9344],
		[190,9407],
		[191,9470],
		[192,9534],
		[193,9597],
		[194,9660],
		[195,9723],
		[196,9786],
		[197,9849],
		[198,9913],
		[199,9976],
		[200,10039],
		[201,10102],
		[202,10165],
		[203,10229],
		[204,10292],
		[205,10355],
		[206,10418],
		[207,10481],
		[208,10545],
		[209,10608],
		[210,10671],
		[211,10734],
		[212,10797],
		[213,10861],
		[214,10924],
		[215,10987],
		[216,11050],
		[217,11113],
		[218,11176],
		[219,11240],
		[220,11303],
		[221,11366],
		[222,11429],
		[223,11492],
		[224,11556],
		[225,11619],
		[226,11682],
		[227,11745],
		[228,11808],
		[229,11872],
		[230,11935],
		[231,11998],
		[232,12061],
		[233,12124],
		[234,12188],
		[235,12251],
		[236,12314],
		[237,12377],
		[238,12440],
		[239,12503],
		[240,12567],
		[241,12630],
		[242,12693],
		[243,12756],
		[244,12819],
		[245,12883],
		[246,12946],
		[247,13009],
		[248,13072],
		[249,13135],
		[250,13199],
		[251,13262],
		[252,13325],
		[253,13388],
		[254,13451],
		[255,13483]
	]
}
