{
	"AlgoMap255BrLevel": {
		"sectionone": [0.006667,1.993],
		"sectiontwo": [0.05034,-194.6],
		"sectionthree": [0.01509271238,46.64510565],
		"sectionkeypoint": [4501,6848]
	},
	"LcmMapAlgoBrLevel": [
		[1,1],
		[2,76],
		[3,226],
		[4,376],
		[5,526],
		[6,676],
		[7,826],
		[8,976],
		[9,1125],
		[10,1275],
		[11,1425],
		[12,1575],
		[13,1725],
		[14,1875],
		[15,2025],
		[16,2175],
		[17,2325],
		[18,2475],
		[19,2625],
		[20,2775],
		[21,2925],
		[22,3075],
		[23,3225],
		[24,3375],
		[25,3525],
		[26,3675],
		[27,3825],
		[28,3975],
		[29,4125],
		[30,4275],
		[31,4425],
		[32,4511],
		[33,4531],
		[34,4551],
		[35,4570],
		[36,4590],
		[37,4610],
		[38,4630],
		[39,4650],
		[40,4670],
		[41,4690],
		[42,4710],
		[43,4729],
		[44,4749],
		[45,4769],
		[46,4789],
		[47,4809],
		[48,4829],
		[49,4849],
		[50,4868],
		[51,4888],
		[52,4908],
		[53,4928],
		[54,4948],
		[55,4968],
		[56,4988],
		[57,5008],
		[58,5027],
		[59,5047],
		[60,5067],
		[61,5087],
		[62,5107],
		[63,5127],
		[64,5147],
		[65,5166],
		[66,5186],
		[67,5206],
		[68,5226],
		[69,5246],
		[70,5266],
		[71,5286],
		[72,5305],
		[73,5325],
		[74,5345],
		[75,5365],
		[76,5385],
		[77,5405],
		[78,5425],
		[79,5445],
		[80,5464],
		[81,5484],
		[82,5504],
		[83,5524],
		[84,5544],
		[85,5564],
		[86,5584],
		[87,5603],
		[88,5623],
		[89,5643],
		[90,5663],
		[91,5683],
		[92,5703],
		[93,5723],
		[94,5743],
		[95,5762],
		[96,5782],
		[97,5802],
		[98,5822],
		[99,5842],
		[100,5862],
		[101,5882],
		[102,5901],
		[103,5921],
		[104,5941],
		[105,5961],
		[106,5981],
		[107,6001],
		[108,6021],
		[109,6040],
		[110,6060],
		[111,6080],
		[112,6100],
		[113,6120],
		[114,6140],
		[115,6160],
		[116,6180],
		[117,6199],
		[118,6219],
		[119,6239],
		[120,6259],
		[121,6279],
		[122,6299],
		[123,6319],
		[124,6338],
		[125,6358],
		[126,6378],
		[127,6398],
		[128,6418],
		[129,6438],
		[130,6458],
		[131,6478],
		[132,6497],
		[133,6517],
		[134,6537],
		[135,6557],
		[136,6577],
		[137,6597],
		[138,6617],
		[139,6636],
		[140,6656],
		[141,6676],
		[142,6696],
		[143,6716],
		[144,6736],
		[145,6756],
		[146,6775],
		[147,6795],
		[148,6815],
		[149,6835],
		[150,6880],
		[151,6947],
		[152,7013],
		[153,7080],
		[154,7146],
		[155,7212],
		[156,7278],
		[157,7345],
		[158,7411],
		[159,7477],
		[160,7543],
		[161,7610],
		[162,7676],
		[163,7742],
		[164,7808],
		[165,7875],
		[166,7941],
		[167,8007],
		[168,8073],
		[169,8140],
		[170,8206],
		[171,8272],
		[172,8338],
		[173,8405],
		[174,8471],
		[175,8537],
		[176,8603],
		[177,8670],
		[178,8736],
		[179,8802],
		[180,8868],
		[181,8935],
		[182,9001],
		[183,9067],
		[184,9134],
		[185,9200],
		[186,9266],
		[187,9332],
		[188,9399],
		[189,9465],
		[190,9531],
		[191,9597],
		[192,9664],
		[193,9730],
		[194,9796],
		[195,9862],
		[196,9929],
		[197,9995],
		[198,10061],
		[199,10127],
		[200,10194],
		[201,10260],
		[202,10326],
		[203,10392],
		[204,10459],
		[205,10525],
		[206,10591],
		[207,10657],
		[208,10724],
		[209,10790],
		[210,10856],
		[211,10922],
		[212,10989],
		[213,11055],
		[214,11121],
		[215,11187],
		[216,11254],
		[217,11320],
		[218,11386],
		[219,11453],
		[220,11519],
		[221,11585],
		[222,11651],
		[223,11718],
		[224,11784],
		[225,11850],
		[226,11916],
		[227,11983],
		[228,12049],
		[229,12115],
		[230,12181],
		[231,12248],
		[232,12314],
		[233,12380],
		[234,12446],
		[235,12513],
		[236,12579],
		[237,12645],
		[238,12711],
		[239,12778],
		[240,12844],
		[241,12910],
		[242,12976],
		[243,13043],
		[244,13109],
		[245,13175],
		[246,13241],
		[247,13308],
		[248,13374],
		[249,13440],
		[250,13506],
		[251,13573],
		[252,13639],
		[253,13705],
		[254,13771],
		[255,13805]
	]
}
