{"param21000": {
		"current_mode": "biaozhuimoshi_acl0",
		"param_golden_value": 286,
		"param_section": [18, 30, 46, 74, 102, 230],
		"red": 		[
		[2.14331870409525, 36.5401134557536, -28.6206999363802, 2420.31839841384, 1171.22963229495, 116.428134340355, 87535.5245552465],
 		[0.00385983177184424, 0.492468673476523, 0.78150564396413, -0.254218511023032, -0.305071049712431, -0.107729149145126, -8.22443977893983],
 		[-7.08783982023723e-05, -3.23207140498071e-05, 0.00100101271810064, 0.000865025894305305, 0.000362924583593639, 0.00160886597721704, 0.000483716246215034],
 		[3.5152228182796e-07, 1.93555793121165e-07, -5.01198857551053e-07, -2.42758454588402e-06, -8.73365918635837e-07, -4.03451480789064e-06, -5.27487318634251e-06],
 		[-5.6925868273672e-10, 1.74168404790901e-10, 7.58603637526713e-10, 1.90052317287008e-09, -8.10505342462227e-10, 4.16983459507311e-09, 6.94377428932282e-09],
 		[5.9238616545619, -9.06459401726718, -5.07413162411337, -193.400596990369, 61.6334334559566, -26.4676473254419, 10106.9132520435],
 		[-0.000192716457103704, -0.0497029309008714, -0.0627331586284155, 0.0153684835844143, 0.0122445906904601, 0.00271573962908925, 0.105891827970351],
 		[1.98416242175991e-05, 1.46225457840895e-05, -2.91016111192888e-05, 4.08651807032544e-06, 8.35597743170883e-06, -2.51854017699251e-06, 9.00547164075366e-06],
 		[-2.11216593861593e-08, -2.77308815564713e-08, -7.34029946446333e-09, 1.97349355675552e-08, 1.56785114832955e-08, 2.11205400421048e-08, 2.16720872731886e-08],
 		[1.50901320060312, 0.0922089941000486, -0.0139069659827399, 8.64413973994217, -2.08351636389743, -0.0751810765817887, -2.5374858135587],
 		[0.000235960017759167, 0.00174087883657157, 0.00174944980035197, -0.000249300139768889, -0.000122193377459587, -8.79292027515906e-06, -0.000445911790676973],
 		[-3.74472217044866e-08, 2.2800053912715e-07, 5.48368853016325e-07, -3.64873732950877e-08, -2.15116844580132e-08, 1.11424191007736e-08, -1.55963580334331e-08],
 		[-0.0512644906111214, -0.0057824229853017, 0.00495421510907678, -0.173967056179295, 0.0470647317234566, 0.000461746231229204, -0.00103894436458912],
 		[-7.42579890453953e-06, -1.92197970104226e-05, -1.55822848338735e-05, 1.48240699230592e-06, 4.32456774540844e-07, 8.62218532327149e-09, 6.26159982362735e-07],
 		[0.000760792625212732, 4.2897146444197e-05, -6.23232013150987e-05, 0.000758634065588323, 4.805268453121e-06, 2.80710552366147e-08, 9.46250256706336e-06],
 		[-0.00346736247789007, -0.114246966195463, 0.714335941808471, -0.174767994172849, 0.182881360257941, -0.0242541749335475, -2.94279110159717],
 		[8.43466316679415e-05, 0.000457939959014417, 0.000326226234931301, 0.000582174207246544, 0.000307860245812758, 0.00113608889973873, 0.00154789638660055],
 		[-5.10537654075488e-07, -5.57855145988887e-07, -9.67883099729994e-07, -2.00243276013976e-06, -2.71316428580153e-06, -3.87862686994948e-06, -6.31222213081642e-06],
 		[9.06100916226983e-10, 9.84414248322525e-10, 1.85632181861363e-09, 2.88091028819972e-09, 4.07050822783898e-09, 5.907379404469e-09, 8.64740976380322e-09],
 		[1.82747395972865, 8.46239684408205, 6.86602236713484, -21.0577602271976, 42.4846183857869, -2.89940780703935, -2651.80408986843],
 		[0.00124482957498284, 0.0149989404254014, -0.0529564630831843, 0.0110411458058827, -0.00519073559097345, 0.00105751686348262, 0.0380415500043287],
 		[8.01938184340614e-06, -2.0820862776646e-05, 1.61190666936603e-06, 3.12996368654479e-06, 1.15460781590413e-05, -3.93487768823234e-09, 4.71334651393934e-08],
 		[-6.17491787372717e-10, -1.03002847339091e-09, -2.85046226927753e-09, 8.3906537747145e-09, 9.60694585742144e-09, 1.13763561048113e-08, 1.63644159569023e-08],
 		[-1.17402886413617, -0.0347838390670468, -0.0681077918784409, 3.68826998006287, 3.32077378898989, 0.152350993577539, 0.121292068016414],
 		[0.000103715514681929, -0.000531462213487937, 0.0013678526214102, -0.000175291699897253, 7.01922509432485e-05, -1.4710056393335e-06, -0.000158650975856123],
 		[6.35854723061118e-08, 6.24550876111966e-07, 1.10107528223039e-07, -2.53974633450025e-09, -4.56417284187639e-08, 4.59578217624082e-09, -3.25154148698511e-10],
 		[0.0479248253854553, -0.00295037060172878, -0.00253571616974311, 0.143916764528983, -0.0550699431273664, -0.000498892123598477, 0.041284837941325],
 		[-4.63338041342713e-06, 6.98465406166169e-06, -1.14023701714685e-05, 9.79328824640395e-07, -2.81929629674539e-07, -2.88165285802909e-09, 2.21208135100062e-07],
 		[0.00236983664861624, 0.000284190915130692, 4.58942470176236e-05, -0.00108147886896524, 0.000134681546500708, -7.19795497679318e-08, 0.000519000504479254],
 		[0.000960137256650765, -0.183074470193831, 0.206563658408547, -0.0738913607630431, 0.0147649495288226, 0.00233235391668686, -1.07031225602106],
 		[-1.73216649162642e-06, 0.00013156916143285, -1.02596851810185e-05, 0.000119985766440009, -2.97294485442879e-05, 0.000182252147410055, 7.40459350132597e-06],
 		[-3.40430106876709e-09, -1.32552373233641e-07, -7.42599851869318e-08, -3.53091272165638e-07, -3.11404852260525e-07, -6.26863205914525e-07, -7.38696110837875e-07],
 		[-9.76200397165931e-12, 2.54956758041819e-10, 3.37099191781283e-10, 4.05527731361516e-10, 4.94856726493246e-10, 8.81712524707627e-10, 1.1205787411499e-09],
 		[-9.28743593484155, -2.51655773477632, 0.958123045886685, 46.4066869877813, -159.821413652799, 26.4519510611305, -8910.78423093912],
 		[0.000275020440282254, 0.0212981618162589, -0.0150711266308009, 0.00409487972863767, -0.000140014344602285, 5.2532612601503e-05, 0.0137245145588388],
 		[2.39557080299218e-06, -5.89967992326082e-06, 3.97631156413892e-06, 9.1438206466024e-07, 4.52592774522176e-06, 1.11037375597162e-06, 2.74652555934605e-06],
 		[-3.9361124589728e-09, -5.09099977896211e-09, -8.10100043875885e-09, -2.14907818419213e-09, -3.44543816841954e-09, -2.00744589996738e-09, -2.03543447433973e-09],
 		[-0.0363335581477941, -0.030781125908973, -0.0103937814086806, -7.96904537945189, -0.248772515510584, -0.0501078856170487, 11.4893126387767],
 		[1.8962587698517e-05, -0.000799980794461549, 0.000381107395490201, -6.68578275831153e-05, 1.61747270504238e-06, 3.16999938705438e-07, -5.78362609350647e-05],
 		[5.09233203209841e-11, 1.72286782523098e-07, 1.70966383765332e-09, 3.52622320577628e-09, -1.58843797207165e-08, 6.06122062023716e-11, -3.36630049490973e-09],
 		[-0.0186694720000834, 0.0121690816252264, -0.00118787052263158, -0.0201597756070918, 0.000243700281445302, -7.34241997996222e-05, -0.065367556568734],
 		[-8.83590948568563e-07, 1.01139254129181e-05, -3.18324966308943e-06, 3.78795050924582e-07, -1.00937921897852e-09, -9.6990830370013e-10, 8.13000914378439e-08],
 		[-0.00258950477840319, -0.000401219586322929, 1.14796127676274e-05, 0.000538843400497898, -0.000116733516530936, 2.11561493052547e-07, -0.000502392244874765],
 		[-1.01158603100777e-05, -1.02481944609084e-05, -1.03402376410726e-05, -1.37331694270469e-05, -1.05651001641858e-05, -7.80083993440225e-06, -7.31593109775364e-06],
 		[-3.48726312576364e-06, -3.86269069581159e-06, -3.61859235511028e-06, -2.60606812272048e-06, -2.43387833124527e-06, -1.76392347102101e-06, -1.74302109464917e-06],
 		[-2.24963631157506e-06, -2.16958242637708e-06, -2.96301535016893e-06, -2.61125395617531e-06, -2.45699133249602e-06, -1.78603316189094e-06, -1.68910128306661e-06],
 		[1.49339495511368e-08, 1.64052053351371e-08, 1.49600220663401e-08, 1.4355126626303e-08, 1.21181457306314e-08, 9.6086690152791e-09, 9.23854305075822e-09],
 		[-2.064151098706e-09, -1.36388804607067e-09, -1.39852471634521e-09, -7.36830718368851e-10, 4.73509530917527e-10, 1.9258119334942e-09, 2.90556909548768e-09],
 		[-7.44494597497347e-10, -2.0338008243529e-08, 2.75444819455881e-09, 7.71294116731511e-08, 3.65129762881812e-08, 1.55409461099754e-08, 1.21961683422588e-08],
 		[3.95887892995613e-09, 4.12752091249178e-09, 4.08095307263581e-09, 3.59129759651944e-09, 3.68451165533217e-09, 3.31951143970944e-09, 3.23614327188668e-09],
 		[9.35276351756049e-09, 1.08511602808452e-08, 1.05835673734858e-08, 9.44241545908387e-09, 8.82789141071825e-09, 7.12408738244647e-09, 6.71565330560146e-09],
 		[3.43738310743033e-08, 1.94131024132179e-08, 1.29646116149905e-08, -3.42982565584313e-10, 6.98419433117257e-10, -2.27301764026846e-10, 3.77694494381532e-10],
 		[6.35798628355822e-09, 7.65951435925067e-09, 8.26319684048222e-09, 7.33224822310346e-09, 7.09686214144247e-09, 6.25858588819025e-09, 6.19926113750572e-09],
 		[1.06831347807528e-09, -1.5023591383508e-10, 1.25110762729685e-10, 5.16029206417425e-10, 3.31784287699847e-10, 1.84941553229997e-10, 2.41955044079471e-10],
 		[-8.99254381830926e-09, -1.50774045185169e-08, 7.5175702823009e-09, 3.96711148249089e-09, 4.84350353380677e-09, 1.4430168923425e-09, 1.09327955108133e-09],
 		[2.27020241641532e-09, 4.18909406877756e-09, 3.69196210167801e-09, 3.32630800520693e-09, 2.73826749648491e-09, 2.13047229771064e-09, 2.02476328351222e-09]
],
		"green": 		[
		[1.02105691340922, 39.896813776237, -76.6964030739807, 2720.84060640984, 1032.16040943513, 96.6280929922596, 76770.4227243886],
 		[0.0082286853547453, 0.610181747211529, 0.273097037274511, -0.0412325392398309, -0.366133276874686, -0.062403757929, -5.85315787990852],
 		[-0.000130135638911597, -0.00021074674589712, 0.000556174950606733, 0.000317411262057566, -2.77675734287624e-05, 0.000487418613589618, -0.00192980524264026],
 		[7.14189541919836e-07, 2.87830011273123e-07, 2.18429785985552e-07, -8.63423109230882e-07, 1.00880481461975e-06, -5.31166161709545e-07, 1.05517355819763e-06],
 		[-1.20070719077821e-09, -3.223497614162e-11, -3.81178565781182e-10, -1.02988605866743e-10, -2.9352406517935e-09, -4.71294462756207e-10, -5.80165400159943e-10],
 		[2.10341995971649, -10.4570193810409, -9.41000053271957, -218.599618043544, 53.1504530108203, -19.6668701087474, 9082.97927775393],
 		[-0.00104582819398413, -0.0665137301100667, -0.0237889972598029, 0.00307190191522561, 0.0139652522113823, 0.00160511651293942, 0.0763353772105719],
 		[1.18264776884455e-05, 1.96594698889587e-05, -2.2384872351898e-05, 2.434801613759e-06, 2.44508868824531e-06, -1.06159181881299e-06, 1.72204390456422e-05],
 		[-2.21214942534988e-08, -2.27134994193643e-08, -8.69258449192451e-09, 1.03860912568608e-08, 2.19323265154044e-09, 4.8394781052798e-09, -1.05512632412591e-09],
 		[1.10597059330071, 0.159177740220485, -0.128493452679079, 9.77477026505141, -1.87471690145245, -0.0488777877688094, -2.20773865466304],
 		[0.000168762595127438, 0.0024258069260091, 0.000714185603214511, -4.81289817875019e-05, -0.000155508895134344, -6.47852830578607e-06, -0.000326323251896035],
 		[-3.99266491162085e-08, -1.2908828013944e-07, 3.57038089562947e-07, -4.27869229282858e-08, -1.67487837473804e-09, 5.91093536995386e-09, -2.9364654573452e-08],
 		[-0.0374065357945765, -0.0082262471975557, 0.0100320271683117, -0.197686193792671, 0.0422181185292527, 0.000315331566975197, -0.000983348338651735],
 		[-5.2329764161038e-06, -2.8900930516881e-05, -6.72004318703745e-06, 3.40529184515619e-07, 5.90667785316411e-07, 8.81422461998166e-09, 4.6345290014554e-07],
 		[0.000538094458302818, 2.59972273120061e-05, -9.38127304757735e-05, 0.000853899323044218, 4.34721585626108e-06, 2.94129830479194e-08, 8.30977713513816e-06],
 		[0.00402446377529797, -0.154292036050161, 1.2742771622663, -0.333508398393924, 0.379694713672544, -0.1337044361697, -4.55033745300684],
 		[8.77192800070682e-06, 0.000624979253694536, 0.00103039587341386, 0.00124809424497141, 0.000662479687259401, 0.00249588073328619, 0.0030677858026027],
 		[-7.06764868097009e-08, -7.01415665959815e-08, -1.82538061790316e-06, -2.88259847774676e-06, -4.9209430879199e-06, -8.73259526385098e-06, -1.72536629847353e-05],
 		[-2.86798583167273e-11, -5.63121620434341e-10, 2.01550830527223e-09, 3.96823191113825e-09, 6.98131056981353e-09, 1.28226111731397e-08, 2.20718009239877e-08],
 		[2.9144054934245, 10.173312504201, 13.9643266590175, -23.3088130087576, 38.3917407248558, -1.05385951625533, -1910.53831194791],
 		[-0.00168214287261291, 0.020248608310733, -0.0986344392920832, 0.0175347975988894, -0.0133944391056165, 0.00216308303182022, 0.057766293582803],
 		[1.44658549321321e-05, -3.32538787905347e-05, -2.01323591580145e-05, -9.8187953602194e-06, 1.43886861292005e-05, -5.42546367170897e-06, 1.8952968350525e-06],
 		[5.93140374943819e-09, 1.73571531366979e-08, 2.84966680208041e-08, 2.83531684284685e-08, 3.60384800632905e-08, 4.25327092855287e-08, 6.08534149118265e-08],
 		[-0.877995977575975, -0.0465304700062963, 0.00432407991452884, 4.15275285109705, 2.96873579720724, 0.103469784515875, 0.0995828858462346],
 		[0.000399110305116582, -0.000786869765463414, 0.00256296316005154, -0.000268544355895581, 0.000172934817013787, -5.56557428743063e-06, -0.000242000848759507],
 		[1.58062274824837e-07, 9.66784415200112e-07, 3.56577400489615e-07, 1.21782142082432e-07, -5.61420179838781e-08, 1.53017434547325e-08, -1.61658695087269e-08],
 		[0.029912166670652, -0.00241745279639039, -0.00973407925670159, 0.163770634104325, -0.0493325531912573, -0.000348267575065707, 0.0361256004413716],
 		[-1.47332185278602e-05, 1.08205296918359e-05, -2.16234639830608e-05, 1.41482077207756e-06, -6.99904968368504e-07, 3.28810868011695e-09, 3.41421161725871e-07],
 		[0.00149489918110774, 0.000362412099907334, 8.83710479882981e-05, -0.00121998321338891, 0.000117416023921965, -1.40944991010577e-07, 0.000453230760905923],
 		[0.000752196786886634, -0.200340602503305, 0.182965823339883, -0.0119892797618122, 0.0317673486978209, 0.00405351915172365, -1.11045634920504],
 		[7.63737915159904e-06, 0.000194839566510604, 0.000177882432014726, 8.7629884524545e-05, -5.12316323475709e-06, 0.00017914890394196, 0.000392456796667329],
 		[-6.84068601819435e-08, -1.05517846553732e-07, -1.12437716142998e-07, -3.01834353250603e-07, -2.00119177155542e-07, -4.48213064705418e-07, -7.39468750804167e-07],
 		[1.17480982242026e-10, 1.98066552097283e-10, 1.12098785447947e-10, 3.3549563996653e-10, 3.81392224437709e-10, 5.27269717334477e-10, 5.04126273783771e-10],
 		[-6.09324035180205, -3.61063472029034, 2.39657071014838, 52.5064590517945, -140.831665781717, 18.2794072554081, -8447.47351881699],
 		[9.93220592326147e-05, 0.0229328654097501, -0.0141732623283747, 0.0013975948200497, -0.000806613762213795, 0.000120417718080322, 0.013934593442319],
 		[2.83415321373039e-06, -1.1083866247306e-05, -4.53599165031642e-06, 2.36889079471454e-06, 3.93724314875014e-06, 1.4036868136655e-06, 8.76682736468723e-08],
 		[-2.78911086098549e-09, -3.70650560657825e-09, -2.81218045830378e-09, -1.07109740859189e-09, -2.86489418471715e-09, -8.99302662105917e-10, 3.89883371454928e-10],
 		[0.000314536324579479, -0.0287242155362206, -0.10246918074355, -8.99904023338572, -0.216017651496777, -0.0319548499598877, 10.0448659982331],
 		[4.2348001050567e-05, -0.000844853131056446, 0.000380294163764676, -2.67538721316869e-05, 1.20554629212427e-05, -3.85914875608581e-08, -5.71456250075177e-05],
 		[1.72281345262222e-08, 2.90504710542882e-07, 9.60223332034721e-08, -4.62198833094076e-09, -7.17364328353076e-09, 3.307163760307e-10, 2.00307825019895e-09],
 		[-0.010554383216818, 0.0123083526071986, 0.00276997715012633, -0.0229108348570977, 0.000192725621438125, -5.92965816575451e-05, -0.0570877347931609],
 		[-1.74423702196851e-06, 1.04218151991184e-05, -3.30723636953534e-06, 1.83175417283041e-07, -5.42816996447568e-08, -3.82730227171599e-10, 7.82832513942806e-08],
 		[-0.00156320981394985, -0.00044274997001579, -8.54615339238431e-06, 0.000611003752956736, -0.000101387669222813, 2.50605673299635e-07, -0.000438797540732671],
 		[-4.60131889957746e-06, -4.98929859636127e-06, -4.75371077329766e-06, -6.28875558370599e-06, -4.99117665963663e-06, -3.85394879906468e-06, -3.94120671793987e-06],
 		[-4.83916126427653e-06, -4.72152606646056e-06, -5.03977596324343e-06, -4.60045144161042e-06, -4.50691175625198e-06, -3.58116773418716e-06, -3.57443226991311e-06],
 		[-9.10050288053529e-07, -8.12938689451988e-07, -1.18275697119804e-06, -1.14568534192861e-06, -9.88728811842639e-07, -7.62981122687538e-07, -7.64668358273296e-07],
 		[8.75490745562974e-09, 1.1087596588826e-08, 1.00214576913688e-08, 1.01903688287452e-08, 8.73999564613834e-09, 7.46969451588443e-09, 7.23816590805363e-09],
 		[4.12223847893386e-10, 1.73953885213095e-09, 2.49226094129308e-09, 2.38321500666456e-09, 3.06177858201213e-09, 3.65787376881667e-09, 4.27304789721851e-09],
 		[2.79439627550869e-08, 2.18871334779104e-09, -3.2041051237118e-09, 2.97189408814735e-08, 1.48002971202333e-08, 6.0469186664481e-09, 5.77093478176199e-09],
 		[6.90453100025612e-09, 7.36188390154519e-09, 7.41225628152622e-09, 7.05507917566198e-09, 7.04575316553985e-09, 6.80534402633745e-09, 6.85637358147643e-09],
 		[1.34288645644655e-08, 1.45875170736206e-08, 1.61914356755809e-08, 1.5579193786049e-08, 1.48814665653698e-08, 1.32512042343474e-08, 1.31537589947264e-08],
 		[4.22408181992931e-08, 1.62323892419984e-08, 8.705093404406e-09, 4.40402120516692e-09, 6.24661577117527e-09, 1.22880079091931e-09, 1.39486471787187e-09],
 		[3.5657079008346e-09, 4.72848540708565e-09, 4.69199227968734e-09, 4.35486862827666e-09, 4.10996707305101e-09, 3.65246217154509e-09, 3.51816656826476e-09],
 		[-3.07977904049807e-10, -7.86971003347967e-10, -4.48494114924852e-10, -3.0884950284515e-10, -3.91358713778963e-10, -4.1709489797426e-10, -3.82634282568822e-10],
 		[-3.58698042066445e-09, -9.37558105709297e-09, 6.04189369259726e-10, 1.80816859226458e-09, 1.28256850347476e-09, 4.82640508362733e-10, 6.34726822439115e-10],
 		[1.42263454194169e-09, 1.52172580635329e-09, 1.80289590480207e-09, 1.44979104381352e-09, 1.33853165335901e-09, 1.14752584425468e-09, 1.07129264232136e-09]],
		"blue": 		[
		[-0.09768928299755, 79.9373172769553, -65.741513431201, 568.633985569953, 651.15508393459, 36.9259105124666, 40654.8876469704],
 		[0.00630564530928267, 0.90122820572026, 0.0200477344160055, 0.155653261471126, -0.381032479853854, -0.033735878407638, -0.823168170970346],
 		[-0.000112733103489379, -0.00032993814765014, 0.000156525923095264, -0.000140538084151818, -4.75732157644746e-05, -1.56656727752734e-05, -0.00153735469208128],
 		[6.27092694863849e-07, 3.09314306027735e-07, 5.67033304271562e-07, -2.64918877652714e-07, 1.5333079406341e-06, 4.89809536612795e-07, 2.04722965112687e-06],
 		[-1.01260174779128e-09, -1.88831813487449e-10, -6.09246413358427e-10, -4.72257416179969e-10, -3.04114112415043e-09, -1.07871488654705e-09, -1.63068596922034e-09],
 		[-1.1337534738336, -15.7968538905805, -1.72343746561545, -45.939064326283, 29.8165950416427, -6.59871866001252, 3478.85977882712],
 		[-0.000954474847335103, -0.102217579425549, -0.00358492549199507, -0.00736269741351973, 0.013573768085722, 0.000733584281369974, 0.0117902012466137],
 		[5.99749656209861e-06, 2.42146089944847e-05, -1.11935845678043e-05, 8.76217560629505e-06, -3.54899027955395e-06, 4.18256184240829e-08, 1.06070552030618e-05],
 		[-1.55111339765132e-08, -1.46009044888297e-08, -9.57897418646901e-09, 6.16264333412898e-09, -2.40033086859784e-09, -1.62049008496078e-09, -6.83747823686493e-09],
 		[-0.000718907931530632, 0.231020332745328, -0.0726159077517496, 2.04937103825626, -1.21241829657048, -0.0107166440059491, -1.1936728850103],
 		[8.96880758552338e-05, 0.00382123560574902, 0.000156200090973938, 0.00010975984096671, -0.000153772568220151, -4.13666556807157e-06, -5.3884346533832e-05],
 		[-5.47311546478452e-08, -3.66517538670191e-07, 1.77228460245422e-07, -1.04258728030493e-07, 2.46065905383342e-08, 1.45003098001092e-09, -1.71233894926034e-08],
 		[0.000697297122692333, -0.0123076892953485, 0.00236628812413005, -0.0418692866377149, 0.0267889804370739, 8.39113077857148e-05, -0.000341576281558036],
 		[-2.59379875239131e-06, -4.72295557878673e-05, -1.86387443372043e-06, -4.71610941656111e-07, 5.79500746440696e-07, 7.64268492986839e-09, 8.02375047983771e-08],
 		[0.000154343349038885, 2.6787048071798e-05, -4.03577058229853e-05, 0.000177989788009723, 2.78267237570837e-06, 1.677369859402e-08, 4.3968381200836e-06],
 		[0.00159513489964132, -0.207816507541706, 0.351221437969336, -0.115303380943229, 0.0591030936510789, -0.0371182453563538, -1.58577214680467],
 		[-6.69564839021764e-06, 0.000208309210572298, 0.000120816965231445, 0.000193919398486897, 1.97084949466503e-05, 0.000542350989931291, 0.000767477685975872],
 		[5.92873042884523e-08, -2.26063544494108e-08, 3.10412168206543e-07, -1.78790458513676e-07, -8.19225968298558e-07, -1.71357914170665e-06, -3.63446506744847e-06],
 		[-1.92020958690885e-10, 1.38482790543652e-10, -8.72411779881103e-10, 2.27420019798695e-10, 9.65960850488263e-10, 2.35236426631779e-09, 4.19916353410999e-09],
 		[0.507685343585633, 13.4295328009226, 5.53241698360994, -4.70909840919929, 25.3102066580904, -0.0168945323383697, -1193.52034494223],
 		[-0.000342381447762943, 0.0240807287370809, -0.0268432681667619, 0.00592400127686084, -0.00205735513929492, 0.000473710784882185, 0.0197164378876958],
 		[4.07183534621852e-06, -1.40665353830089e-05, -4.14106164948858e-06, -1.17400465770155e-06, 5.89326660141794e-06, -8.20105187419519e-07, -1.74269785089824e-08],
 		[-7.65094559058303e-10, 2.36443656419165e-09, 5.32628080403368e-09, 4.02906829554993e-09, 7.66629368125889e-09, 9.13525368919606e-09, 1.38150723256445e-08],
 		[-0.0165075658908776, -0.0379121392083083, -0.0802629101497972, 0.867856875089524, 1.88144213552462, 0.0258130214502121, 0.0788933675441911],
 		[9.54121676413128e-05, -0.000912213982299079, 0.000687481395198702, -9.74666683129593e-05, 2.3930793791158e-05, -1.53325445606689e-06, -8.15429954304426e-05],
 		[-1.56933354423819e-08, 3.69334351921411e-07, 8.54996285136026e-08, 2.88300493052021e-08, -2.43410255162028e-08, 3.48945030216919e-09, -2.18937824858618e-09],
 		[-0.000884552008038601, -0.00387409079785987, -0.00131505009158013, 0.0348216740010065, -0.0314053865747926, -9.72802665580554e-05, 0.0189672367890976],
 		[-3.51640340916393e-06, 1.15127878491381e-05, -5.78537670170359e-06, 5.32805957476929e-07, -8.90745083411628e-08, 1.68065266011852e-09, 1.1285489846826e-07],
 		[-6.79457589045954e-05, 0.000587232509768022, -1.25826232491746e-05, -0.000256005523276996, 7.38994268785415e-05, -1.01645220310523e-07, 0.000240084526023075],
 		[-0.00398958730660574, -0.296521449690072, 0.419684495063603, -0.0080450295130615, 0.238372041778999, -0.0279087767647797, -0.770653927819623],
 		[5.32950524652926e-05, 0.000398868358896647, 0.000277740100377016, 0.000142195910030023, -0.000123641274799137, 0.000457634429947644, -5.00752379831161e-05],
 		[-2.0197728823255e-07, 7.90273185038007e-07, 3.90408411461178e-07, 3.64538466780847e-07, -2.16983265433634e-08, -1.01887496625473e-06, -2.25549697030255e-06],
 		[1.82350836634567e-10, -1.92522631560619e-09, -1.1011833892649e-09, -7.99555646331317e-10, -5.70276213818803e-10, 1.21618302929983e-09, 1.22171074723282e-09],
 		[0.650208543072007, -5.08497310906888, 2.2168666684814, 11.1382559399865, -86.1367657150064, 5.69662487164425, -2960.40330348188],
 		[0.00075692215238687, 0.0332070109098582, -0.032974094216361, 0.000709735441172665, -0.00855106789207863, 0.000341257772042271, 0.0101671728452746],
 		[-1.76132741545497e-06, -3.66401156539291e-05, -1.02884069660257e-05, 2.52980943758238e-07, 8.44015414171269e-06, 8.69364393297938e-07, 6.77143257524393e-06],
 		[1.81745876364684e-08, 1.64699509455326e-08, 1.30929644612013e-08, 1.04728037808648e-08, 1.4401437871741e-08, 1.55667724849188e-08, 2.10817124123206e-08],
 		[0.0204417341363925, -0.0523175521644107, -0.0466155690073142, -1.88902586801421, -0.117575213778545, -0.00669894164211264, 5.31603865058539],
 		[3.16269649489718e-05, -0.00120146200671801, 0.000858902580293693, -1.66452913277506e-05, 0.000101375332690951, -1.40204365694317e-06, -4.47468793206054e-05],
 		[2.06800024914866e-07, 8.16647955369657e-07, 1.89293762633083e-07, 3.14604355213204e-08, -2.90763252564436e-08, 1.29473673459093e-09, -1.50495181798544e-08],
 		[-0.000899376969215592, 0.0201894673802488, 0.00173864022257843, -0.00482160175340848, 0.000276178411363546, -2.01215260150209e-05, -0.0302404248400167],
 		[-2.61420882914754e-06, 1.43909485187233e-05, -7.39915669079055e-06, 1.14055050234279e-07, -3.97923693599921e-07, 2.25046977525384e-09, 6.61036347106559e-08],
 		[-4.06817076402646e-05, -0.000726732208335404, 3.94368607093849e-05, 0.000129265701973085, -6.39253450202943e-05, 1.34000903649952e-07, -0.000232446158973209],
 		[-1.101913704381e-06, -1.07966369438229e-06, -7.61465988721791e-07, -1.03504711755166e-06, -6.72962259253096e-07, -4.37332487991836e-07, -7.57855868610437e-07],
 		[-5.20795515218276e-06, 1.25373231756792e-07, -6.9950447285565e-07, -6.30436386465321e-07, -1.1787675502425e-06, -1.19292890173765e-06, -1.36506517415851e-06],
 		[-7.93127148915105e-07, -2.63485626184116e-08, -5.06078685881507e-07, -2.12277848244932e-07, -3.50024824373483e-07, -2.88644972031525e-07, -3.02628784058982e-07],
 		[1.67571881492316e-09, 3.98962172334811e-09, 2.60681393707224e-09, 3.11572683778035e-09, 2.50523877385309e-09, 2.22527675805244e-09, 2.18474992124821e-09],
 		[7.08172589988887e-10, 4.77466987351534e-10, 7.72162668449917e-10, 4.70558601019521e-10, 4.95737441992971e-10, 4.86736355212168e-10, 6.25145714340768e-10],
 		[1.92964563048284e-08, 4.72024195520613e-09, 1.30890041948519e-09, 5.12916857540683e-09, 2.03961540325863e-09, 2.43304264240377e-10, 1.41449801376621e-09],
 		[7.56728645017089e-09, 2.18367355718994e-09, 1.6774747153812e-09, 1.99405499837985e-09, 2.58698253614044e-09, 3.12907938873531e-09, 3.30852263055941e-09],
 		[1.05617591575919e-08, 5.17696083652323e-09, 4.88404198525657e-09, 4.72859692222572e-09, 5.27974137257586e-09, 5.30988484636239e-09, 5.39581452823691e-09],
 		[8.09299232468978e-08, -3.71882468322373e-08, -1.24548161738594e-09, -2.24454443823638e-09, 1.70280268651668e-09, 4.92167608101155e-11, 5.54091197592478e-10],
 		[9.56447199917097e-10, 1.56070455145556e-09, 2.09843622961031e-09, 1.74976493632487e-09, 1.6932410921198e-09, 1.56210699352773e-09, 1.41482390909877e-09],
 		[1.37099153156325e-09, 6.9971621710837e-10, 7.92440761378766e-10, 8.86838977058488e-10, 9.50963349663339e-10, 8.75157716858463e-10, 9.89476858507099e-10],
 		[8.62148876936529e-09, -1.02206377338003e-08, 4.90308129831944e-10, -2.72226968469644e-09, -1.68266204126411e-10, -2.37351171250328e-10, -1.42870442037499e-10],
 		[2.51131395317027e-09, 7.8083162346274e-10, 1.12568637395764e-09, 6.90190987899074e-10, 6.70064167364351e-10, 6.23939080366815e-10, 7.06128985009563e-10]],
		"ir": 		[
		[-1.07972415751684, 84.7197864244645, -40.1357598629757, -523.998780001255, 794.122960347959, 25.7321774285432, 41847.7171620565],
 		[0.0111369384373784, 0.564846886369134, 0.200553796766008, 0.0777666235855215, -0.807972849299316, -0.0696316692498281, 0.526837156664997],
 		[-0.00015816721251805, -0.00147198770679879, 0.000116330382723327, -0.000862904408976626, -0.000183283518236039, 0.00021447169692828, -0.00288282270518102],
 		[8.1003636634865e-07, 1.4655803120907e-06, 7.03233424344305e-07, -1.60512588264764e-07, 2.77147027441258e-06, -3.95760449119041e-07, 8.01878430058983e-07],
 		[-1.44598893591565e-09, -9.90431811399052e-10, -5.85827375810615e-10, -1.14987575884246e-10, -4.42039589928105e-09, 3.14603404100284e-10, 1.54095327627234e-09],
 		[-3.44995614353913, -14.6704818818492, -1.72510834336722, 42.5697652113572, 31.148696383481, -5.43876689411941, 1980.81424386739],
 		[-0.00147386586037075, -0.0548478244588911, -0.017327739127085, -0.000987231172089396, 0.0285321831243134, 0.00115403299802639, -0.00363881706857114],
 		[8.62280974274573e-06, 9.76482573986998e-05, -1.16840548923738e-05, 3.39362786738726e-05, -4.511044478013e-06, -1.24709852016722e-06, 2.29019477024174e-05],
 		[-9.00832313142883e-09, -4.386218507614e-08, -1.13823429276148e-08, 3.55833289179457e-09, -7.53461945007628e-09, 8.36835979172315e-10, -6.74307140482402e-09],
 		[-0.630329360497368, 0.153699535235104, -0.00562946132031971, -1.96054966417177, -1.55892079859388, -0.0149949567156604, -1.25542192703329],
 		[9.26683685591474e-05, 0.00167662507487487, 0.000511926558178115, -4.800582628639e-05, -0.000328185844521576, -6.05815680804188e-06, 4.09023599364858e-06],
 		[-3.4789857639555e-07, -1.55285496754533e-06, 1.91188904565903e-07, -3.16669311279117e-07, 4.11306575867276e-08, 3.38054485956089e-09, -4.2231944897675e-08],
 		[0.0232336084970661, -0.00505490271321149, 0.00130453612312702, 0.0415849885582293, 0.0340231657607245, 9.57517960057251e-05, -9.8148168522899e-05],
 		[-4.15725986394394e-07, -1.60854422366885e-05, -4.95285209574997e-06, 6.94193812037585e-07, 1.24779598639025e-06, 1.01883546397334e-08, 8.15494639425908e-09],
 		[2.42559261327923e-05, -8.92658449438268e-05, -2.40342492720301e-05, -0.000165301388759686, 3.56567447474101e-06, 4.46131172386816e-09, 4.47871706031925e-06],
 		[0.00155538431388889, -0.371948118537055, 0.278561343419896, 0.118949311884588, 0.200663720218979, 0.00414143527986773, 0.943912460226314],
 		[-6.58554136130886e-06, 9.74318731355355e-06, 0.000289268235385476, 9.22036939092533e-05, 0.000135585547655905, 2.6593315361655e-06, -0.000181459123682578],
 		[4.99824846786202e-08, 6.02031932334254e-08, -3.60217260038796e-07, 4.86869083695984e-07, -2.05982102982273e-07, 1.32621679313462e-07, 1.17290191125506e-07],
 		[-1.49721282959454e-10, 6.41534456204754e-11, -8.90513694823451e-11, 8.21284994846949e-12, 2.39548950200179e-10, -1.90816903534061e-10, -1.84931842664126e-10],
 		[-0.9786795679283, 15.487765099504, 3.81717746720825, 4.54532467075159, 33.8800265335121, -0.685793249129209, -1758.24944803007],
 		[-0.000398219045431364, 0.043064487226165, -0.0226485420363045, -0.00644509922750107, -0.0076120833920129, -5.02990619099283e-05, -0.0117762780307943],
 		[5.00405725912842e-07, -1.65644335565077e-06, -1.16231532849779e-05, -5.6954554721904e-06, -2.12669550064123e-06, 1.50662691814638e-07, 1.57230083773939e-06],
 		[1.072363856166e-09, -2.8200218782994e-09, 9.99333707334198e-09, -7.80726767390614e-09, 1.53675156828696e-09, -3.89436866432558e-10, -1.35032670538129e-10],
 		[0.473237700980515, 0.117876448219631, -0.0208580058005043, -0.81819523097567, 2.37443557971779, 0.0314012858255063, 0.113129021783359],
 		[5.01538858044343e-05, -0.00166265754265346, 0.000609357457308082, 0.000114864655474432, 9.34950860239097e-05, 3.48583964134827e-07, 4.92929319114525e-05],
 		[-3.87659296115089e-08, 5.54587015249449e-08, 1.10792772211222e-07, 7.770601952481e-08, 1.19513366142797e-08, 5.69002504107733e-10, -2.78967288885488e-09],
 		[-0.0188570716910387, -7.71277810670332e-05, -0.0017721605689109, -0.0353511123270199, -0.039681693220429, -0.000103034305465645, 0.0193131455805877],
 		[-1.58212728060694e-06, 2.13613934204977e-05, -5.40161431609632e-06, -6.98619996606191e-07, -3.79528667245005e-07, -1.1664259912727e-09, -6.88723651518967e-08],
 		[-0.00095935153409219, 0.000459627762852155, 2.73050154161673e-05, 0.000236235040500174, 8.87794642831736e-05, -1.09791019497225e-08, 0.00024760781024746],
 		[-1.64270626952364e-05, -0.228705999554442, 0.0863119305559181, -0.0517775502918456, 0.131051816907214, 0.00299676003771602, 0.437185065430839],
 		[5.72461077000966e-06, -1.78172484569067e-05, -5.41724952294034e-05, 4.71228588307849e-05, 4.92519012139446e-05, 2.24153617454452e-05, -0.000221867640826969],
 		[-2.83363626078112e-08, 1.04320511567388e-07, 1.87827908975207e-07, 8.68818786505138e-08, 5.46978048708937e-08, -9.66797281740454e-08, 4.08560695848462e-07],
 		[3.6007116370742e-11, -2.04178628267752e-11, -1.54352510826845e-10, -1.65605803977993e-10, -1.68221276908415e-11, 9.00793020483255e-11, -3.03125320271157e-11],
 		[5.20135840560387, -9.03641973241403, 0.454676964399687, -10.6287642210839, -102.83603737616, 5.49032860107705, -917.720608979974],
 		[-7.50395083733879e-05, 0.026123188598544, -0.00648997886312826, 0.00309082566248462, -0.00504324095932941, -7.03446365655407e-05, -0.00530093273107203],
 		[-2.30270847674313e-07, -3.72486403411974e-07, 7.63440618882708e-07, -2.08665098805049e-06, -1.34291152525339e-06, 7.3071989452597e-08, 1.36447517718011e-06],
 		[8.13864692673836e-10, -3.16012895079572e-09, -2.67529674878376e-09, 8.93710351906691e-11, -5.00690637952138e-10, 4.35433467432523e-10, -1.47968216077979e-09],
 		[0.0298906484136932, -0.0853440607626543, -0.00707505416710436, 1.8316762772126, -0.142768686808286, -0.0107224536506672, 5.47059794813119],
 		[1.92643264240653e-05, -0.000985760940456954, 0.000168766367955625, -6.22132015100871e-05, 6.36059523455659e-05, 3.80618399824517e-07, 2.15661861399291e-05],
 		[-6.60276696840579e-09, 2.81201432778557e-08, 1.10262256229686e-08, 1.95032120354462e-08, 9.7391576324769e-09, -2.31634329614273e-10, -1.47696924300797e-09],
 		[0.00339332766719496, 0.00815333779364812, -0.000132994507657485, 0.0046482564348174, 0.000357810970165853, -1.48590316958197e-05, -0.0311871147407544],
 		[-6.10616274624687e-07, 1.23497945396389e-05, -1.50873816350353e-06, 4.10052155645604e-07, -2.65286765830501e-07, -7.30732899687455e-10, -2.94108255567557e-08],
 		[0.000772832665054369, -0.000478088936532787, 8.59447094409649e-06, -0.000117678110530265, -7.67408351968653e-05, 3.84244166350352e-08, -0.000239674069309437],
 		[-1.70432254410619e-06, 2.98921363924613e-06, -2.28976282173491e-06, 6.72211540943145e-08, 7.39648044279565e-07, -3.47093186956859e-07, -6.88317434848609e-07],
 		[-3.74965592994534e-07, -2.40018175248397e-07, -3.45240204625002e-07, 1.5783599243297e-06, 2.1576552254205e-08, 7.42842822316151e-08, 6.34366168387868e-08],
 		[-6.6252429777016e-07, 1.60918897660023e-06, -8.98947758770806e-07, -3.47369546025704e-07, 5.55375319145167e-07, -3.60992004550531e-08, -1.35955487378482e-07],
 		[3.20018631775022e-09, 1.45866787301024e-09, 3.09973255997194e-09, 5.19849832053791e-11, -9.52117243515474e-10, 2.84670430976718e-10, 6.43167462841736e-10],
 		[5.19535262277706e-10, 3.7990570668733e-10, 1.84370834558311e-09, -1.88329855481314e-09, -1.59597251208948e-09, -3.12550033762261e-10, 1.54536707403674e-10],
 		[3.90711316162898e-08, -1.17316334096691e-07, 3.16152635838258e-08, 7.71423589773067e-09, -1.8709051412307e-09, 1.24651891313396e-09, 1.58024190046777e-09],
 		[6.2099205879949e-10, 5.84734796856392e-10, -5.1395898028395e-10, 2.33499482550374e-11, 6.4818742417103e-10, -3.56040696942648e-11, -1.00040414931914e-10],
 		[8.25395521018934e-10, 1.52914178116997e-10, -6.07519209033385e-10, -2.26777536994552e-10, 4.81815414385739e-10, -1.69949488140405e-10, -6.33886266665433e-11],
 		[-5.41625107098532e-09, 1.04813965740545e-08, 1.88859728606489e-08, -2.16156202155357e-08, -8.13369538745399e-10, -7.54107489696429e-11, -1.89148183685287e-10],
 		[2.3795611988043e-09, 1.35461287425724e-09, 3.01133432261867e-09, -2.79098752707842e-10, -4.99341655554324e-10, -2.23713232014982e-11, 2.50280412745125e-10],
 		[5.40013349460793e-10, 8.89754232350833e-10, 1.05234302293785e-09, 4.20168357043935e-10, -3.85222379986329e-10, -1.59971574075578e-10, 9.02152216409873e-12],
 		[-6.55212277731371e-09, -7.03280041803261e-08, 4.53302662692352e-09, 9.12971027421002e-09, -2.68347926775189e-09, 2.93709734253269e-10, 1.23000521513046e-10],
 		[1.03046781641598e-09, -1.08426916290496e-09, -3.64718680050516e-10, -1.08903672911877e-09, -9.35912224579358e-10, 1.25810400992389e-10, 3.35549749688288e-10]
]}
}
