{"param11100": {
		"current_mode": "putongmoshi_acl2_light_second",
		"param_golden_value": 530,
		"param_section": [18, 30, 46, 62, 102, 170],
		"red": 		[
		[4.90364183012758, -39.2679790256915, 326.694425242297, 181.017940802975, 17664.0979330951, 8830.90159487625, 53.8937941857682],
 		[0.00182894985503358, 0.134206337113055, 0.0380954968254781, 0.646455727665158, -4.08795036531529, -5.13594959586487, 4.93130133978854],
 		[-1.72791664120666e-05, 1.25614999861689e-05, 0.000365878301064361, -7.6499677763076e-05, 0.00156090965774475, -0.000826637945911635, 0.00424680751593609],
 		[-1.13496320361753e-07, -7.94997046328806e-08, -3.42628475778939e-06, -4.45359948162823e-06, -1.18335005260607e-06, -6.68011617998533e-07, -1.04124465823243e-05],
 		[3.28338232302225e-10, 5.93170929250143e-10, 5.58360204226863e-09, 2.95952492243626e-09, -1.53825897445551e-09, -2.7403919852958e-09, 6.27345012895632e-09],
 		[-159.383533853919, -2.61605892843494, 791.178042689901, -14.3551220750802, -10076.1853006825, 313.642391008421, 116.060550735777],
 		[-0.0022635996425766, -0.00779217129103046, -0.00205123253929606, -0.018618078869281, 0.106721729083513, 0.104920163786225, -0.0693613243618103],
 		[2.86886270695221e-05, 2.21257700921842e-05, 3.63288138023083e-05, 4.01684225932613e-05, -1.04527268026215e-06, 3.03764923069861e-05, -1.20716262026916e-05],
 		[-2.77548919804509e-08, -3.59392835795865e-08, -2.5264044839791e-09, 3.34603214564683e-08, 2.04342833213104e-08, 2.00696020443429e-08, 4.98096907538041e-08],
 		[-11.7547771390763, 0.129459186296127, -14.4477051929099, -0.0911119535912962, -86.4418927867442, -2.7966975130817, 0.44873436294012],
 		[0.000497684209164807, 0.000190750260293262, 0.000141197736620107, 0.000211881849823218, -0.00089088435022103, -0.000690399273488022, 0.000334500490587021],
 		[1.01875672941877e-07, 3.06887859033887e-07, -2.08450548505444e-07, -2.04671071289995e-07, 2.45732037613488e-08, -7.66905823318835e-08, 2.25093966177401e-08],
 		[0.345913369022346, -0.000308418325309483, 2.3519846742448, -0.00121804775486034, 0.0987492192592131, -1.61244167809372e-05, 0.000776387148321431],
 		[-1.53557993934346e-05, -4.32188302536412e-08, -1.34981161525468e-06, -7.248897450482e-07, 2.48766733964683e-06, 1.52441534666882e-06, -5.25610998633865e-07],
 		[-0.0282674496766164, 1.49897607790911e-05, -0.00700359424961294, 1.09282363075213e-05, 7.63420080410404e-05, 3.42015392008897e-05, 2.37906239789847e-06],
 		[-0.00565079648283342, 0.312294704533495, -0.016469147249582, 0.448819350954391, -1.6956625373365, -5.98592790699951, 4.98967657224405],
 		[9.00249778026364e-05, 0.00134211229416716, 0.00109772883728324, -0.000280148387655511, 0.00232373143968747, 0.00386622835742881, 0.00895141692376324],
 		[-7.55354727585773e-07, -2.27165747707163e-06, -6.27774320161632e-06, -4.80625657810418e-06, -5.51854613190567e-06, -1.37015885352905e-05, -3.20320746361572e-05],
 		[1.50309834073697e-09, 3.00440733368367e-09, 9.09358554812731e-09, 8.83216222644051e-09, 6.384021286561e-09, 1.67372076226979e-08, 3.98317016417564e-08],
 		[170.509922117056, 8.97224660517934, 953.742799000065, 8.50117003925006, -13279.06304377, -55.9310504624053, 75.0797360604855],
 		[-0.00224040927967177, -0.000692981092252066, -0.000959081176130372, -0.0127696715292142, 0.0439329806226913, 0.115865129557704, -0.0725888950226602],
 		[3.34590976322329e-05, -4.67457206899289e-05, 3.29290412136929e-05, 4.89837038936879e-05, 4.86545259816547e-06, -1.47332911987928e-06, -2.45301263089117e-05],
 		[-4.73059974330949e-09, 2.92093914074372e-08, 5.26879933221559e-08, 3.86771794622551e-08, 5.65090374197889e-08, 7.81924263592853e-08, 1.14856523870958e-07],
 		[3.37227694052557, -0.0549457117164226, -175.428326405356, 0.250481057645592, 93.9981599058078, 0.946676820322206, 1.18339176735193],
 		[0.000612163289015784, -0.00149534775852154, 0.000131971355884205, 0.000162267591812901, -0.000351259973557952, -0.000734032911486875, 0.000353997254847064],
 		[3.33166955517327e-07, 1.58556565800694e-06, -2.06702163817018e-07, -1.73399799117971e-07, -4.36942051743426e-09, 5.9646041804181e-09, 3.17851245838721e-08],
 		[-0.0384142007417611, -0.000922847839876164, -1.0011915996549, 0.00108279009552105, -0.0295483329874554, -0.0326973326403333, -0.000888774659848601],
 		[-2.20003171845848e-05, 4.33783449660563e-05, -1.29044143057468e-06, -6.45957546909307e-07, 9.55538597631283e-07, 1.56893543329814e-06, -5.57836989640161e-07],
 		[0.0314105247099767, 0.000255386751644368, -0.00560314460428496, 2.39974322390888e-05, 0.0076421873620911, 0.000120573654545567, 2.31830814434873e-06],
 		[0.00799160579526882, -0.278867955635828, -0.0305344474018485, 0.342610814406474, -0.127563107563402, -2.86873105501362, 1.12881005452963],
 		[-7.41866666109542e-05, 0.00024528401034136, 0.00034845994462631, -0.000242680734391082, 0.000563820087859157, 0.00110640756671864, 0.00223355230554751],
 		[2.02567879393324e-07, -2.27016126836114e-07, -1.564271762511e-06, -1.98693000810664e-06, 4.46740906933291e-07, -1.33321963692619e-06, -6.95065567742092e-06],
 		[-3.42429105984327e-10, -7.57893364112781e-10, 1.66809863377314e-09, 3.03302904662002e-09, -3.37671766968611e-10, 6.274671544082e-10, 7.19723882120191e-09],
 		[-15.1509725988817, -4.5353993801793, -1774.69061922457, -4.40424522842277, 22755.4833444523, -489.741233989068, -193.449220290966],
 		[-0.00354483495640032, 0.0135947255629554, 0.00105885984152331, -0.0112655917435438, 0.00339509919799622, 0.056550492771135, -0.0165062240594902],
 		[2.22824591213792e-05, 1.02868936584795e-06, 1.43864121790461e-05, 2.57950303954965e-05, 4.84382460064308e-06, 1.50822408167487e-06, -9.87177120272405e-07],
 		[-4.00124150728312e-09, 2.55291753747072e-08, 2.43557667753869e-08, 2.23134297814204e-08, 1.45945554311391e-08, 2.40536692448962e-08, 3.70687455789436e-08],
 		[9.16091007043911, -0.0160598925914545, 190.857693802509, 0.0482602674093377, 0.0640217480684354, 4.12882457084984, -1.60660358728405],
 		[0.000390859489830049, 0.000353032449325328, 5.84608011480287e-06, 0.000128593914228804, -2.39945818674805e-05, -0.000367475757896148, 8.09050092238967e-05],
 		[-6.02640704576945e-09, 2.20203551278211e-07, -6.97404941352347e-08, -9.42038764342932e-08, 1.09043911912098e-08, 1.02447418267413e-08, 3.90389101506286e-09],
 		[-0.365617267905551, -0.00250884332327493, -1.36482330982514, -0.00168554215096518, -0.112147959514013, 0.0227952262442384, 1.80869519407363e-06],
 		[-1.22746187643002e-05, -1.72874179424111e-05, -1.35014767376774e-07, -4.77930392485629e-07, 5.71487152053075e-08, 7.98140062678003e-07, -1.28207988719747e-07],
 		[-0.00169245831108657, -0.000236526065438827, 0.0126801031117617, -2.90760490503955e-05, -0.00762794097533125, -0.000138635489734504, -4.53090240328434e-06],
 		[-6.14434772407352e-06, -1.3738208932888e-05, -2.04201398380071e-05, -1.65096354205375e-05, -1.42410470411807e-05, -1.08553428789258e-05, -1.31383537946356e-05],
 		[-4.13208254215856e-06, -9.33432572657342e-06, -8.92171145122391e-06, -7.47597960560296e-06, -6.33649608265224e-06, -7.08489827695898e-06, -8.13975074228683e-06],
 		[1.23389730759583e-06, -2.86576606605384e-06, -5.04236121247314e-06, -4.28205401869049e-06, -3.50578191192086e-06, -3.41175304939979e-06, -3.92162497990135e-06],
 		[2.174198692379e-08, 2.87085668606685e-08, 3.10224264674548e-08, 2.42062358006556e-08, 2.03576890023689e-08, 1.93396219155379e-08, 2.07414552698774e-08],
 		[-4.77512809497085e-09, -1.0235419695059e-09, 4.44908840421192e-09, 6.43251251352465e-09, 6.69429741525216e-09, 7.77780029799746e-09, 1.0602524101521e-08],
 		[-3.15182460804522e-07, -5.92634039943023e-08, 7.66428750760157e-08, 4.98868471784819e-08, 3.63922650868395e-08, 1.20917404802091e-08, 2.00205885910639e-08],
 		[1.09555515104061e-08, 1.35578627398249e-08, 1.63497626411766e-08, 1.57041387273606e-08, 1.48984937683927e-08, 1.54621753161197e-08, 1.66024361341457e-08],
 		[2.71290875502933e-08, 3.21611221497751e-08, 3.36667175601261e-08, 3.02631672437894e-08, 2.87151552702012e-08, 2.8977970621652e-08, 2.98709362480283e-08],
 		[-7.92044588921378e-08, 5.47046968867188e-08, 5.33686240076323e-09, 1.60831497395828e-09, -3.317168299636e-09, 1.3421698639555e-09, 4.30903521062715e-09],
 		[7.75121976926711e-09, 1.46820588171759e-08, 1.61675664552569e-08, 1.42922307656759e-08, 1.30274785653768e-08, 1.30079256775976e-08, 1.30860499333629e-08],
 		[3.43268775378245e-10, 1.20294446693956e-09, 3.17388018992067e-09, 3.25063833814947e-09, 2.72521428218837e-09, 2.95469276927523e-09, 3.35486672563233e-09],
 		[-1.44647029799997e-07, -4.61420931161386e-08, 5.87787657492014e-09, 4.67385625101966e-09, 1.45626796224145e-09, 8.60392976928131e-10, 2.94913235082653e-09],
 		[-1.5597865592586e-09, 5.71441311550677e-09, 5.67940683818682e-09, 4.73806608583843e-09, 4.23040783742758e-09, 4.08101901981018e-09, 4.28531248632268e-09]
],
		"green": 		[
		[2.31485294480806, 0.889796277636248, 330.500013860919, 198.991211134771, 18129.0871878889, 9301.30504170796, -135.314915484825],
 		[0.0014762399539194, 0.130819283993194, 0.0381656199547331, 0.72739134197153, -4.08865948189747, -5.52567678720224, 5.21009165035633],
 		[4.28413213828608e-05, 1.86826872057319e-05, 0.000329870048721147, -6.99473874023098e-05, 0.00166951397725691, -0.000901166001880807, 0.00435668210958887],
 		[-2.65870771272348e-07, -9.58425877869906e-08, -3.30916417433832e-06, -4.53520998486566e-06, -1.10655563946265e-06, -5.15966931599734e-07, -1.04163028433182e-05],
 		[4.22754673935843e-10, 6.47546052204412e-10, 5.4128822080637e-09, 3.02592827389441e-09, -1.25744091876545e-09, -2.83514170332517e-09, 6.20231746818532e-09],
 		[-137.077370144753, -2.96243419443133, 797.819693172438, -13.5862135411429, -10319.3621595049, 329.788120847597, 95.1801454677173],
 		[0.000622854608193149, -0.00546219778480341, -0.00177923287878309, -0.0213327375191576, 0.106939336507755, 0.112629858852388, -0.0733461025190278],
 		[1.78524808230531e-05, 2.13500457566809e-05, 3.68662748295168e-05, 4.04649951996637e-05, -3.17342529220284e-06, 3.10038905079841e-05, -1.30757721274284e-05],
 		[-1.53581575647586e-08, -3.49056674366436e-08, -2.82207036892775e-09, 3.41385654675451e-08, 1.87369905658813e-08, 1.94218916193214e-08, 5.02161276307535e-08],
 		[-10.6524388161361, 0.0722702760429008, -14.5698326169166, -0.108622412334711, -88.5279243835504, -2.94142715597924, 0.301579542790579],
 		[0.00040551724006902, 4.58378023598709e-05, 0.000138692379962488, 0.000243746788314673, -0.000892585723986124, -0.000739991087005121, 0.000353715754936965],
 		[2.98682150037323e-07, 2.98284162315419e-07, -2.12609954032414e-07, -2.07887405280623e-07, 3.71220534436468e-08, -7.70749393250393e-08, 2.49967549043166e-08],
 		[0.299346016079455, 0.000622946474531194, 2.37382989962888, -0.00124190150557973, 0.101046710827559, -6.71986830486759e-05, 0.000700467427575455],
 		[-1.59097709386401e-05, 2.82226705960359e-06, -1.34321215704371e-06, -8.4566207980523e-07, 2.48929064686448e-06, 1.62973676552381e-06, -5.56136789956826e-07],
 		[-0.024915325520489, 5.15609471520166e-05, -0.00706801624718333, 1.22393654357628e-05, 7.82456063851748e-05, 3.58800747878461e-05, 1.91459182810092e-06],
 		[-0.00426204761851842, 0.19844030330765, -0.00634283605803599, 0.432514351298004, -1.65223539131066, -6.16328273336545, 5.57275586911115],
 		[0.000227723974301087, 0.000568870507100197, 0.00106921596298072, -0.000243248048031315, 0.00252284281887677, 0.00383694871425912, 0.00927904029896414],
 		[-1.23927821197962e-06, -2.14742680394792e-06, -6.17810958804176e-06, -4.71396658904788e-06, -5.73980225896085e-06, -1.39634853162948e-05, -3.23065610588582e-05],
 		[1.84948894500399e-09, 2.37636251679965e-09, 8.89415402668005e-09, 8.6444170041608e-09, 6.5202996768418e-09, 1.66867456210752e-08, 4.00644181175877e-08],
 		[149.876796799399, 4.91434953322312, 962.625334707788, 9.21414465284815, -13599.39396479, -58.5873937352882, 86.0610557821681],
 		[-0.000209007458752256, 0.00102822657254263, -0.00138093556101053, -0.0121955743622193, 0.0423761796422321, 0.119075603813361, -0.0809145496808233],
 		[1.92820219199721e-05, 1.58732567129015e-05, 3.32439492350632e-05, 4.75335029095476e-05, 2.15854735349248e-06, -9.49633015222374e-07, -2.73800967396098e-05],
 		[2.17743071992543e-08, 3.85319850938774e-08, 5.26510418946474e-08, 3.89465686554923e-08, 5.79035782875913e-08, 8.03551835186217e-08, 1.16036550537186e-07],
 		[2.9111606012498, 0.00248893848288387, -177.050198620788, 0.264718422516405, 96.2767675524712, 0.994017427769884, 1.09282705461124],
 		[0.000605347067420483, -0.000995597352286827, 0.00014451521522682, 0.000158687887634456, -0.000333450887438723, -0.000752459608146038, 0.000393651125186976],
 		[5.12209220037471e-07, 1.91587476567811e-07, -2.10194414719378e-07, -1.64700060995456e-07, 5.06086011264264e-09, 3.76842416426879e-09, 3.85152019317993e-08],
 		[-0.0330696088990536, -0.00194675003860953, -1.01053293772841, 0.000891140416880523, -0.0303009099671968, -0.0342818598665083, -0.000757775031314875],
 		[-2.5421818032715e-05, 2.88696483325674e-05, -1.38644330932773e-06, -6.43420315154564e-07, 8.93628551320377e-07, 1.60392770348216e-06, -6.2023362338971e-07],
 		[0.0274384799067678, -8.59309271672446e-05, -0.00565538025198078, 2.99114586403001e-05, 0.00782697508820991, 0.000126403828172012, 1.57087883878689e-06],
 		[0.00448106291147551, -0.119643612248762, -0.0234446989753092, 0.353643230089121, -0.531773956501126, -2.81474847659551, 1.36835214062877],
 		[9.2364315260247e-06, 0.000683243221648121, 0.000329440103167266, -0.000241523957918595, 0.000469614231255285, 0.00101800842784583, 0.00236188281208216],
 		[-1.45897698305529e-07, -1.70899425965778e-07, -1.52267869780547e-06, -1.99695871600026e-06, 5.64687632080704e-07, -1.39895876138504e-06, -6.98942618685333e-06],
 		[2.11183294757965e-10, -5.70133912901707e-10, 1.64760274278021e-09, 3.00687260096406e-09, -5.03361045859291e-10, 5.07610168770106e-10, 7.16502145618878e-09],
 		[-15.7557851222687, -3.07810846803689, -1790.34656980404, -6.80475021111694, 23303.3283069826, -515.106710907239, -180.287724428086],
 		[-0.00129917890035066, 0.00548040491249748, 0.000849745507011244, -0.0116762935194587, 0.014005157570404, 0.0555283037307351, -0.019932456412152],
 		[1.58293696479715e-05, -3.74540222356151e-05, 1.45263614177746e-05, 2.57749808403965e-05, 6.08337302567006e-06, 2.71229478446587e-06, -2.19137318129377e-06],
 		[2.22402740931787e-09, 1.8450250200476e-08, 2.41236682641478e-08, 2.29750416368707e-08, 1.44408319477149e-08, 2.50724676140051e-08, 3.755662406432e-08],
 		[8.36774776410741, 0.00378636085293515, 192.605925111907, 0.0710723015349762, 0.0697947261074328, 4.33905976942227, -1.38931030918093],
 		[0.000312366038884609, 0.000225217708946896, 1.19151910836319e-05, 0.000134486097252946, -0.000115746907567832, -0.000360610974642528, 9.72855066692288e-05],
 		[1.35868782530551e-07, 1.07635510899947e-06, -7.0755512372352e-08, -9.55992031366119e-08, 6.31687257007006e-09, 5.72216726712389e-09, 6.70928939619278e-09],
 		[-0.315352578673292, 0.00014901492657572, -1.37739137169721, -0.001649439987937, -0.114806676061428, 0.0239546204056276, 2.28899426990579e-06],
 		[-1.2623824913078e-05, -9.18182537076168e-06, -1.81006677426482e-07, -5.01454795142076e-07, 3.20814073044505e-07, 7.83163107373835e-07, -1.53986758502787e-07],
 		[-0.00125108458782903, 2.36766057283918e-05, 0.0127971280665236, -3.57002575247086e-05, -0.00781229155498751, -0.000145390903227495, -3.37419097809194e-06],
 		[-1.97432278195261e-05, -1.70655902596061e-05, -2.11399185911331e-05, -1.71611955188947e-05, -1.47628604543433e-05, -1.1228987021456e-05, -1.33975693729826e-05],
 		[-1.46593094494333e-05, -1.05011491342188e-05, -9.6222902596742e-06, -7.74669593501335e-06, -6.43172416291067e-06, -7.36684385287918e-06, -8.29885388878296e-06],
 		[-6.58225074436312e-06, -4.68315129661592e-06, -5.72960616930674e-06, -4.54367029479471e-06, -3.65849834619463e-06, -3.66898565201136e-06, -4.01857988620888e-06],
 		[2.88026182449175e-08, 3.07322630812176e-08, 3.18716273029913e-08, 2.47962361068365e-08, 2.06395835571242e-08, 1.96612623372352e-08, 2.10270181080863e-08],
 		[1.14298992616777e-10, 2.3539864082496e-09, 5.23229591751242e-09, 6.80414349226442e-09, 6.94000669621542e-09, 8.13698638246139e-09, 1.07849947718918e-08],
 		[2.10131406310221e-07, -9.68033707948904e-09, 7.6905398102696e-08, 5.25930982516228e-08, 3.86976783498949e-08, 1.29500300581836e-08, 2.04834596581879e-08],
 		[1.40797531571384e-08, 1.51518392696815e-08, 1.71426146063773e-08, 1.58743274790522e-08, 1.50620306495473e-08, 1.57065143526813e-08, 1.67819269654997e-08],
 		[3.27520858390851e-08, 3.36686246642031e-08, 3.46509250111231e-08, 3.06564633496471e-08, 2.90827791337023e-08, 2.93088640911917e-08, 3.01963699923512e-08],
 		[3.1012139580764e-07, 5.06259904805694e-08, 7.19379352503882e-09, 2.18315192927893e-09, -3.95048845606089e-09, 2.18780289542525e-09, 4.54615464314142e-09],
 		[1.57575541916686e-08, 1.61935017214001e-08, 1.70191471380941e-08, 1.47155413134004e-08, 1.320863396382e-08, 1.32781905841244e-08, 1.33002868180025e-08],
 		[4.05974044911781e-09, 2.75800555659851e-09, 3.85688641798371e-09, 3.37680030986693e-09, 2.79097426492331e-09, 3.16452040562954e-09, 3.48703416427988e-09],
 		[3.8445446148314e-08, -2.46828227146005e-08, 8.40969670554361e-09, 5.15239795788111e-09, 1.8658383199931e-09, 1.54770300685484e-09, 2.95250580869429e-09],
 		[9.67710788986683e-09, 8.97857548833813e-09, 6.55009275711686e-09, 5.23457931562331e-09, 4.5309105058584e-09, 4.30114168444968e-09, 4.41120632303034e-09]],
		"blue": 		[
		[2.69807992950878, -20.6424620920133, 332.787854932277, 184.676429293801, 18324.3540476762, 9217.85547626575, 57.2558523138108],
 		[-0.00159124087372499, 0.203765987948053, 0.0368842058818264, 0.662414709461343, -4.35022135410114, -5.37469955355423, 4.95284001000497],
 		[5.95352670041762e-05, 0.000562699580592929, 0.000331991021657941, -1.91285841814658e-05, 0.00180731959995582, -0.000819670877066469, 0.0042871773788404],
 		[-3.58561822981487e-07, 2.91926836132837e-07, -3.30524798220239e-06, -4.36704044919944e-06, -1.03500123756864e-06, -3.13775465006548e-07, -1.03552344025136e-05],
 		[6.06471758270103e-10, 2.80686249517454e-10, 5.33287794702612e-09, 2.92433077388224e-09, -1.61467206750673e-09, -3.02009464230324e-09, 6.1768848525794e-09],
 		[-129.696571568663, -2.40893654675606, 799.674278704325, -13.5867219433514, -10439.2320725769, 328.521416363808, 120.994911333119],
 		[0.000973896983474687, -0.0106300293942769, -0.00167914962987476, -0.0192590544313732, 0.11312149134828, 0.109638781577838, -0.0696432904609256],
 		[1.81701247423722e-05, -3.10785496559507e-05, 3.69260285027302e-05, 3.85704300990876e-05, -5.49537077566128e-06, 2.95309003457195e-05, -1.24485754088031e-05],
 		[-1.65530405642562e-08, -4.2864671394701e-08, -1.98645747571439e-09, 3.28901792805332e-08, 1.9702258184442e-08, 1.87609060255748e-08, 4.99871697172631e-08],
 		[-10.3600264175266, 0.137170422161888, -14.6009237653016, -0.100422299532963, -89.5920174541093, -2.92454368540122, 0.475738556926636],
 		[0.00037300381292243, 0.00012510458011282, 0.000134674283884032, 0.000222561931997963, -0.000941380525537273, -0.000720121943157893, 0.000336014507630646],
 		[3.05157353864247e-07, 1.46973652329049e-06, -2.16936316658897e-07, -1.94124089039182e-07, 4.48138336676118e-08, -7.16560219611177e-08, 2.3528585915929e-08],
 		[0.278116944324238, 8.76353092335561e-05, 2.37951571949556, -0.00125350678283152, 0.102307382254704, -0.000143366048033015, 0.000796731754059309],
 		[-1.50706296022821e-05, 3.31748145205208e-06, -1.29745269189294e-06, -7.7715514555653e-07, 2.61878192056932e-06, 1.5854260970559e-06, -5.28124512402127e-07],
 		[-0.0241322117771298, 2.75955560331574e-05, -0.00708476919840402, 1.13496626275262e-05, 7.902775270797e-05, 3.56226233372677e-05, 2.48383579614245e-06],
 		[-0.00641493551961265, 0.0142904063027355, -0.0123809732760865, 0.453498622541388, -1.78400522062767, -6.08710153008738, 5.00730109752167],
 		[0.000215131457430552, 0.00022151671828097, 0.00106109337437418, -0.000254840471087003, 0.00252938075921603, 0.0039304141434398, 0.0090832369534264],
 		[-1.1314546843097e-06, -2.06202967491688e-06, -6.14621851625497e-06, -4.6418560766241e-06, -5.67348084612293e-06, -1.38570951498118e-05, -3.23376095418788e-05],
 		[1.64716411185789e-09, 2.55711885525701e-09, 8.87053580327805e-09, 8.54559372689256e-09, 6.44688304091388e-09, 1.69491078821536e-08, 4.01477564946248e-08],
 		[143.263823088007, 2.57330569100598, 964.779064735803, 8.85665439828844, -13761.9363238713, -58.2515024734611, 74.3767477551899],
 		[0.000298337274029628, 0.000674177952269244, -0.000903417148866011, -0.0129599391620322, 0.0456655007517507, 0.117715184054932, -0.0728940719007221],
 		[1.95683622846339e-05, 4.43755287841742e-05, 3.35167922353211e-05, 4.78358315840709e-05, 2.08972701467365e-06, -1.81885754720733e-06, -2.5235611573963e-05],
 		[2.08633124810554e-08, 2.93615803594538e-08, 5.27760067488392e-08, 3.9049465321025e-08, 5.80536345547281e-08, 7.9044578141501e-08, 1.16153438701691e-07],
 		[2.757150392934, -0.0686035015328582, -177.487367561495, 0.252076029362836, 97.4147983867929, 0.988199238360594, 1.20968926906112],
 		[0.000554106883109245, 8.56119164497195e-06, 0.000132600503239638, 0.00016732517725746, -0.000361145108944372, -0.000744854100833729, 0.000355843612144585],
 		[5.21973975394535e-07, -3.23037280292748e-07, -2.11444968235866e-07, -1.65910210542644e-07, 5.29578242546955e-09, 6.77070889576582e-09, 3.30847142161845e-08],
 		[-0.0315766984094722, -0.00108827595804162, -1.01287344077306, 0.000977064562154273, -0.0305783472151107, -0.0339541386628353, -0.00092160594535227],
 		[-2.38411682291343e-05, 1.05209857241294e-06, -1.29507394266488e-06, -6.75057634550634e-07, 9.72297889835826e-07, 1.5903023105406e-06, -5.6115052868279e-07],
 		[0.026166755845044, -0.000308617285172858, -0.00566870063260189, 2.78681016843067e-05, 0.00791779281571158, 0.000125333862135475, 2.44962241640499e-06],
 		[0.00390279638445447, -0.23365651124827, -0.0269510240247733, 0.371785739196966, -0.303679626701795, -2.84213035488514, 1.09845157246065],
 		[1.53140994369917e-05, 0.00140855773085548, 0.00034448587328736, -0.000174785235838993, 0.000494585401309062, 0.00103628446300305, 0.0023129535042116],
 		[-1.93814397339995e-07, -1.24964270204845e-07, -1.56892599700816e-06, -2.13059223476492e-06, 4.68047986158248e-07, -1.2477175901555e-06, -7.04500980502454e-06],
 		[2.86743087974917e-10, -4.68857614223427e-10, 1.69388305092821e-09, 2.99076958772877e-09, -3.90694550962647e-10, 5.28617336232989e-10, 7.18383496256649e-09],
 		[-16.7347391158096, -0.237072997341482, -1794.60068596501, -5.65887746070716, 23579.4633084864, -512.083698875823, -197.890761357996],
 		[-0.00150335599832477, 0.00856362437280297, 0.00100493069221447, -0.0124474612831214, 0.00812264775790648, 0.0561465646517993, -0.0161505251174904],
 		[1.70979932200909e-05, -9.89627577882316e-05, 1.44226156315527e-05, 2.49433725511714e-05, 6.19580504758459e-06, 2.40359793076652e-06, -1.50166961237298e-06],
 		[1.92364649853768e-09, 1.36691303228178e-08, 2.4444313283978e-08, 2.4575893273877e-08, 1.48200754560191e-08, 2.40815768430225e-08, 3.77642499287873e-08],
 		[8.25431844317344, 0.0082391382005245, 193.082405436512, 0.0595656572819954, 0.0712905547954806, 4.30840739158045, -1.65715140825213],
 		[0.000313551787385451, 0.000571863653577379, 8.41919595160865e-06, 0.000144174431852716, -6.59386012312525e-05, -0.000365266691811797, 7.96214979422564e-05],
 		[8.71287473918924e-08, 2.40475749770677e-06, -6.94015317524284e-08, -9.37916662044752e-08, 4.90242641820707e-09, 7.14097142171406e-09, 4.72672958387505e-09],
 		[-0.296782691674312, 0.000668892985198247, -1.38085691257356, -0.00158540267432666, -0.116192473709319, 0.0237838553733205, 1.80049436719029e-06],
 		[-1.21135119910385e-05, -2.07012773378867e-05, -1.56244932573647e-07, -5.39582299348579e-07, 1.81629045793483e-07, 7.94730308874008e-07, -1.26554027475073e-07],
 		[-0.000745247038655042, 0.000226931182008871, 0.0128278443927999, -3.32057453744381e-05, -0.00790308699632541, -0.000144187780298371, -4.74812816556902e-06],
 		[-1.88651076715909e-05, -1.70183195198376e-05, -2.10928752297358e-05, -1.69579975336685e-05, -1.45532049002162e-05, -1.11778906763949e-05, -1.33100605149107e-05],
 		[-1.39969112747942e-05, -1.04383577676832e-05, -9.53761817927961e-06, -7.70379360462514e-06, -6.48084505034134e-06, -7.16695343424719e-06, -8.23573629952814e-06],
 		[-6.00718644245962e-06, -4.31211185422486e-06, -5.6187025375018e-06, -4.53292123705362e-06, -3.69581894347491e-06, -3.654619053944e-06, -3.98359825906431e-06],
 		[2.84696450286872e-08, 3.09280966426585e-08, 3.18621375445579e-08, 2.48212086264163e-08, 2.06390490380583e-08, 1.9725257749914e-08, 2.10405982608438e-08],
 		[-1.41205501039538e-09, 2.30479513130451e-09, 5.12345883815252e-09, 6.65451984269029e-09, 6.94529248076222e-09, 8.02843738142648e-09, 1.07641732793905e-08],
 		[1.91689646090844e-07, -7.90333963303119e-09, 7.78266943005496e-08, 5.10887345561167e-08, 3.72444518554634e-08, 1.28314497702726e-08, 2.01662573049914e-08],
 		[1.42881809294843e-08, 1.58501188858698e-08, 1.7174824655635e-08, 1.59704012777784e-08, 1.51191210454344e-08, 1.5765060042217e-08, 1.68160255360953e-08],
 		[3.28786303135713e-08, 3.42871045259107e-08, 3.47286272132195e-08, 3.07690379892837e-08, 2.9313236536684e-08, 2.93357361539208e-08, 3.02104845200237e-08],
 		[2.75090210456396e-07, 3.93663307383541e-08, 6.19296236482151e-09, 1.69886485742398e-09, -3.79639976131489e-09, 8.93281106563035e-10, 4.26995957631618e-09],
 		[1.55513709106994e-08, 1.69193948443953e-08, 1.6990536365501e-08, 1.47151829281275e-08, 1.33128418991964e-08, 1.3227278283814e-08, 1.32922691984778e-08],
 		[4.11819105892096e-09, 1.54141381243488e-09, 3.73827640640702e-09, 3.44175034967258e-09, 2.82797241259251e-09, 3.16274760277895e-09, 3.50435501283925e-09],
 		[1.68602632744945e-08, -3.34162104539043e-08, 7.52189107140204e-09, 5.02763490826669e-09, 2.00881237124762e-09, 1.59965491575351e-09, 2.8113897414698e-09],
 		[8.67325119577091e-09, 8.15771182019763e-09, 6.41394807188359e-09, 5.12910027834502e-09, 4.4893089625536e-09, 4.27315643247652e-09, 4.37559541788521e-09]],
		"ir": 		[
		[0.825718915149452, -2.89203115322598, 18.9752323993774, -66.0798836108533, 543.138823196546, 566.708984384303, -116.141015441829],
 		[-0.00184125267866911, 0.0188375523988652, -0.00199952486905863, 0.0698900502491327, 0.224780231674328, -0.332249147538507, 0.313574279283399],
 		[3.25317250934621e-05, -4.71361316919151e-05, 7.08050676862776e-05, -0.0003126298548755, -0.00028200126318215, -0.00014020288241755, 0.000594822329446851],
 		[-1.9391591128145e-07, 1.66835046584605e-07, -4.32931063946153e-07, 5.3093839324507e-07, 1.27277284923678e-06, 1.00750781918803e-06, -9.76037760027549e-07],
 		[3.48108750213605e-10, -7.62420109040453e-11, 4.8801467410833e-10, -3.36261487202269e-10, -1.77405313318222e-09, -2.06963431135083e-09, -1.94796371609648e-11],
 		[-9.60874414793288, -0.181617463445042, 49.3421983669048, 3.2478083448351, -278.969067309149, 20.0147044310103, -1.97522933870806],
 		[-0.00010194008348568, -0.00105426363799255, 0.000205763201806145, -0.00208132993656407, -0.00515969786061616, 0.00681087432163063, -0.00455388613721074],
 		[2.17467773925163e-06, 2.57736318021025e-06, 1.24095238899271e-06, 7.21164599077084e-06, 4.25505292375097e-06, 2.06635469228681e-06, -2.83176312773228e-06],
 		[-4.58470927203343e-10, -5.8978577496745e-09, 4.26579153132378e-09, -3.15223465656271e-09, -3.57667791800624e-09, -5.13106545652002e-10, 4.90882860650523e-09],
 		[-0.731275865137329, 0.00753557348516631, -0.899057687451602, -0.0156018571504155, -2.41529092101369, -0.17873310944782, -0.0233980091522515],
 		[3.46862289951108e-05, 1.86239789690063e-05, 5.47518848389454e-06, 2.03421210398898e-05, 3.93214119176746e-05, -4.50064433694974e-05, 2.28228537014256e-05],
 		[-2.55388130321973e-08, 2.88418104455159e-08, -1.62421894265227e-08, -2.72286716756442e-08, -7.89845583011142e-09, -2.09566665658808e-09, 4.95594560845828e-09],
 		[0.0207638540844677, 3.96852868355066e-05, 0.146609306425623, 0.000177230915600302, 0.00276209144710558, -3.10524315066372e-05, 1.10769939249372e-05],
 		[-1.08895647962212e-06, 9.89470706952669e-08, -6.75971548286264e-08, -6.1186715417322e-08, -1.02001827474363e-07, 9.74270257437558e-08, -3.70364678718498e-08],
 		[-0.00174706599417663, 4.972620382575e-07, -0.000436219429687773, -2.61571792393133e-06, 2.14149973650082e-06, 2.16630790560515e-06, -5.67916062497302e-08],
 		[0.00231190147583644, 0.0230619681754426, 0.0123227992691325, -0.0307597516366935, -0.0748088549636374, -0.292677255147449, 0.224111141070715],
 		[-1.80678185927241e-05, 6.4667888266245e-05, 1.43275708073556e-05, -4.10019683866436e-05, 0.000164169735467515, -1.68524217608358e-05, 7.48763516724094e-05],
 		[5.54622500584358e-08, -1.46524235437998e-07, -2.69991375504421e-07, -4.94617149139902e-08, -5.24633248629879e-07, -9.42547540635314e-08, 1.36770529646898e-07],
 		[-6.30653907973384e-11, 2.34704871874201e-10, 4.47674612271153e-10, 4.44751385385604e-10, 3.48293312546715e-10, 2.16776773812773e-10, -3.31877324118534e-10],
 		[10.3728905004025, 0.627506810405302, 59.5546119357638, -1.58694674272868, -374.512741445485, -3.56139301158714, 6.06892188888748],
 		[-0.000151348704724068, -1.04402414387323e-05, -0.000515204837689092, 0.00105096868319774, 0.00177696288262202, 0.00585469131252835, -0.00305220097153392],
 		[1.95606507675725e-06, -1.96810244971318e-06, 2.17137871759916e-06, 2.27104290385326e-06, 1.94269236591599e-07, 1.53057526563405e-06, 1.1525963796766e-07],
 		[-1.6278531662199e-09, 3.53360201449891e-10, 1.47308542074392e-09, -8.40955401452589e-10, 4.03733075182715e-09, 8.95558800617029e-10, 9.82440237270027e-10],
 		[0.205350169259772, -0.00457952323029289, -10.9410149891384, -0.0172523857398114, 2.6415699682566, 0.0616314802863612, 0.0102153089875842],
 		[2.54517559192684e-05, -0.000110928057919785, 1.41014099384791e-05, -1.20388165604022e-05, -1.55665057626167e-05, -3.83348754765264e-05, 1.45947701863229e-05],
 		[6.36987248892218e-09, 7.03400749296072e-08, -1.50440357686584e-08, -4.86428296050505e-09, -2.28790891324407e-09, -2.07582228565942e-09, 1.02095284357326e-09],
 		[-0.00221494504080054, -0.000134821754590264, -0.0624483966996193, -0.000123196396063249, -0.000790044604689574, -0.00203699051722039, 1.0781168430703e-05],
 		[-9.69133762057601e-07, 3.08459849979253e-06, -1.08561242465592e-07, 4.73407597178913e-08, 4.6407109815403e-08, 8.22310232881334e-08, -2.32039236928241e-08],
 		[0.00191364665535737, 4.46969041480938e-07, -0.000349860706375528, -8.26941769070482e-06, 0.000210602105065441, 7.60844114949117e-06, -1.2412477756724e-07],
 		[-0.00121626831868026, -0.00888195020822126, 0.00477953048125684, -0.0093296821549983, -0.434506721721871, -0.180756278086712, 0.0712270579690878],
 		[5.72535651983602e-06, -2.2817734329486e-05, -3.44626608443843e-06, -4.93239886352937e-05, 0.000173038966474374, -5.70193786070025e-05, 2.66913077456613e-05],
 		[1.17592281987677e-08, 1.16412951149337e-07, 3.2724878183556e-08, -3.60556190691451e-08, 1.15829698167669e-07, -7.16487042078871e-08, -3.67656596827317e-07],
 		[-6.25898670086814e-11, 1.50635975782348e-10, -5.46150316918482e-11, 1.83598514307261e-10, -1.09755816192632e-12, -6.51255721301945e-11, 4.06340115094802e-10],
 		[-1.03701089006311, -0.279743557494703, -110.637162620855, 1.49183954784003, 635.347151857428, -31.2692358394645, -2.31615572911724],
 		[0.000301575407864002, 0.000205219653389492, -0.000226204772974957, 0.000361654041047616, 0.0108152863195334, 0.00374724352769799, -0.000944928300324154],
 		[-1.09524618720814e-06, 6.64484289065958e-07, 2.78421862713006e-07, 1.818885259766e-06, -2.60548161505773e-06, 1.5164170148503e-06, 6.90233166080918e-07],
 		[1.07608755379809e-09, -8.11746787176033e-09, 9.4908227747872e-11, -4.69424269570277e-10, -9.48296745047635e-10, 7.98702863251359e-10, 1.18018316170733e-09],
 		[0.576656691833789, 0.000354694159756608, 11.8983681370236, -0.0218842528484948, 0.00020052788347282, 0.262221668407473, 0.00343963467979051],
 		[2.69458255208591e-07, 3.9408394899187e-05, 7.41917497569579e-06, -5.90637218437356e-06, -8.98778352002232e-05, -2.58958296516874e-05, 4.07810719398905e-06],
 		[4.7602971690287e-08, 6.17294552695815e-08, 1.48131323385095e-09, -6.45637026657843e-09, 1.43352867421629e-08, -4.51150963380387e-09, -1.6126974075907e-09],
 		[-0.0222781414312126, -0.000120527924600898, -0.0850144023948529, 0.00036276274098914, -0.00322390649638215, 0.00143716058038635, 3.80055872339742e-08],
 		[-5.91633196583131e-07, -1.40432365512449e-06, -6.65662122097909e-08, 2.8974397263291e-08, 2.46451130301619e-07, 5.89881495517407e-08, -5.72631102029649e-09],
 		[-7.314596568972e-05, -6.48786945679564e-08, 0.000790682335661988, 9.70409153133468e-06, -0.000210158815800047, -8.74784563750918e-06, 1.64975152639279e-07],
 		[-9.64245042164071e-07, -1.13536407779163e-06, -2.60842332632719e-06, 7.88373037612683e-07, 1.09409156051204e-06, -2.65163777794741e-07, -1.35367325238844e-06],
 		[-4.22857247415946e-07, -7.57000391321357e-07, -5.17753874520884e-07, -1.49675140521251e-08, 1.6672136840134e-07, -1.49422575093882e-08, -1.30897428468411e-08],
 		[-5.19178698041459e-07, 3.63009982475445e-07, -9.12292139003662e-07, 6.66014463855971e-07, 4.07641404892851e-07, -4.5878471049194e-08, -3.9616480335505e-07],
 		[9.07400187354235e-10, 2.16075598705177e-09, 3.75919945224614e-09, -2.61828218475381e-10, -2.39493132900176e-09, -8.8648106500663e-10, 1.5905002671048e-09],
 		[-6.82858859097843e-11, -4.02201375526839e-10, 1.29226476139852e-09, -8.31512559324484e-10, -2.19395897802016e-09, -1.42120943452938e-09, 1.7998472446685e-10],
 		[8.61196314954601e-09, -3.45185711560081e-09, 1.48838652881074e-08, -7.38979377618145e-09, -1.46897004290006e-09, 2.86514124975946e-09, 2.83050046416381e-09],
 		[7.59368566182088e-10, 3.47167034349978e-11, 7.57728357168559e-10, 6.27146328918672e-10, 4.27047582231821e-10, 3.33953668006301e-10, 3.43329101342235e-10],
 		[7.40436740561892e-10, 1.26890209984644e-09, 1.49179737915096e-09, 1.24079495873238e-09, 9.1271981751884e-10, 6.49486825738864e-10, 3.14144460128489e-10],
 		[1.5858195217088e-08, 2.11332199027221e-08, 1.17120628840999e-09, -7.874284649817e-10, -1.12526978364595e-09, -2.58280961694165e-10, -2.56284200487139e-10],
 		[-6.92612764030119e-10, 3.31298059356663e-11, 1.65660058772693e-09, 2.58031150324036e-10, -2.90491586068909e-10, -9.39490304951038e-11, 6.20129999635e-10],
 		[1.57170267788141e-09, -4.94960018707155e-10, 7.82985185296711e-10, -9.51951624770964e-11, -3.40085331780489e-10, -2.01325985159287e-10, 1.2588521862332e-10],
 		[2.01132553910855e-08, -1.27359649710071e-08, 5.23371784373577e-09, -5.32672340321242e-09, -4.84110790285748e-10, 7.72428137901875e-10, 8.79969206929533e-10],
 		[-1.80038899761213e-10, 6.52525023625749e-10, 1.01522681041896e-09, -1.26490149632284e-09, -1.52891528800925e-09, -1.06484430521531e-10, 5.16679777646497e-10]
]}
}
