{
    "paramlocation": {
        "sensordisplaylocation": [648, 47, 682, 82],
        "notsupportDCFeature": 0,
        "supportAcl3": 0,
        "supportSecondLight": 1,
        "supportSecondDisplay": 0
    }
}