{"param01100": {
		"current_mode": "putongmoshi_acl0_light_second",
		"param_golden_value": 530,
		"param_section": [18, 30, 46, 66, 90, 158],
		"red": 		[
		[2.2838025639573, 1633.24497335462, -55.7065174647184, 559.432541744801, 19160.8287518196, 11234.0206745682, 1349.28517798933],
 		[0.00300651219175232, 0.436651104250434, -1.4821890346465, -0.0360375784516434, 0.420227546376668, -3.40549252943229, 3.19445191820298],
 		[5.16115615259357e-05, -0.000348374168940626, 0.000348023983665061, -0.000361703210076667, -0.00030587976232559, 0.00133275925277033, 0.00622577959012618],
 		[-4.22484697565137e-07, 2.30702784139596e-07, -3.17748469222526e-06, 7.94911986141949e-07, -9.38857963729389e-07, -1.95489512789157e-06, -1.24161191044003e-05],
 		[7.79748702130442e-10, -2.09864192415713e-10, 3.74020583324811e-09, -5.3414214298088e-09, -2.82116149082421e-09, -1.41558692554708e-09, 8.03576393174423e-09],
 		[-64.0515037106714, 1888.50753767421, 39.1995266478393, -30.3953948171219, -10794.704060418, 437.954266589615, 269.077345655071],
 		[-0.00245374226124327, -0.0436265821032149, 0.0863312602075083, 0.00519334560165716, -0.00458541369525135, 0.0673817365549505, -0.0456781585116055],
 		[2.65868216532986e-05, 4.81238787547996e-05, 3.7975783083299e-05, 2.89178916926897e-05, 3.23820994806998e-05, 5.67016017029183e-06, -2.69793364230695e-05],
 		[-2.44520235658515e-08, -3.08238310635169e-08, 1.00315418501151e-08, 2.02570396226348e-08, 2.09377797895035e-08, 2.24917737030142e-08, 5.38668058549843e-08],
 		[-0.949104786536237, 47.3112938428108, 1.68412253011526, -0.0735724088534292, -92.5212254514181, -3.92830586060706, 1.42370842228928],
 		[0.000616218880876247, 0.00160842111005856, -0.00154856898493339, -4.64780697027419e-05, 1.77448963828365e-05, -0.000423389507971305, 0.000227106400132417],
 		[8.39322248662362e-08, -2.45307520079058e-07, -2.66137815818995e-07, -1.1809874199451e-07, -1.20014804046126e-07, 1.44705464222399e-09, 5.32176389549802e-08],
 		[-0.0155081939875303, -1.0717091080277, -0.00894214529190396, -0.00191382198240391, 0.106546357042937, -0.00157630960202864, 0.0013512727870734],
 		[-2.05352974087318e-05, -1.83458402560479e-05, 9.30548660666861e-06, 1.84727725765532e-07, 3.30779784485297e-08, 8.97954815024781e-07, -3.64016333382272e-07],
 		[-0.00581243892210602, -0.00211064834841144, -0.000144764456864435, 2.45311671554885e-05, 8.40366617548602e-05, 4.57477489037362e-05, 5.72277437966291e-06],
 		[-0.00595997380613334, 0.643156852160002, -1.44777541742404, 0.3896549398738, -1.1139467068454, -4.49687382536171, 3.6213801339947],
 		[0.0001834664736323, -6.74835978183958e-05, 0.00165342953865105, -0.000320065873431234, 0.00298396759197558, 0.00424252178713326, 0.00980629849098729],
 		[-1.07984142690559e-06, -2.96609361643102e-06, -8.3468408711034e-06, -4.90186928646248e-06, -4.48646956452103e-06, -1.32578677226812e-05, -3.20771011554303e-05],
 		[1.78474183549872e-09, 4.57000916435506e-09, 1.21161665131017e-08, 9.02524423376842e-09, 5.65689257430097e-09, 1.62527070084196e-08, 4.00441548607135e-08],
 		[64.6516949920878, -671.653131683293, -61.809815520653, 16.6061224968146, -14254.8409339809, -79.713881559753, 20.2036332488645],
 		[-0.000781183004236803, -0.0665863397961522, 0.0811712749751167, -0.00966047039128513, 0.0293851437722431, 0.0866578060425375, -0.0528442972182768],
 		[2.61197391465525e-05, 7.22660891967726e-05, 2.57183273265403e-05, 5.08095903036052e-05, -9.09406755815657e-06, -6.66656970171834e-06, -3.18785458182517e-05],
 		[8.30520915323253e-09, 2.65184242557983e-08, 6.50035425255853e-08, 4.10632967531479e-08, 5.28414731177973e-08, 7.8453140183584e-08, 1.16559452432945e-07],
 		[1.00880010311166, -111.118293246167, -0.622928353003317, 0.382497317335732, 100.915281311159, 1.33558630799815, 1.99126173947746],
 		[0.000629457573064115, 0.00235141042551595, -0.00142077827312196, 0.000118192249506489, -0.000226224797427353, -0.000541507776773432, 0.000261064382768956],
 		[4.76548252259435e-07, -6.83952335728887e-07, -1.77037475588929e-07, -1.8206381125689e-07, 6.61890134368346e-08, 2.60732851092671e-08, 4.9143034097571e-08],
 		[0.0686213516587869, 0.476586282399082, 0.0215887610567296, 0.00150052567319237, -0.0328096728013612, -0.0428482933147838, -0.00194380325059176],
 		[-2.56860753758437e-05, -2.58384998234911e-05, 8.39386537752876e-06, -4.49543196569561e-07, 5.95412664795918e-07, 1.14629136491012e-06, -4.13780492277647e-07],
 		[0.0230091495836819, 0.0388676346909066, -0.000152720589301743, 6.95873414538418e-05, 0.00815538173927493, 0.000160707693133192, 7.17304541290902e-06],
 		[0.00908487484895858, 0.306582878510543, -0.635678653263489, 0.435311424822334, 0.211502300562025, -1.79970371983515, 0.762838782772107],
 		[-6.07542148475919e-05, -0.000326399597028335, 0.000626342803387095, -0.000173486674993295, 0.000872876754092158, 0.00103995049475758, 0.00304298651139351],
 		[1.892966355134e-07, -1.89303421610525e-07, -1.7716247593956e-06, -2.14029071728109e-06, 8.32625982857816e-07, -5.89257702410354e-07, -8.43988589692195e-06],
 		[-3.89244144259135e-10, -1.33961456765952e-10, 2.00133859586233e-09, 3.08847521759438e-09, -9.84319330945431e-10, -3.42172571937682e-10, 8.2629464870166e-09],
 		[-3.55126241992485, -1445.19633279061, 29.329229701266, -13.3428932608799, 24394.5329857458, -654.348945928361, -315.150581719587],
 		[-0.00224704279197085, -0.0309302251932675, 0.0351706378011403, -0.0146727919487635, -0.00595317263901059, 0.0354736736305868, -0.0116398918693846],
 		[1.94752976576426e-05, 4.35633152022743e-05, 5.89251374187751e-06, 2.53243412591356e-05, -6.2653406114589e-07, 1.67053662658445e-06, -5.83293381853417e-06],
 		[-4.05874044611588e-10, 9.78723292904054e-09, 2.44376407492988e-08, 2.32504096327989e-08, 1.29865878818885e-08, 2.08220926720876e-08, 4.04733870716145e-08],
 		[0.572076606590515, 75.5961716229984, -1.32576414736542, 0.179656598371574, -0.0142545719951034, 5.51183643091994, -3.22938182156043],
 		[0.000341607130504515, 0.00104394457333804, -0.000624202014030576, 0.000170368553352389, 6.1942019069406e-05, -0.000228722854532255, 5.92427546012346e-05],
 		[3.06667693387926e-08, -4.65747399633065e-07, 4.40487944426754e-09, -9.36439433949459e-08, 3.58081337241165e-08, 1.3204178866705e-08, 1.25359017370266e-08],
 		[-0.103335643982612, 0.328336487543161, -0.00842539249868991, -0.00347317422513204, -0.121290010020741, 0.0316665399756193, 1.27843626412198e-06],
 		[-1.21018558036673e-05, -1.1198682341769e-05, 3.71403363827435e-06, -6.42191900173136e-07, -2.02456510541486e-07, 4.94458202165748e-07, -9.56687781446091e-08],
 		[-0.0158855282282461, -0.034523296235374, 0.000273632508256865, -8.26008966567099e-05, -0.00813842558151363, -0.000185597639172545, -1.21906288014217e-05],
 		[-1.48825022429169e-05, -1.55178599571436e-05, -2.16459534140949e-05, -1.59341104674984e-05, -1.40803042888153e-05, -1.12626173391363e-05, -1.35872372848159e-05],
 		[-1.13437575250459e-05, -1.00450165181031e-05, -9.77158440034178e-06, -7.9818752629697e-06, -6.66410521181383e-06, -7.47789448494332e-06, -8.65151623117894e-06],
 		[-3.63623465129845e-06, -5.43567025535596e-06, -5.08887935984403e-06, -4.28231140444076e-06, -3.54161184666482e-06, -3.48965087312134e-06, -4.15703258772344e-06],
 		[2.58546001535517e-08, 2.70415287826955e-08, 2.94555711994659e-08, 2.27472056566317e-08, 1.9973241730417e-08, 1.92101790468023e-08, 2.10394104780158e-08],
 		[-2.77686056876107e-09, 1.89149403476492e-09, 4.69401628169535e-09, 5.43143122349099e-09, 6.43605135395768e-09, 7.38737837215288e-09, 1.05704094780914e-08],
 		[6.23820467762841e-08, 2.96321907701806e-10, 1.04502990351311e-07, 5.12415777651329e-08, 3.69152742397027e-08, 1.55672836981282e-08, 2.20024063450774e-08],
 		[1.48202245274859e-08, 1.75663268919748e-08, 1.8321705882471e-08, 1.69386158499878e-08, 1.59334362982799e-08, 1.61987454583157e-08, 1.77580747443316e-08],
 		[3.23080429355209e-08, 3.59826647817216e-08, 3.63634776149705e-08, 3.21137622768138e-08, 3.05844486029329e-08, 3.05445445364527e-08, 3.13672988910165e-08],
 		[1.75297464127068e-07, 1.78899435442833e-08, 2.4114729399464e-09, 1.57187150750338e-09, -4.53614218836947e-09, 1.73361290286773e-09, 4.72841027563668e-09],
 		[1.44854663557436e-08, 1.7914859005543e-08, 1.68352406638117e-08, 1.47334460561441e-08, 1.3625406402433e-08, 1.33814676330358e-08, 1.36152061919576e-08],
 		[3.30562000789563e-09, 3.91276841461509e-09, 4.18713397261144e-09, 3.74407680651955e-09, 3.1157418168557e-09, 3.30112991352482e-09, 3.88457852659626e-09],
 		[-2.23671903049505e-08, 7.49498154405778e-09, 2.14353194446422e-09, 4.15133317934901e-09, 1.19801332417383e-09, 1.16928041741528e-09, 3.43578666163517e-09],
 		[2.02396456809877e-09, 3.93087067194033e-09, 5.69704426442414e-09, 4.27823664934866e-09, 3.88866197604808e-09, 3.73398238737287e-09, 4.11329316308789e-09]
],
		"green": 		[
		[3.17802078356547, 1623.58015905304, -73.4161088745986, 512.763526090177, 19776.6179349722, 11376.0601127377, 1365.85203566965],
 		[0.000511502809590191, 0.484034431141092, -1.47909760467739, 0.0114667680465936, 0.00454358578155478, -3.43240538405439, 3.13523163130935],
 		[3.92028960284345e-05, -0.000385998049722445, 0.000408736375906058, -0.000358410105396265, -0.000234888724916202, 0.00126598004843269, 0.00618579773568825],
 		[-3.67161294310289e-07, 1.02167104070166e-07, -3.14909130014603e-06, 6.77392902473984e-07, -5.97254658155909e-07, -1.87393142715809e-06, -1.23925440507769e-05],
 		[7.09866825979543e-10, 5.42084517471902e-11, 3.69667130917417e-09, -4.84921469847458e-09, -2.98363994871583e-09, -1.51143321751735e-09, 8.18789254672726e-09],
 		[-64.5959141006394, 1891.08399876568, 40.6749209594545, -29.2091077095469, -11133.7788735391, 443.331273595198, 272.892856825721],
 		[-0.00143371383344274, -0.0482283057093499, 0.0859549186815689, 0.00351607800077206, 0.00577099768672991, 0.0679509340314028, -0.0448223573466928],
 		[2.66689259098189e-05, 5.22936801748912e-05, 3.54673348579117e-05, 2.93197200760412e-05, 3.02096089620391e-05, 6.48928741535694e-06, -2.6620238058796e-05],
 		[-2.50122397853874e-08, -3.10414878447266e-08, 1.00875637813927e-08, 1.85957643099241e-08, 1.88004209653521e-08, 2.22715492595e-08, 5.34007297926363e-08],
 		[-0.892582825365913, 47.8727669583587, 1.69358094442131, -0.067734191053543, -95.4409339759915, -3.97664039881275, 1.45399589458292],
 		[0.000511639755265045, 0.0017487468436293, -0.00153712209293216, -2.71970780502477e-05, -6.72181550598523e-05, -0.000427339784983883, 0.000223054940238424],
 		[9.42678325370958e-08, -3.1430392719525e-07, -2.42491402813504e-07, -1.16874037203342e-07, -1.07483097428176e-07, -1.18025000624234e-09, 5.28187970313253e-08],
 		[-0.0166800116782317, -1.10257761167216, -0.00811318652565494, -0.00178884314033333, 0.110051768787358, -0.00161334828277057, 0.00136751522726199],
 		[-1.72694919201006e-05, -1.97270408349018e-05, 9.20869220468759e-06, 1.09430684932991e-07, 2.62851026403094e-07, 9.07164243634137e-07, -3.57810705618412e-07],
 		[-0.00593156602245121, -0.00163778451862546, -0.0001480736876665, 2.26769406776543e-05, 8.65140986334427e-05, 4.62895429402002e-05, 5.80738543338365e-06],
 		[-0.00745561520297653, 0.637404532600323, -1.46996482954373, 0.423904678948542, -1.12930455367961, -4.44970274486537, 3.48255831614904],
 		[0.00016981638507433, -8.17555833343545e-05, 0.00170298515365859, -0.000310618557788927, 0.0030244225638571, 0.00425701652503639, 0.00967215006761644],
 		[-1.04570092052276e-06, -2.97829370409287e-06, -8.36665936377535e-06, -4.87244430327674e-06, -4.59777501429625e-06, -1.34038555475677e-05, -3.22074414685279e-05],
 		[1.83601368128416e-09, 4.64942092783807e-09, 1.21784962578948e-08, 8.98628374346455e-09, 5.79203129161527e-09, 1.64643268321254e-08, 4.03060067228991e-08],
 		[65.1521295970099, -664.431284189419, -61.8867134634602, 15.4785802070523, -14701.0687169823, -80.7366549072761, 17.9114450458997],
 		[-0.000594000767338493, -0.065853657423457, 0.0823055740109747, -0.010954858537632, 0.0297156607339464, 0.085861005986184, -0.0508203812437347],
 		[2.87168263803317e-05, 7.34235202003651e-05, 2.3988651432303e-05, 5.06167817324221e-05, -9.38569209344002e-06, -6.23561103264625e-06, -3.03507838803182e-05],
 		[2.11649755538078e-09, 2.59394927050233e-08, 6.49623504336777e-08, 4.10732719805322e-08, 5.34422314969536e-08, 7.87072286070548e-08, 1.16658302679633e-07],
 		[1.02765900836195, -112.569311499422, -0.634268816427544, 0.362237471939063, 104.082316255609, 1.35390441824049, 2.00190101468485],
 		[0.000585977559140256, 0.00232316858589935, -0.00143989472641038, 0.000134390189952095, -0.000228798166122861, -0.000537421242288114, 0.000251244049626789],
 		[4.6816988923914e-07, -6.96716633615155e-07, -1.59392894946477e-07, -1.80709164363058e-07, 6.68746828341205e-08, 2.3663530321475e-08, 4.5471838473181e-08],
 		[0.0679860137149744, 0.488575755067653, 0.021449968640533, 0.00153916235298973, -0.0338824391627075, -0.0433312347636331, -0.00196623894120291],
 		[-2.40956848108288e-05, -2.55067241501959e-05, 8.49889434548577e-06, -5.15782626903734e-07, 6.0253839523466e-07, 1.14034673470978e-06, -3.97990153908627e-07],
 		[0.0232304704434526, 0.0385446450052353, -0.000157776377999097, 5.92638015960818e-05, 0.00841168778052142, 0.000162608580036096, 7.310419470798e-06],
 		[0.00778621384575692, 0.29715748373112, -0.625636446180219, 0.396431633119467, 0.299245447441724, -1.930260423944, 0.710993926971104],
 		[-5.19022986497138e-05, -0.000287530770072593, 0.000643498446059768, -0.000204754038615046, 0.000839069232728693, 0.00122351830675901, 0.00300007721250385],
 		[1.28819564313355e-07, -2.03294217897805e-07, -1.90749246856829e-06, -2.08958105627128e-06, 8.89453388795745e-07, -4.1826913320932e-07, -8.43042231381986e-06],
 		[-2.59218847638096e-10, -1.24171662340884e-10, 2.12808137845117e-09, 3.17942817907091e-09, -1.01672791453596e-09, -4.56075887967067e-10, 8.24888659382651e-09],
 		[-3.94917702975531, -1453.69299039326, 29.1670452173198, -11.2139777427917, 25159.4045746135, -662.367587371394, -316.987329955596],
 		[-0.00230643932098652, -0.0302125285498143, 0.0346610465449789, -0.0132635037916567, -0.0080355045943697, 0.0378031092074602, -0.0108990667973462],
 		[1.98260758738965e-05, 4.11940985355385e-05, 6.22266294591178e-06, 2.58770619474929e-05, -2.3805106199447e-07, -9.95773104036725e-07, -5.42246833480119e-06],
 		[-7.03360877073539e-10, 9.89364557972293e-09, 2.54817476221033e-08, 2.21240905596761e-08, 1.27574213236569e-08, 2.00287523788202e-08, 4.04797810588423e-08],
 		[0.560482783014135, 76.4199605866339, -1.35594571485035, 0.155970107915502, -0.00822125794460728, 5.57733836830538, -3.26817799366522],
 		[0.000342188795119784, 0.00102731955863015, -0.000617090648543117, 0.000153710044819488, 7.85684066454728e-05, -0.000242273339176317, 5.57246597485406e-05],
 		[2.72640993914856e-08, -4.25101343742132e-07, -1.74450510603693e-09, -9.44907317638825e-08, 3.459764659231e-08, 2.25209044665217e-08, 1.1492177421068e-08],
 		[-0.105048784745045, 0.348679205308271, -0.00875422317548662, -0.00334532040602486, -0.125115088781359, 0.0320334254308539, 1.17259790143535e-06],
 		[-1.18969825930597e-05, -1.11120005685749e-05, 3.68773760153362e-06, -5.78409251413675e-07, -2.47041115232791e-07, 5.20111898702371e-07, -9.01011942989701e-08],
 		[-0.0159228369268403, -0.0346852954166893, 0.00028050674410739, -7.12504170944478e-05, -0.00839434705413025, -0.000187792426480326, -1.24058015017669e-05],
 		[-1.36947448841608e-05, -1.55989405749979e-05, -2.15465549351237e-05, -1.60028299197718e-05, -1.39871971608754e-05, -1.12863671107183e-05, -1.35875838519017e-05],
 		[-1.01225417323826e-05, -1.01550675798373e-05, -9.77602410517226e-06, -7.96264539146131e-06, -6.70197263668605e-06, -7.48533151970927e-06, -8.6499652257062e-06],
 		[-3.04221530264517e-06, -5.30664281840389e-06, -5.25503639731553e-06, -4.26206693333445e-06, -3.59810400126378e-06, -3.47073488765775e-06, -4.14215077015975e-06],
 		[2.57486087452549e-08, 2.74285430759453e-08, 2.94083478758516e-08, 2.2833387403005e-08, 2.00437463922705e-08, 1.92513333588676e-08, 2.1068518331226e-08],
 		[-3.62564239664028e-09, 1.70845034969204e-09, 4.59333450618475e-09, 5.49893273997292e-09, 6.34422055243163e-09, 7.39778014379853e-09, 1.05909958613058e-08],
 		[3.73338291876847e-09, 8.89205359819495e-10, 1.03582484341253e-07, 5.15320152567508e-08, 3.62040490608347e-08, 1.55524761938197e-08, 2.19588461649809e-08],
 		[1.3815204540362e-08, 1.7542989743527e-08, 1.84309916676982e-08, 1.69158978891051e-08, 1.59693610377286e-08, 1.62017901088037e-08, 1.77645927651542e-08],
 		[3.14356951693153e-08, 3.59734265403166e-08, 3.65786946563527e-08, 3.22335023393409e-08, 3.06118835741748e-08, 3.07024387237262e-08, 3.14107517561897e-08],
 		[1.32180351738704e-07, 2.16724274572754e-08, 1.47498231869561e-09, 1.26182099969168e-09, -4.21254573372443e-09, 1.5561869970679e-09, 4.70168273950555e-09],
 		[1.3770732694815e-08, 1.75842077306371e-08, 1.69665704515935e-08, 1.48158664500813e-08, 1.36303562345796e-08, 1.33899692816965e-08, 1.3616602111347e-08],
 		[3.35513752335569e-09, 3.78506421933821e-09, 4.18777480952647e-09, 3.76795307364236e-09, 3.14032265894268e-09, 3.25983337040399e-09, 3.87104552181431e-09],
 		[-5.43556718591088e-08, 7.78236367482245e-09, 4.40922905357143e-09, 3.71320100346823e-09, 1.68596606547658e-09, 1.08040212223936e-09, 3.41102165253333e-09],
 		[2.27326246710347e-09, 3.92299127195146e-09, 5.66804902109159e-09, 4.22391917760546e-09, 3.85973408146495e-09, 3.73955222253724e-09, 4.07763403039291e-09]],
		"blue": 		[
		[0.692558582236395, 1673.25721163443, -59.1011789992601, 572.824925977196, 17805.7814693288, 11447.5441592285, 1451.25871506228],
 		[0.00338008205345589, 0.461177123427351, -1.46369402159389, -0.0429246003922549, 0.288349583426141, -3.60365461933886, 3.16938279307855],
 		[6.14952765242729e-05, -0.000430011466617139, 0.000327195470714629, -0.000378011053229307, -0.000622929602839042, 0.00123389174939496, 0.00622475102433048],
 		[-3.81345218564124e-07, 4.72689563110081e-07, -3.05934692146741e-06, 9.93708438326705e-07, -6.50002546198453e-07, -1.90235530478226e-06, -1.24376563288488e-05],
 		[6.18615192470921e-10, -5.76904080424748e-10, 3.64025052781059e-09, -5.37647489414362e-09, -2.78120701395393e-09, -1.27817349766456e-09, 8.10250258908155e-09],
 		[-43.6797026934214, 1938.45937478828, 39.031876051679, -31.0794327190929, -10083.5759034594, 446.783178903583, 285.954647763657],
 		[-0.000444048340691439, -0.0454384471486009, 0.085399793435196, 0.00561158403345039, -0.000327294662639554, 0.0715385906925025, -0.0452833260694105],
 		[2.15999722162678e-05, 5.07063211338333e-05, 3.78697747245601e-05, 2.83645946203069e-05, 3.70216244283158e-05, 6.93081390547075e-06, -2.69442812314243e-05],
 		[-1.9855211864749e-08, -3.26531312654023e-08, 9.01810728455169e-09, 1.82172190662361e-08, 1.83016537500052e-08, 2.1724730574162e-08, 5.38900028191582e-08],
 		[-0.701268087262344, 49.111415211777, 1.6616893154168, -0.0714765590035462, -86.6355057611946, -4.01038132282545, 1.52933174751943],
 		[0.000529072082972602, 0.00166269425194476, -0.00152815423275078, -5.10300438873119e-05, -2.50763603984554e-05, -0.000452021412024541, 0.000225311272452845],
 		[1.62311329696503e-07, -2.77722934057628e-07, -2.61821786890862e-07, -1.09573769227159e-07, -1.3542284814225e-07, -1.41299843941134e-09, 5.34789436009184e-08],
 		[-0.0166360713337633, -1.13323436382642, -0.00841092644130834, -0.00199899045734356, 0.0999526783311757, -0.00166358783504387, 0.00142727760476918],
 		[-1.96031400475798e-05, -1.88566822991186e-05, 9.16155707217539e-06, 1.97628268210512e-07, 1.71096292311209e-07, 9.62953697775324e-07, -3.61505822801232e-07],
 		[-0.00391663723267764, -0.00166920746394637, -0.000142297340309277, 2.54470051951254e-05, 7.82298650057683e-05, 4.66051240460563e-05, 6.0910112146765e-06],
 		[-0.0035001646158765, 0.635974048371996, -1.44895434139846, 0.38454707446983, -1.60809478464426, -4.7145333576126, 3.62617575255664],
 		[0.00026240456855411, -0.000112370670501977, 0.0016644090855427, -0.00028235630251637, 0.00305803561818726, 0.00416497126019546, 0.00984949718465673],
 		[-1.42003617158748e-06, -2.73983694920223e-06, -8.31386588739534e-06, -4.9552020915133e-06, -4.50921589780802e-06, -1.34978325218109e-05, -3.22601684082991e-05],
 		[2.16328784768096e-09, 4.29337159455125e-09, 1.19918520910413e-08, 8.97960237152131e-09, 5.49353467929533e-09, 1.64432672760699e-08, 4.01416258065772e-08],
 		[46.0158709629907, -680.186237453171, -60.2757710248546, 17.0684581363549, -13349.6174252857, -81.0130648735615, 16.7531541188627],
 		[0.000366681303714986, -0.0653618245645446, 0.0813005777819708, -0.00954700073190915, 0.041642991111765, 0.0910823731699173, -0.0528846227585316],
 		[1.83818063632435e-05, 7.21793201141536e-05, 2.52860883578651e-05, 5.01930382144338e-05, -1.02644101944603e-05, -5.02071070651636e-06, -3.18976727618505e-05],
 		[2.07363791090812e-08, 2.45189884128333e-08, 6.58486360775006e-08, 4.22854077719227e-08, 5.40023587263074e-08, 7.95802363770054e-08, 1.17546502443825e-07],
 		[0.798012089024288, -115.420816674729, -0.622566500616005, 0.389584440028228, 94.4303113017611, 1.36244857627874, 2.08946829724818],
 		[0.000644965613503731, 0.00231500099258102, -0.00142159455530916, 0.000118621068091252, -0.000326704807349624, -0.000571364594678901, 0.000261133040209988],
 		[6.46366994590374e-07, -6.68200573356134e-07, -1.75540582339319e-07, -1.80273342221059e-07, 7.07717114016975e-08, 1.99376083987381e-08, 4.87801923999764e-08],
 		[0.048895301718235, 0.502106474110445, 0.0209495554766745, 0.00151176642875612, -0.0303402271402075, -0.0435945244654627, -0.00206164963867306],
 		[-2.92829554884612e-05, -2.54931564045365e-05, 8.39898993942204e-06, -4.55273708691113e-07, 8.68840545788372e-07, 1.21361895053536e-06, -4.13582562797158e-07],
 		[0.0183237330327569, 0.0394952793854553, -0.000153587731259732, 7.03774156812556e-05, 0.00762428240777404, 0.00016367561925589, 7.66721591180201e-06],
 		[0.00642212788614169, 0.298290342956873, -0.636016739742364, 0.389330780698732, 0.397539864165708, -1.85532537230986, 0.782998274582222],
 		[-7.36036358510675e-06, -0.000336029891980479, 0.000612955155458903, -9.13903806153149e-05, 0.000780058068009399, 0.00127217569561613, 0.00309793685814957],
 		[-7.91535670757699e-09, -1.88782541677126e-07, -1.79769105783882e-06, -1.95817449039588e-06, 4.05336805253009e-07, -5.75237701054954e-07, -8.44583295843556e-06],
 		[-1.25141124128454e-10, -1.59256389254809e-10, 2.01832305583971e-09, 3.06764962586397e-09, -7.81530377556852e-10, -6.07530678920006e-10, 8.20538169035949e-09],
 		[-4.57437024009957, -1491.94905090902, 28.3071382137118, -13.6793202620436, 22824.6519119149, -667.306702103127, -330.476445792493],
 		[-0.000622833585147474, -0.0297734210073859, 0.0353589754281819, -0.0133769757851923, -0.0102743545317341, 0.0362406638731543, -0.0119705910409216],
 		[1.38465844982708e-05, 4.38719092637669e-05, 6.70071100151006e-06, 2.25687160084767e-05, 2.51377101603602e-06, -1.34125223863824e-06, -6.31076105069872e-06],
 		[7.73228219890356e-09, 1.11121213339811e-08, 2.45197625308464e-08, 2.11927967527574e-08, 1.60125656061808e-08, 2.16827817767337e-08, 4.07356759527085e-08],
 		[0.431840263545818, 78.3713555574248, -1.31218795341761, 0.180716708536091, -0.0113222525374642, 5.61905428430653, -3.41981191564724],
 		[0.000292212302169314, 0.00100338046480401, -0.000629634396790988, 0.00016078144630148, 9.34480247074893e-05, -0.000231656846569266, 6.10512656610203e-05],
 		[9.5497208193613e-08, -4.78518188037973e-07, -3.23070610675075e-09, -7.23308040409921e-08, 1.67027851621682e-08, 2.24077106271801e-08, 1.3698752799206e-08],
 		[-0.0763691635226442, 0.358233706440317, -0.00822950583412611, -0.00348540213530708, -0.113767544704262, 0.0322794319991076, 1.36138446117763e-06],
 		[-1.20547501176418e-05, -1.07016903844627e-05, 3.76301968856321e-06, -6.30422628815907e-07, -2.71659698161275e-07, 4.9685662885766e-07, -9.89456203016668e-08],
 		[-0.0132155743784626, -0.0355418608291052, 0.000271710283626416, -8.40285754323288e-05, -0.00760877649205835, -0.000189073454899435, -1.30044919842067e-05],
 		[-2.39890463318072e-05, -1.6171178591698e-05, -2.21754015326694e-05, -1.6252665512668e-05, -1.41611683452115e-05, -1.14416911987802e-05, -1.37129312162198e-05],
 		[-1.83993008414837e-05, -1.07267323442987e-05, -9.97610182969937e-06, -8.14406493146751e-06, -6.6685265329225e-06, -7.49539673259887e-06, -8.68561856277991e-06],
 		[-8.5551277863497e-06, -5.84064303713076e-06, -5.57398691666131e-06, -4.37249875499182e-06, -3.51902676726776e-06, -3.40403078194155e-06, -4.19073905124653e-06],
 		[3.08102308673723e-08, 2.79303284419321e-08, 3.0033463415499e-08, 2.31657739030401e-08, 2.02045834838715e-08, 1.92677522984508e-08, 2.11780156176409e-08],
 		[7.81945370936141e-11, 2.63296671867816e-09, 4.94393059806834e-09, 5.77290547285462e-09, 6.29511871412307e-09, 7.55044686195809e-09, 1.06641960823178e-08],
 		[4.10887111780277e-07, 3.04412086242181e-10, 1.07110758653937e-07, 5.1888808945557e-08, 3.71183599444809e-08, 1.62758753755574e-08, 2.23021906380385e-08],
 		[1.70240998416101e-08, 1.80652248993313e-08, 1.87902147184207e-08, 1.71326107394591e-08, 1.60362590092021e-08, 1.62609703434093e-08, 1.77823807185893e-08],
 		[3.5217400300668e-08, 3.70458601005392e-08, 3.68564644650583e-08, 3.23406087965814e-08, 3.08145562195956e-08, 3.07726023811108e-08, 3.14794722673656e-08],
 		[4.50101469968835e-07, 2.10847715326862e-08, 1.8207526046311e-10, 2.01645265600604e-09, -5.14484477849657e-09, 1.50300324795312e-09, 4.86797095240256e-09],
 		[1.92910176971256e-08, 1.88700850569787e-08, 1.74844347809005e-08, 1.48656915041913e-08, 1.36719941309569e-08, 1.34646458688919e-08, 1.36961208324683e-08],
 		[7.77358124640171e-09, 3.86161726317674e-09, 4.24176925384242e-09, 3.86193027050275e-09, 3.31955232803243e-09, 3.31584528599182e-09, 3.87774328351468e-09],
 		[4.92919335570863e-08, 7.72172845080933e-09, 5.84590497834827e-09, 3.99342393650534e-09, 3.43167211249046e-10, 4.72984092047158e-10, 3.55006854477341e-09],
 		[9.62644199865668e-09, 4.91271717513077e-09, 6.41210877269004e-09, 4.55908215044596e-09, 4.01110690026823e-09, 3.76564301247258e-09, 4.08655319216497e-09]],
		"ir": 		[
		[1.03503807849563, 69.8657955925818, -18.8783965653242, 3.25638725078578, -161.56673694563, 244.906688615517, 4.69603248063146],
 		[-0.00557998693894822, 0.0200304106495692, -0.12852617542893, -0.00643231885877898, 0.100711357314034, -0.255754609955523, 0.206893565552829],
 		[2.69151954286261e-06, -1.30345885458121e-06, 5.87530901540627e-05, -4.08860674575276e-05, 0.00012635732874094, 0.000130600711601764, 0.00055964422102538],
 		[6.36670124090837e-08, 5.7794577107712e-08, -3.51644131027266e-07, 1.99978247337564e-07, 3.22970174211007e-08, -8.63925568563412e-08, -1.47143102013515e-06],
 		[-1.39910021099574e-10, -1.91801291396734e-10, 4.28440213260711e-10, -2.97648855661979e-10, -3.04692913686202e-10, -1.91727954576977e-10, 1.37131297507634e-09],
 		[9.81735812965948, 78.9754524563934, 8.42888396857503, -0.303474749805574, 81.3301631186055, 11.2743998563585, 8.99628551020869],
 		[0.00203136020888283, -0.00205871658526699, 0.00715329433146795, 0.00035895451539025, -0.00225363481368416, 0.00507106354273697, -0.00295873431677232],
 		[-1.22275785368612e-06, 1.04251116133235e-06, 2.4698125835103e-06, 2.38136107664794e-06, 4.03686116122155e-08, -9.9422009452425e-08, -2.20120986074919e-06],
 		[-1.09372094661232e-09, 8.17887970691163e-11, 1.43678070076349e-09, -1.09329653706662e-09, 4.48683070295874e-10, 1.11341850315462e-09, 4.50232530855968e-09],
 		[0.244402198114232, 1.96026081893659, 0.171668771930033, -0.0037877129361525, 0.618889110353933, -0.101665142210097, 0.0446888182438117],
 		[-0.000131115744621864, 8.71863348131744e-05, -0.000125521243281353, -3.06139730399286e-06, 1.82234867532363e-05, -3.11506994960581e-05, 1.4903731202992e-05],
 		[1.28610897391251e-07, 1.09492889937812e-08, -1.9145471542644e-08, -5.48747940691084e-09, 2.31763931156155e-09, 2.25279354371402e-09, 3.69543722936642e-09],
 		[-0.000411566103699679, -0.0434217440158766, -0.000764394391453317, -2.23271523661629e-05, -0.000668196219075023, -9.66817298768618e-05, 5.10652879664876e-05],
 		[2.73804250151625e-06, -1.0638574278792e-06, 7.41527963348765e-07, 1.07340625104559e-08, -4.82631102814666e-08, 6.350105939348e-08, -2.3934898904996e-08],
 		[0.000980613415595897, -0.000104773047645825, -2.11929211074741e-05, 2.7336102217363e-07, -6.76650741518457e-07, 1.11960288161461e-06, 1.87403484955255e-07],
 		[3.63252037682326e-05, 0.0372385773610865, -0.038889981519807, 0.0115094071032651, -0.168902346228402, 0.00734708419325214, 0.115529602491338],
 		[1.54080902050149e-05, -8.35722541340861e-05, 6.770749699618e-06, 1.5608081903151e-05, -0.00012331990574083, -5.35451818270905e-05, 0.000297828036585491],
 		[-7.90639452673478e-08, -7.28002695248028e-09, -3.5236576069656e-07, -1.40730939175704e-07, 5.13209590824245e-08, -2.17987266725428e-07, -7.81615735229604e-07],
 		[1.21337525142904e-10, 2.53781542275336e-10, 5.87261118362667e-10, 2.72294023085893e-10, 1.95263619754152e-10, 3.70959671657428e-10, 9.17701442781858e-10],
 		[-9.17394088340484, -28.6624443310463, -9.93472067569717, 0.221691143909162, 93.0492757990841, -1.66561078962597, 2.08133025368432],
 		[-7.58540153713504e-05, -0.00305028736113911, 0.00249860557300041, -0.00035753434615461, 0.00482591488772851, 0.000141771893409762, -0.00161428775113595],
 		[6.50654479404568e-07, 6.8001377672652e-06, 3.30852793520352e-06, 1.56505532481376e-06, 3.22034282251775e-06, 2.21911931954839e-06, -8.93769697011555e-07],
 		[3.36003654407663e-10, -4.22148677956982e-09, 1.61318955392925e-09, 3.30656438950824e-10, -7.63824684595295e-10, 8.1665143919035e-10, 2.53152858351879e-09],
 		[-0.0835535793707706, -4.60970417952247, -0.0656164935995486, 0.00640636984751611, -0.690168733130467, 0.0335095941587176, 0.0712278802499131],
 		[4.02350885144788e-05, 9.03754659735177e-05, -4.69895178407739e-05, 5.04658015729557e-06, -4.32013539797931e-05, -1.41529795414493e-06, 8.22489962361743e-06],
 		[3.69594754819695e-08, -6.07980986255333e-08, -2.65740614801008e-08, -3.74162296718923e-09, -8.84421050571603e-09, -5.52085232613385e-09, 1.79910529606804e-09],
 		[-0.0119851616372815, 0.0196167775162133, 0.00306131544744368, 2.13087801917643e-05, 0.000363040880739363, -0.000985454570212864, -6.43617829134144e-05],
 		[-1.7712785239127e-06, -8.7458853154179e-07, 3.00289781870073e-07, -2.04772646168899e-08, 1.26446691839853e-07, 4.29723160063983e-09, -1.33657779675894e-08],
 		[-0.00245916035685772, 0.00162693005269355, -1.26274514075581e-05, 6.02463931830358e-07, -6.00417770334169e-05, 3.75877175575692e-06, 2.30553653365712e-07],
 		[0.00153695049465275, -0.0221990005635203, -0.0403813900113311, 0.00331249348942257, -0.0512092382938853, 0.0866318268439027, 0.0364912600360042],
 		[1.75217684887928e-07, -4.32547519967621e-06, 0.000134801567097404, 2.61817042405943e-05, -6.33305650588046e-05, -5.28694502139363e-05, 4.50966023621934e-05],
 		[-3.11194087066521e-08, -6.80456413581582e-08, -2.64569214926341e-07, -1.86213234730589e-07, -1.77965403419298e-07, -6.04904027444164e-08, -2.77901354207903e-07],
 		[6.52561792147374e-11, 1.7359886458726e-10, 1.47543451292334e-10, 2.06074647804046e-10, 2.49650191761555e-10, -1.95762492814618e-11, 3.81583598747644e-10],
 		[-1.01924388435407, -59.8910108891665, 3.25581543698068, -0.0826881647089119, -168.850181558635, -16.3286277439917, -11.3428878344653],
 		[-0.000465731528546402, 0.00226907655260655, 0.00180914705570853, -0.000159118092256465, 0.00150534797967061, -0.00150431431520708, -0.000460009876341208],
 		[1.57896396363585e-06, 1.68085644824083e-06, -2.60288810530684e-06, 8.10477711448607e-07, 2.34769826761432e-06, 1.34413550596772e-06, 3.5446387972605e-07],
 		[-6.75923709053399e-11, -5.40417984709877e-10, 3.46153524001753e-09, 1.02779742562779e-09, 6.83548398269232e-10, 7.38736272531887e-10, 8.46216073829659e-10],
 		[-0.0892530550698634, 3.1392920155963, -0.162359963035202, 0.00125469291150236, 0.000283986148186285, 0.137131253962127, -0.112835657296995],
 		[4.53309632897071e-05, -7.60232143438699e-05, -2.6537577984743e-05, 1.41720627386032e-06, -1.47118412415154e-05, 8.96583167468938e-06, 2.03719949365027e-06],
 		[-5.63096744965394e-08, -1.8100254432617e-08, 1.60530822051983e-08, -4.21977977400966e-09, -9.83841963923199e-09, -3.98960124626116e-09, -5.56757695111278e-10],
 		[0.00738570937937425, 0.0128325670870613, -0.0015212539982904, -3.70602739703106e-05, 0.000711490309223387, 0.000768429858172902, 1.26833187050293e-08],
 		[-1.0370629289967e-06, 8.58970662171031e-07, 1.36403777960464e-07, -1.64092319084587e-09, 4.7431467263798e-08, -1.76334806940866e-08, -2.89542191093218e-09],
 		[0.00159747518382406, -0.0014313186179372, 2.99232531600075e-05, -7.44469135792322e-07, 5.98448362037661e-05, -4.34517322055257e-06, -3.98403432816075e-07],
 		[-1.70844683328143e-06, -1.22992715193536e-06, -1.57293663210873e-06, -3.90998439258288e-07, -7.13229166250892e-07, -1.23363740750905e-06, -1.23951679965617e-06],
 		[-5.7046491526522e-07, -5.25918030544211e-07, -2.43943976264397e-07, -1.09514904711109e-07, -2.3119254848622e-07, -2.90443990966383e-07, -2.7966704344323e-07],
 		[-9.85705492518585e-07, -2.29162053528244e-07, -3.41994883903292e-07, 3.69205743865331e-08, -1.40115831442075e-07, -4.72742425698072e-07, -3.53610393319534e-07],
 		[2.08912804440676e-09, 2.12085616544142e-09, 1.78787346538641e-09, 4.11358020804435e-10, 1.69546100717023e-10, 1.00815155980736e-09, 1.57225482665763e-09],
 		[-3.42841854567422e-11, -4.02838411519229e-10, 5.24080717993977e-11, -6.4349431507804e-10, -6.28567835367046e-10, 1.19553170243731e-10, 5.84093620271129e-10],
 		[2.52766413161346e-08, 1.4202602341638e-09, 7.94395293088598e-09, -9.40192244446688e-11, 3.18353630812837e-09, 3.38205280489548e-09, 2.03023152074247e-09],
 		[6.89902282876123e-10, 1.04464127211074e-09, 5.78091834953501e-10, 5.42659829339722e-10, 4.58456873801989e-10, 3.49528583553691e-10, 4.86066771513712e-10],
 		[4.84060015973328e-10, 1.04811994718123e-09, 1.1712534487027e-09, 1.00859223682273e-09, 9.9929721519479e-10, 8.26519803337104e-10, 8.8758941512323e-10],
 		[2.1640939844734e-08, 4.3459500759632e-09, -1.0562736882316e-09, -9.04722039242304e-10, 1.40668988779641e-10, 4.47558275280977e-10, 1.03588519371978e-10],
 		[2.37207087119503e-09, 1.07124636731743e-09, 9.21976105174961e-10, 4.5583393879161e-10, 4.59635845385426e-10, 6.34325829090521e-10, 8.66869884551835e-10],
 		[9.40056470812599e-10, 3.23501244246759e-11, 4.21516641568473e-10, -5.41166885618542e-11, -2.03795317490355e-10, 1.1114044855642e-10, 1.03560303093602e-10],
 		[-1.47146882434947e-09, -1.82480860308349e-09, 1.50832105432185e-10, -1.10064663069317e-09, 5.48703867734546e-10, 1.36855849904456e-09, 4.00032918743255e-10],
 		[8.52811982847161e-10, 2.30542966070961e-10, 2.82997972666335e-10, -2.9383742144202e-10, -7.80054513447492e-12, 6.48102501728178e-10, 5.3375133309522e-10]
]}
}
