{
  "version":3,
  "update_time":20210425,
  "auto_refresh_rate_policy_mode": "whitelist",
  "auto_refresh_rate_blacklist": [
    "com.tencent.qqlive",
    "com.qiyi.video",
    "com.youku.phone",
    "com.ss.android.ugc.aweme",
    "com.smile.gifmaker",
    "com.tencent.tmgp.sgame",
    "com.tencent.tmgp.pubgmhd",
    "com.happyelements.AndroidAnimal"
  ],
  "auto_refresh_rate_whitelist": [
    "android",
    "com.transsion.phoenix",
    "com.gallery20",
    "com.android.contacts",
    "com.transsion.hilauncher",
    "com.transsion.XOSLauncher",
    "com.android.settings"
  ],
  "high_refresh_rate_blacklist": [
    "com.transsion.screenrecord",
    "com.opera.mini.native",
    "com.tencent.tmgp.speedmobile",
    "com.dts.freefireth",
    "com.kiloo.subwaysurf",
    "com.king.candycrushsaga",
    "com.imangi.templerun",
    "com.imangi.templerun2",
    "com.tonielrosoft.classicludofree",
    "com.firsttouchgames.story",
    "com.ludo.king",
    "com.outfit7.mytalkingangelafree",
    "com.ss.android.ugc.trill",
    "com.sports.live.football.tv",
    "video.like",
    "com.mxtech.videoplayer.ad",
    "iflix.play",
    "com.starmakerinteractive.starmaker",
    "com.gbwhatsapp3",
    "com.lbe.parallel.intl.arm64",
    "ru.yandex.searchplugin",
    "com.nemo.vidmate",
    "com.google.android.apps.nbu.files",
    "cn.xender",
    "com.grabtaxi.driver2",
    "ee.mtakso.driver",
    "com.waze",
    "com.vanced.android.youtube",
    "video.player.videoplayer",
    "org.videolan.vlc",
    "video.like.lite",
    "com.tencent.mobileqq",
    "com.qiyi.video",
    "com.youku.phone",
    "com.tencent.qqlive",
    "com.sohu.sohuvideo",
    "com.hunantv.imgo.activity",
    "com.ss.android.ugc.aweme",
    "com.smile.gifmaker",
    "com.duowan.kiwi",
    "air.tv.douyu.android",
    "tv.danmaku.bili",
    "com.opera.browser",
    "com.dynamicgames.worldbusdrivingsimulator"
  ],
  "g95_high_refresh_rate_blacklist": [
    "com.tencent.mobileqq",
    "com.youku.phone",
    "com.gameloft.android.ANMP.GloftA8HM",
    "com.gameloft.android.ANMP.GloftA8CN"
  ],
  "g80_high_refresh_rate_blacklist": [
    "com.skype.raider",
    "com.tencent.wework"
  ],
  "g85_high_refresh_rate_blacklist": [
    "com.tencent.mobileqq",
    "com.tencent.tmgp.sgame",
    "com.youku.phone",
    "com.gameloft.android.ANMP.GloftA8HM",
    "com.gameloft.android.ANMP.GloftA8CN"
  ],
  "ac8_high_refresh_rate_blacklist": [
    "com.google.android.youtube",
    "com.ss.android.ugc.trill",
    "com.google.android.apps.maps",
    "com.autonavi.minimap",
    "com.baidu.BaiduMap",
    "com.nemo.vidmate",
    "video.like",
    "com.mxtech.videoplayer.ad",
    "com.playit.videoplayer",
    "com.snaptube.premium",
    "com.google.android.apps.youtube.mango",
    "org.videolan.vlc",
    "com.zhiliaoapp.musically.go",
    "com.nexstreaming.app.kinemasterfree",
    "com.kwai.bulldog",
    "video.like.lite",
    "com.lemon.lvoverseas",
    "video.player.videoplayer",
    "com.xvideostudio.videoeditor",
    "com.quvideo.xiaoying",
    "free.video.downloader.freevideodownloader",
    "com.fmwhatsapp",
    "all.video.downloader.allvideodownloader",
    "com.rahul.videoderbeta",
    "com.roidapp.photogrid",
    "com.google.android.apps.photos",
    "com.gallery20"
  ],
  "pubg_package_list": [
    "com.tencent.ig",
    "com.pubg.krmobile",
    "com.vng.pubgmobile",
    "com.rekoo.pubgm",
    "com.tencent.igce",
    "com.tencent.tmgp.pubgmhd"
  ]
}
