{
  "update_version": 1,
  "note": "ImsSwitch update for Vowifi for Nepal Telecom   -   Enable Vowifi for Nepal Telecom",
  "imsswitch_update":
  {
    "defaultswitch": {
    },
    "imsswitch": [
      {
        "mnoname": "Namaste_NP",
        "enableServiceVowifi": true
      }
    ]
  }
}
