{
  "update_version": 2,
  "note": "Setting PS in emergency domain setting for Mobitel_LK",
  "imsswitch_update":
  {
    "defaultswitch": {
    },
    "imsswitch": [
      {
        "mnoname": "Mobitel_LK",
        "enableServiceVowifi": true
      }
    ]
  },
  "globalsettings_update": 
  {
    "defaultsetting": {
    },
    "nohitsetting": {
    },
    "globalsetting": [
      {
        "mnoname": "Mobitel_LK",
        "emergency_domain_setting": "PS"
      }
    ]
  }
}