<?xml version="1.0" encoding="UTF-8"?>
<svg width="480px" height="480px" viewBox="0 0 480 480" version="1.1" xmlns="http://www.w3.org/2000/svg" xmlns:xlink="http://www.w3.org/1999/xlink">
    <title>com.android.dialer_b_s5_2x2_1_mc</title>
    <g id="com.android.dialer" stroke="none" stroke-width="1" fill="none" fill-rule="evenodd">
        <g id="编组" transform="translate(129.000000, 129.000000)" fill="#FFFFFF">
            <path d="M111,222 C172.303607,222 222,172.303607 222,111 C222,49.6963928 172.303607,0 111,0 C49.6963928,0 0,49.6963928 0,111 C0,172.303607 49.6963928,222 111,222 Z" id="椭圆形" opacity="0.100000001"></path>
            <path d="M111,166 C141.375661,166 166,141.375661 166,111 C166,80.6243388 141.375661,56 111,56 C80.6243388,56 56,80.6243388 56,111 C56,141.375661 80.6243388,166 111,166 Z" id="椭圆形" opacity="0.200000003"></path>
            <path d="M138.906916,177.579891 C138.906916,177.579891 138.906916,177.579891 138.906916,177.579891 C139.377517,184.658037 140.031079,192.901165 140.867601,205.483008 C140.914433,206.187382 140.969428,207.014544 141.032587,207.964496 C141.324065,212.348442 138.00646,216.138618 133.622513,216.430091 C133.183943,216.45925 132.743711,216.452012 132.306337,216.408452 C131.855065,216.363507 131.430054,216.316611 131.031305,216.267765 C84.8527639,210.610917 49.0869565,171.162122 49.0869565,123.33863 C49.0869565,76.2416929 83.7742804,37.2669219 128.933912,30.6906285 C129.149931,30.6591711 129.487042,30.6213484 129.945244,30.5771606 L129.945246,30.5771747 C135.421848,30.049025 140.289662,34.0605385 140.817811,39.5371411 C140.870355,40.0819943 140.877905,40.6302513 140.840382,41.1763447 C140.840382,41.1763447 140.840382,41.1763447 140.840382,41.1763447 C140.586109,44.8769819 139.929736,54.2206085 138.871262,69.2072246 L138.87128,69.2072259 C138.546963,73.799135 135.205523,77.6137136 130.696286,78.5397755 C130.696286,78.5397755 130.696286,78.5397755 130.696286,78.5397755 L129.416846,78.8169623 C111.072258,82.9992869 89.4498802,97.7945994 89.4498802,123.33863 C89.4498802,148.834598 111.002868,163.628225 129.313296,167.836594 C129.49806,167.879059 129.811879,167.937576 130.254751,168.012143 C135.006842,168.812263 138.587225,172.771528 138.906916,177.579891 Z" id="路径备份-4" fill-rule="nonzero" transform="translate(95.358696, 123.336957) rotate(-30.000000) translate(-95.358696, -123.336957) "></path>
        </g>
    </g>
</svg>