<?xml version="1.0" encoding="UTF-8"?>
<svg width="480px" height="480px" viewBox="0 0 480 480" version="1.1" xmlns="http://www.w3.org/2000/svg" xmlns:xlink="http://www.w3.org/1999/xlink">
    <title>com.android.BBKClock_clock_hour_2x2_1_sc</title>
    <g id="com.android.BBKClock_clock_hour" stroke="none" stroke-width="1" fill="none" fill-rule="evenodd">
        <path d="M233.026928,85.0132062 L243.38071,85.0229541 C249.150767,85.0283865 251.488095,85.6785459 253.766787,86.898024 C256.045478,88.117502 257.833939,89.9058925 259.053506,92.1845364 C260.273073,94.4631804 260.923323,96.8004837 260.928981,102.57054 L260.986246,160.973073 C260.993828,168.705055 254.731963,174.979212 246.99998,174.986793 C246.991011,174.986802 246.982042,174.986802 246.973072,174.986794 L236.61929,174.977046 C230.849233,174.971613 228.511905,174.321454 226.233213,173.101976 C223.954522,171.882498 222.166061,170.094107 220.946494,167.815464 C219.726927,165.53682 219.076677,163.199516 219.071019,157.42946 L219.013754,99.0269273 C219.006172,91.2949445 225.268037,85.0207881 233.00002,85.0132067 C233.008989,85.0131979 233.017958,85.0131977 233.026928,85.0132062 Z" id="时针" fill="#EE3A57" transform="translate(240.000000, 130.000000) rotate(-180.000000) translate(-240.000000, -130.000000) "></path>
    </g>
</svg>