<?xml version="1.0" encoding="UTF-8"?>
<svg width="480px" height="480px" viewBox="0 0 480 480" version="1.1" xmlns="http://www.w3.org/2000/svg" xmlns:xlink="http://www.w3.org/1999/xlink">
    <title>com.vivo.space_b_s5_2x2_mc</title>
    <g id="com.vivo.space" stroke="none" stroke-width="1" fill="none" fill-rule="evenodd">
        <path d="M330.220059,223.698619 C350.221096,223.698619 352,239.516301 352,244.349103 L351.99945,244.497368 C351.9626,249.49709 350.021085,265 330.220059,265 L330.220059,265 L310.975004,265 C290.974395,265 289.19549,249.182318 289.19549,244.349103 C289.19549,239.516301 290.974395,223.698619 310.975004,223.698619 L310.975004,223.698619 Z M228.999029,224.666915 C231.670589,224.666915 232.220277,225.108327 233.251316,226.587554 C233.714899,227.253392 237.582875,232.95715 241.697416,239.029868 L242.522676,240.247947 C242.706382,240.51911 242.890159,240.790387 243.07373,241.061367 L243.623547,241.873012 C248.012708,248.352509 252.123506,254.425451 252.123506,254.425451 C252.692841,255.235947 253.296344,255.563699 254.0472,255.563699 C254.798483,255.563699 255.401986,255.235947 255.971321,254.425451 C255.971321,254.425451 260.98302,247.021417 265.847325,239.84134 L266.397094,239.029868 C270.511482,232.95715 274.379266,227.253392 274.842657,226.587554 C275.873695,225.108327 276.424238,224.666915 279.095798,224.666915 L279.095798,224.666915 L285.333281,224.666915 C286.769218,224.666915 287.425683,225.753086 286.523204,227.079389 C286.09924,227.702752 281.366773,234.656735 276.46945,241.852856 L275.530728,243.232212 C270.524955,250.587676 265.623098,257.79035 265.238959,258.354795 L265.21479,258.390308 C261.907694,263.097051 259.48044,264.999917 254.0472,264.999917 C248.61396,264.999917 246.187133,263.097051 242.880464,258.390308 L242.880464,258.390308 L242.856295,258.354795 C242.50416,257.837387 238.355806,251.742023 233.811021,245.064142 L233.189139,244.15038 C232.981239,243.844902 232.77284,243.53869 232.564259,243.232212 L231.625507,241.852856 C226.728028,234.656735 221.995361,227.702752 221.571196,227.079389 C220.668717,225.753086 221.325609,224.666915 222.761118,224.666915 L222.761118,224.666915 Z M209.843795,224.667122 C211.735883,224.667122 212.486311,225.392889 212.486311,227.224667 L212.486311,262.442165 C212.486311,264.273943 211.735883,264.999711 209.843795,264.999711 L205.128951,264.999711 C203.236435,264.999711 202.486007,264.273943 202.486007,262.442165 L202.486007,227.224667 C202.486007,225.392889 203.236435,224.667122 205.128951,224.667122 L209.843795,224.667122 Z M135.876521,224.666915 C138.548081,224.666915 139.09905,225.108327 140.129234,226.587554 C140.644326,227.327374 145.362374,234.286848 149.951648,241.061367 L150.501466,241.873012 C154.890626,248.352509 159.001424,254.425451 159.001424,254.425451 C159.570759,255.235947 160.173836,255.563699 160.925118,255.563699 C161.676401,255.563699 162.279905,255.235947 162.848812,254.425451 C162.848812,254.425451 166.959709,248.352509 171.348972,241.873012 L171.898802,241.061367 C172.174165,240.654896 172.449991,240.247759 172.725346,239.84134 L173.275148,239.029868 C177.389783,232.95715 181.257847,227.253392 181.72143,226.587554 C182.752041,225.108327 183.302156,224.666915 185.974143,224.666915 L185.974143,224.666915 L192.211627,224.666915 C193.814563,224.666915 194.303602,225.753086 193.40155,227.079389 C192.977385,227.702752 188.244812,234.656735 183.347432,241.852856 L182.4087,243.232212 C182.200124,243.53869 181.991728,243.844902 181.783832,244.15038 L181.161964,245.064142 C176.617272,251.742023 172.469005,257.837387 172.116877,258.354795 L172.092709,258.390308 C168.785612,263.097051 166.358358,264.999917 160.925118,264.999917 C155.491879,264.999917 153.064624,263.097051 149.757955,258.390308 L149.757955,258.390308 L149.733787,258.354795 C149.341644,257.778591 144.241584,250.284684 139.129005,242.772355 L138.503231,241.852856 C133.605852,234.656735 128.873279,227.702752 128.449114,227.079389 C127.546208,225.753086 128.035674,224.666915 129.639037,224.666915 L129.639037,224.666915 Z M330.220059,233.14021 L310.975004,233.14021 C300.15636,233.14021 299.194513,241.725842 299.194513,244.349103 L299.194918,244.443007 C299.218215,247.170869 300.282159,255.557996 310.975004,255.557996 L310.975004,255.557996 L330.220059,255.557996 C341.038703,255.557996 342.000977,246.972364 342.000977,244.349103 L342.000572,244.255198 C341.977266,241.527337 340.912904,233.14021 330.220059,233.14021 L330.220059,233.14021 Z M209.631565,209.114948 L212.916025,212.293281 C214.451905,213.78036 214.451905,214.959113 212.916025,216.445779 L209.631565,219.623698 C208.095685,221.110778 206.877146,221.110778 205.339985,219.623698 L202.056379,216.445779 C200.519645,214.959113 200.519645,213.78036 202.056379,212.293281 L205.339985,209.115361 C206.877146,207.628282 208.095685,207.628282 209.631565,209.114948 Z" id="形状结合" fill="#00EF51"></path>
    </g>
</svg>