<?xml version="1.0" encoding="UTF-8"?>
<svg width="240px" height="240px" viewBox="0 0 240 240" version="1.1" xmlns="http://www.w3.org/2000/svg" xmlns:xlink="http://www.w3.org/1999/xlink">
    <title>com.android.BBKClock_clock_hour_1x2_0_sc</title>
    <g id="com.android.BBKClock_clock_hour" stroke="none" stroke-width="1" fill="none" fill-rule="evenodd">
        <path d="M116.691656,41 L123.308344,41 C125.982901,41 126.952759,41.2784768 127.930537,41.8013981 C128.908315,42.3243194 129.675681,43.0916851 130.198602,44.0694629 C130.721523,45.0472407 131,46.0170994 131,48.6916556 L131,79.3083444 C131,81.9829006 130.721523,82.9527593 130.198602,83.9305371 C129.675681,84.9083149 128.908315,85.6756806 127.930537,86.1986019 C126.952759,86.7215232 125.982901,87 123.308344,87 L116.691656,87 C114.017099,87 113.047241,86.7215232 112.069463,86.1986019 C111.091685,85.6756806 110.324319,84.9083149 109.801398,83.9305371 C109.278477,82.9527593 109,81.9829006 109,79.3083444 L109,48.6916556 C109,46.0170994 109.278477,45.0472407 109.801398,44.0694629 C110.324319,43.0916851 111.091685,42.3243194 112.069463,41.8013981 C113.047241,41.2784768 114.017099,41 116.691656,41 Z" id="时针" fill="#EE3A57" transform="translate(120.000000, 64.000000) rotate(-360.000000) translate(-120.000000, -64.000000) "></path>
    </g>
</svg>