<?xml version="1.0" encoding="UTF-8"?>
<svg width="240px" height="240px" viewBox="0 0 240 240" version="1.1" xmlns="http://www.w3.org/2000/svg" xmlns:xlink="http://www.w3.org/1999/xlink">
    <title>com.vivo.vhome_b_s5_1x1_sc</title>
    <defs>
        <path d="M41.49486,2.53211538 L34.3692462,9.65772923 C29.6228562,14.4036369 23.4034985,16.7761085 17.1846231,16.7761085 L17.1846231,16.7761085 C10.9657477,16.7761085 4.74590769,14.4036369 0,9.65772923 L0,9.65772923 C13.0758438,26.76663 36.9466985,30.7553146 53.0094738,15.5756446 L53.0094738,15.5756446 C56.8264569,11.9670185 57.6565085,6.44990077 53.7449931,2.53838538 L53.7449931,2.53838538 C52.0506462,0.844038462 49.83396,0 47.6182385,0 L47.6182385,0 C45.4005877,0 43.1839015,0.845967692 41.49486,2.53211538" id="path-1"></path>
    </defs>
    <g id="com.vivo.vhome" stroke="none" stroke-width="1" fill="none" fill-rule="evenodd">
        <g id="编组备份-3" transform="translate(73.374485, 94.615385)">
            <g id="编组">
                <path d="M53.7449931,36.9530903 C50.35437,33.5624672 44.8714962,33.5769365 41.49486,36.9468203 L34.3692462,44.0719518 C29.6228562,48.8178595 23.4034985,51.1908134 17.1846231,51.1908134 C10.9657477,51.1908134 4.74590769,48.8178595 0,44.0719518 C13.0758438,61.1813349 36.9466985,65.1695372 53.0099562,49.9898672 C56.8264569,46.3817234 57.6560262,40.8641234 53.7449931,36.9530903" id="Fill-1" fill="#FFFFFF"></path>
                <path d="M74.5487566,3.59260459 C71.1639212,6.97695767 71.1639212,12.4646546 74.5487566,15.8490077 C77.7213766,19.0216277 82.7431643,19.2198561 86.1468097,16.4436931 L86.1540443,16.4393523 C87.9511228,15.29146 90.0086474,14.7179961 92.0652074,14.7179961 C94.8789905,14.7175138 97.6937382,15.7916131 99.8419366,17.9398115 C101.989653,20.0875277 103.063752,22.9022754 103.063752,25.7160584 C103.063752,28.5303238 101.989653,31.3445892 99.8419366,33.4927877 C115.069355,19.3139061 97.7067605,-6.68054926 77.2593258,1.59006305 C76.7229997,1.92092613 76.1939082,2.27156382 75.6749451,2.64149382 L75.6720512,2.64438767 C75.2780058,2.92364382 74.9013235,3.23955536 74.5487566,3.59260459" id="Fill-3" fill="#D8E8FF"></path>
            </g>
            <g id="编组" transform="translate(0.000145, 34.414608)">
                <mask id="mask-2" fill="white">
                    <use xlink:href="#path-1"></use>
                </mask>
                <use id="Clip-6" fill="#D8E8FF" xlink:href="#path-1"></use>
            </g>
            <polygon id="Fill-9" fill="#1D2087" points="85.4887491 17.4017352 85.4887491 17.4017352 85.496466 17.3973944"></polygon>
        </g>
    </g>
</svg>