<?xml version="1.0" encoding="UTF-8"?>
<svg width="240px" height="480px" viewBox="0 0 240 480" version="1.1" xmlns="http://www.w3.org/2000/svg" xmlns:xlink="http://www.w3.org/1999/xlink">
    <title>com.android.bbkcalculator_b_s5_1x2_sc</title>
    <g id="com.android.bbkcalculator" stroke="none" stroke-width="1" fill="none" fill-rule="evenodd">
        <g id="编组" transform="translate(47.000000, 156.000000)" fill="#FFFFFF">
            <path d="M32,104 C49.673112,104 64,118.326888 64,136 C64,153.673112 49.673112,168 32,168 C14.326888,168 0,153.673112 0,136 C0,118.326888 14.326888,104 32,104 Z M114,0 C131.673112,0 146,14.326888 146,32 C146,49.673112 131.673112,64 114,64 C96.326888,64 82,49.673112 82,32 C82,14.326888 96.326888,0 114,0 Z M32,0 C49.673112,0 64,14.326888 64,32 C64,49.673112 49.673112,64 32,64 C14.326888,64 0,49.673112 0,32 C0,14.326888 14.326888,0 32,0 Z" id="形状结合" fill-opacity="0.195394449" opacity="0.400000006"></path>
            <path d="M21.7141511,120.283966 C21.926382,120.348293 22.1029233,120.446069 22.4811626,120.824308 L32.0007071,130.342439 L41.5188374,120.824308 C41.8970767,120.446069 42.073618,120.348293 42.2858489,120.283966 C42.4980798,120.21964 42.7151236,120.21964 42.9273545,120.283966 C43.1395854,120.348293 43.3161267,120.446069 43.6943661,120.824308 L47.1756916,124.305634 C47.553931,124.683873 47.6517071,124.860415 47.7160336,125.072645 C47.78036,125.284876 47.78036,125.50192 47.7160336,125.714151 C47.6517071,125.926382 47.553931,126.102923 47.1756916,126.481163 L37.6568542,136 L47.1756916,145.518837 C47.553931,145.897077 47.6517071,146.073618 47.7160336,146.285849 C47.78036,146.49808 47.78036,146.715124 47.7160336,146.927355 C47.6517071,147.139585 47.553931,147.316127 47.1756916,147.694366 L43.6943661,151.175692 C43.3161267,151.553931 43.1395854,151.651707 42.9273545,151.716034 C42.7151236,151.78036 42.4980798,151.78036 42.2858489,151.716034 C42.073618,151.651707 41.8970767,151.553931 41.5188374,151.175692 L31.9992929,141.656147 L22.4811626,151.175692 C22.1029233,151.553931 21.926382,151.651707 21.7141511,151.716034 C21.5019202,151.78036 21.2848764,151.78036 21.0726455,151.716034 C20.8604146,151.651707 20.6838733,151.553931 20.3056339,151.175692 L16.8243084,147.694366 C16.446069,147.316127 16.3482929,147.139585 16.2839664,146.927355 C16.21964,146.715124 16.21964,146.49808 16.2839664,146.285849 C16.3482929,146.073618 16.446069,145.897077 16.8243084,145.518837 L26.3424386,135.999293 L16.8243084,126.481163 C16.446069,126.102923 16.3482929,125.926382 16.2839664,125.714151 C16.21964,125.50192 16.21964,125.284876 16.2839664,125.072645 C16.3482929,124.860415 16.446069,124.683873 16.8243084,124.305634 L20.3056339,120.824308 C20.6838733,120.446069 20.8604146,120.348293 21.0726455,120.283966 C21.2848764,120.21964 21.5019202,120.21964 21.7141511,120.283966 Z M34.4616689,13 C34.9965801,13 35.1905519,13.0556954 35.3861074,13.1602796 C35.581663,13.2648639 35.7351361,13.418337 35.8397204,13.6138926 C35.9443046,13.8094481 36,14.0034199 36,14.5383311 L36,28 L49.4616689,28 C49.9965801,28 50.1905519,28.0556954 50.3861074,28.1602796 C50.581663,28.2648639 50.7351361,28.418337 50.8397204,28.6138926 C50.9443046,28.8094481 51,29.0034199 51,29.5383311 L51,34.4616689 C51,34.9965801 50.9443046,35.1905519 50.8397204,35.3861074 C50.7351361,35.581663 50.581663,35.7351361 50.3861074,35.8397204 C50.1905519,35.9443046 49.9965801,36 49.4616689,36 L35.999,36 L36,49.4616689 C36,49.9965801 35.9443046,50.1905519 35.8397204,50.3861074 C35.7351361,50.581663 35.581663,50.7351361 35.3861074,50.8397204 C35.1905519,50.9443046 34.9965801,51 34.4616689,51 L29.5383311,51 C29.0034199,51 28.8094481,50.9443046 28.6138926,50.8397204 C28.418337,50.7351361 28.2648639,50.581663 28.1602796,50.3861074 C28.0556954,50.1905519 28,49.9965801 28,49.4616689 L27.999,36 L14.5383311,36 C14.0034199,36 13.8094481,35.9443046 13.6138926,35.8397204 C13.418337,35.7351361 13.2648639,35.581663 13.1602796,35.3861074 C13.0556954,35.1905519 13,34.9965801 13,34.4616689 L13,29.5383311 C13,29.0034199 13.0556954,28.8094481 13.1602796,28.6138926 C13.2648639,28.418337 13.418337,28.2648639 13.6138926,28.1602796 C13.8094481,28.0556954 14.0034199,28 14.5383311,28 L28,27.999 L28,14.5383311 C28,14.0034199 28.0556954,13.8094481 28.1602796,13.6138926 C28.2648639,13.418337 28.418337,13.2648639 28.6138926,13.1602796 C28.8094481,13.0556954 29.0034199,13 29.5383311,13 L34.4616689,13 Z M96.5383311,28 L131.461669,28 C131.99658,28 132.190552,28.0556954 132.386107,28.1602796 C132.581663,28.2648639 132.735136,28.418337 132.83972,28.6138926 C132.944305,28.8094481 133,29.0034199 133,29.5383311 L133,34.4616689 C133,34.9965801 132.944305,35.1905519 132.83972,35.3861074 C132.735136,35.581663 132.581663,35.7351361 132.386107,35.8397204 C132.190552,35.9443046 131.99658,36 131.461669,36 L96.5383311,36 C96.0034199,36 95.8094481,35.9443046 95.6138926,35.8397204 C95.418337,35.7351361 95.2648639,35.581663 95.1602796,35.3861074 C95.0556954,35.1905519 95,34.9965801 95,34.4616689 L95,29.5383311 C95,29.0034199 95.0556954,28.8094481 95.1602796,28.6138926 C95.2648639,28.418337 95.418337,28.2648639 95.6138926,28.1602796 C95.8094481,28.0556954 96.0034199,28 96.5383311,28 Z" id="形状结合"></path>
        </g>
    </g>
</svg>