<?xml version="1.0" encoding="UTF-8"?>
<svg width="240px" height="240px" viewBox="0 0 240 240" version="1.1" xmlns="http://www.w3.org/2000/svg" xmlns:xlink="http://www.w3.org/1999/xlink">
    <title>com.android.bbk.lockscreen_b_s6_1x1_mc</title>
    <g id="com.android.bbk.lockscreen" stroke="none" stroke-width="1" fill="none" fill-rule="evenodd">
        <g id="编组-9" transform="translate(46.465116, 46.465116)" fill="#BEBEBE">
            <circle id="尺寸" opacity="0.100000001" cx="73.5348837" cy="73.5348837" r="73.5348837"></circle>
            <path d="M73.5348837,10.8139535 C108.174697,10.8139535 136.255814,38.8950705 136.255814,73.5348837 C136.255814,108.174697 108.174697,136.255814 73.5348837,136.255814 C38.8950705,136.255814 10.8139535,108.174697 10.8139535,73.5348837 C10.8139535,38.8950705 38.8950705,10.8139535 73.5348837,10.8139535 Z M73.5348837,17.2109401 C42.4280286,17.2109401 17.2109401,42.4280286 17.2109401,73.5348837 C17.2109401,104.641739 42.4280286,129.858827 73.5348837,129.858827 C104.641739,129.858827 129.858827,104.641739 129.858827,73.5348837 C129.858827,42.4280286 104.641739,17.2109401 73.5348837,17.2109401 Z" id="形状结合"></path>
        </g>
    </g>
</svg>