{
	"param01001": {
		"cureent_mode": "zhuanyemoshi_dc_acl0",
		"param_golden_value": [313,315,320,330,340,340,350],
		"param_section": [108,248,388,448,1208,1808],
		"red": [
			[-0.4073640043042088,-10.19030252998685,-27.99864541032509,400.2193233142096,-2.286597506730097,-489.5564891490141,-1286.068971827669],
			[-0.0004096477028813282,-0.01990861129539812,0.07374098780305965,-2.540597051540179,-0.001219810295170116,0.04364823103825505,-1.945134858613165],
			[5.075466486403978e-05,6.985191839434861e-05,0.0001355350456191516,-0.0004768100804417224,0.0002195196392373545,-5.192923076961689e-05,-0.001779366799747375],
			[-1.381860633089546e-07,-2.26951954513112e-07,-8.449771520608958e-07,-1.21594154450807e-06,-8.290236078081463e-07,-3.45706237476616e-07,3.127370569110615e-06],
			[2.017582757295027e-10,4.530660478652224e-10,1.17514589269875e-09,1.203066395828881e-09,1.141639291917579e-09,6.21446932647255e-10,-3.353132344172258e-09],
			[-0.0071704274541829,-6.000600595291097,-9.521411550082465,17.25835034698228,0.005658296153870392,-0.08338913847111418,44.17297771967644],
			[-4.002785233485141e-05,0.0002662339701333384,-0.0006731726408733796,0.01840932497414828,7.212311220098735e-05,-1.600504435477367e-05,0.003210681932002177],
			[1.973824433948766e-07,2.083606465652755e-07,1.040704904077287e-07,3.227704363041223e-06,2.522799111320547e-07,5.114634546928559e-07,1.798819229310631e-06],
			[-1.840627558327912e-10,-9.551433243989715e-10,4.011797046218538e-10,1.30148624864219e-09,5.249418779811099e-10,4.345888621573984e-10,-3.882405968280182e-10],
			[-0.0003432349475573071,-0.008757444915093964,0.0001606458668629118,0.1730382914831549,-2.012775430520598e-05,-0.0009914135627375679,-0.001275997211049855],
			[9.766733252837505e-07,-9.382295258119245e-07,2.362367401762215e-06,-4.411656509052187e-05,-2.923631593264298e-08,1.773145453754845e-08,-1.709718099854437e-06],
			[6.818689169301255e-10,1.29337374974087e-09,8.314218258213666e-10,-3.138378895187803e-09,6.989008332102345e-11,1.437324112778609e-12,-2.671540337878911e-10],
			[1.279925694491648e-05,0.000321020420416985,-0.0001054668176420264,0.000389757421328788,5.993285179088769e-08,8.047535267465752e-06,1.404127635036599e-06],
			[-6.708812809947512e-09,1.39912716480572e-09,-2.478458974564724e-09,3.533607714775272e-08,1.407049575248793e-12,-3.488155242960091e-12,3.023638917878492e-10],
			[-1.106239845811921e-08,-4.533216731323437e-07,-6.439239106370172e-07,0.06923617710021095,3.976934837932246e-11,0.008636905098032173,0.0001716232806220684],
			[-0.0001180958224272083,-0.01002036117329619,0.06994097358883296,0.005077648616327964,-0.00403170967906709,0.3004000745239168,-2.517237945370959],
			[7.127721562451701e-05,6.63831179463275e-05,8.593841863182349e-05,-0.0006816226852368498,0.0002105643468290886,-0.0002161823478707806,-0.0008979587950955674],
			[-2.855404412348961e-07,-2.335056294687002e-07,-4.080604028236195e-07,-9.324983779039253e-07,-5.848578906857147e-07,1.715157901234187e-07,1.936827102093734e-06],
			[4.789303215957485e-10,4.266365315260646e-10,5.663551708649671e-10,6.311079006307861e-10,6.353441832096184e-10,-1.985628064994925e-10,-3.337719224445572e-09],
			[-0.04623597326947938,-1.901036897019267,1.210508684281429,-16.71789649934155,0.00139644674893215,7.156276857464625,9301.222675452083],
			[-5.670669613217161e-06,0.0001634568922551665,-0.0006257959363899747,0.0001282315660580025,8.551675488526161e-05,-0.0005125474126861486,0.004033255757434091],
			[-2.327086782374541e-09,-6.259258172015453e-08,-1.448784166263987e-07,3.8622121883756e-06,1.623743223019266e-07,6.052568023507982e-07,1.022605472289444e-06],
			[1.601250538492492e-10,-3.011140864357127e-10,3.194586091981736e-10,1.581051773906156e-09,7.733832467130509e-10,5.891368660315276e-10,4.789330682244522e-10],
			[-0.0003581867928558469,0.009475454281910364,-0.0149466914027997,-0.3534982170280088,-8.813926000079552e-05,0.0003956366831403046,-0.0005426997062336023],
			[6.578380732587012e-07,-4.191341214519471e-07,2.3057503506211e-06,-3.530233241416572e-07,-3.542748136787495e-08,3.425824516195268e-07,-2.099219962209313e-06],
			[1.335001748291348e-09,1.777143205554383e-09,1.505520406698587e-09,-3.738373508671218e-09,1.312251892826767e-10,-1.184711499757035e-11,-1.05601575920591e-10],
			[-3.326747871788958e-06,-0.0003215967190526484,0.0001074483205218711,-2.12665351994705e-05,-3.891829005254662e-08,-3.508011294860162e-06,-6.597301150366209e-07],
			[-5.777982623120434e-09,5.221647745726963e-10,-2.563920456968145e-09,4.282041968591072e-10,-2.685817503455287e-14,-7.400374173781101e-11,3.63957318705915e-10],
			[8.131735991161421e-11,-8.401350739485854e-07,3.801701395259874e-07,5.949774002433375e-08,-7.643948644809728e-12,2.015639486037529e-09,-2.627425134569246e-10],
			[0.001698426771724675,0.004098759915061156,0.03375238945979503,-0.6540848415410399,0.003759334418250203,0.05589336411108681,-1.940019761921084],
			[-6.542830582310887e-06,-3.471609234021709e-05,-2.522600451757481e-05,2.633423514708814e-05,-1.991755914486549e-05,-4.063714584212987e-05,-0.0001390275343557386],
			[2.076702220237719e-08,1.191568809709212e-07,5.594982054756003e-08,2.276267406164544e-07,2.340181833464678e-07,2.508456750469097e-07,4.583513813996701e-07],
			[-8.468939044995148e-12,-1.62086891176963e-10,-1.858642138475144e-10,-5.524484484891887e-10,-4.786358434260803e-10,-6.275012859071442e-10,-9.643999246319448e-10],
			[0.06719066686194648,8.150369481879428,8.64590346552141,-4.761842749243788,0.007898247948978351,-5.737103810514171,-9342.763136831038],
			[-4.201660848955942e-05,-3.53536422499826e-05,-0.0002968682139692062,0.004563540434639298,1.818646914052509e-06,-0.000100012222246817,0.003046757543641096],
			[9.615458754752521e-08,2.119401990169757e-07,1.147526137846481e-07,-2.809435195442101e-07,1.6730526466979e-07,1.627193177767463e-07,2.332093571433121e-07],
			[-2.925307125370353e-11,-1.750273177797571e-10,2.005105000988046e-10,2.212566366594088e-10,1.240415026843392e-10,1.898859494425739e-10,1.776571852875044e-10],
			[0.0001952476739073658,-0.003026943114319667,0.01323925016819085,0.1969417040477135,6.914393941091444e-05,-0.0007632172501433265,-0.0002041967261644773],
			[3.108336709297999e-07,1.215368256855691e-07,9.150437792640832e-07,-1.049657404033257e-05,2.940565575684682e-09,6.773512297330167e-08,-1.585233207496441e-06],
			[-1.638024885029901e-10,1.787644494936992e-10,2.923716185901397e-10,7.809636506340696e-10,1.105880685104866e-11,6.810468162580991e-12,-1.360595230485944e-11],
			[-3.089827815790722e-06,9.726076333617585e-06,1.177136882472097e-06,-0.0003968376926172338,1.591544001733946e-08,-3.929573345073133e-06,-5.307057383083904e-08],
			[-9.432543998221572e-10,-1.222674199921078e-10,-9.237364868108031e-10,8.014721572613049e-09,-3.166385197300555e-12,-1.499119100214074e-11,2.746411010123471e-10],
			[-1.411708533025472e-08,1.280318578807361e-06,2.613533446068858e-07,-0.06923621845183074,-4.376091120090268e-11,-0.008636907215566175,-0.0001716231065299558],
			[-1.310649283941658e-07,-2.045817623430131e-07,-4.775136936542981e-07,-5.432026738131936e-07,-4.286174012327648e-07,-2.609722497413282e-07,-1.915790510154747e-07],
			[1.317382473652602e-07,-1.522037914321886e-08,-5.836702229753298e-08,-9.508163544320555e-08,-6.626068084158935e-08,-4.395048234779743e-08,-5.201282889364626e-08],
			[1.641889631345769e-07,1.859632530016462e-09,-6.143105283777987e-08,-9.656431229383641e-08,-8.694773283239215e-08,-5.9191588637772e-08,-4.408205484113694e-08],
			[-2.794745864420312e-10,2.234152723576801e-10,5.68901036495138e-10,5.933447407835769e-10,4.552728937252732e-10,3.285419320714321e-10,2.221269402436298e-10],
			[-4.064367403498422e-10,-4.620897003652804e-12,2.373556040313719e-10,3.721001392117485e-10,3.288505959091046e-10,2.661097708407223e-10,2.138546037045834e-10],
			[1.865554529862418e-09,-3.313730441912298e-10,1.523380361865129e-10,2.094488056650352e-10,1.174118559585335e-10,2.500041337709749e-11,9.423914027742913e-12],
			[1.030791549850664e-10,-7.599012842821562e-11,-9.438246502958278e-11,-1.170069197671886e-10,-6.437394717150074e-11,-3.238878644493718e-11,-1.738004220347487e-11],
			[-4.388461876593266e-10,-5.024422292329201e-12,5.456706047475037e-11,6.573088616101096e-11,7.487542096638363e-11,6.595249348165317e-11,6.072605477303041e-11],
			[-2.401149846582591e-10,-6.755852813352898e-11,1.034001115655483e-11,9.346347313906553e-11,1.951274211082634e-11,3.457786336252498e-12,7.687535390072049e-12],
			[-2.886400018115035e-10,1.307590987105464e-11,1.47681417928665e-10,1.867440662053628e-10,1.45006540832916e-10,1.148132715830813e-10,7.588821968001587e-11],
			[-1.761131897019953e-10,-1.745042539526001e-10,-1.885694453098343e-10,-1.388636618749335e-10,-7.188836218225712e-11,-2.325195695746028e-11,-1.981120819188805e-11],
			[-2.711109763998142e-10,-8.636487856055157e-11,4.20417233579048e-12,2.505319082276499e-11,2.481507727466573e-11,5.147316108103466e-12,3.026532799409203e-12],
			[-2.842077695176751e-10,1.871758329245932e-10,2.711709512399509e-10,3.082324451303012e-10,2.067791194902267e-10,1.361349724558751e-10,1.184572613283473e-10]
		],
		"green": [
			[-0.2376589894885211,-2.823499159167577,-12.25386032579781,125.3142442800882,-1.831151306683474,-373.8710602941064,-724.6640232122189],
			[0.0007554071512191189,0.001883794090708283,0.01284032360362422,-0.7191337640041564,-0.0001771608147914032,0.003198954192374758,1.248381346782667],
			[-3.5173088512245e-06,-3.123842200741978e-05,9.548107469498643e-06,-0.0001671065947878195,1.706596601758651e-05,4.242207574652106e-05,-0.0007558401553143859],
			[2.276526587628921e-08,9.073542527324235e-08,-2.688221190007737e-08,-1.660724201928453e-07,-3.144598221267315e-08,-8.056257980185402e-08,2.159364919293978e-07],
			[-4.440649051214963e-11,-1.478491096732416e-10,9.988372103258765e-12,5.689786248884673e-11,3.534454373505668e-11,1.032744232066877e-10,-3.800602594615364e-10],
			[0.0771457301914292,-2.185218775620341,1.925090780744119,6.729197950955506,0.005943206272283369,-0.04795441958271511,30.22973456948505],
			[-6.021853584803296e-05,-5.127897096456635e-05,-0.0001373537168563518,0.005223335746778041,1.188282150834697e-05,-2.373143852858098e-06,-0.001856466941961888],
			[1.837951443965687e-08,2.764795033038302e-07,1.41944401909692e-08,9.538571542400482e-07,8.717037624677944e-08,4.573751635402721e-08,8.555834751754869e-07],
			[3.10145671120859e-11,-1.304612115865228e-10,3.605612484936975e-11,2.963975536498191e-10,5.105975060083293e-11,8.930138444845392e-11,5.662412476269422e-11],
			[0.001717487777763183,-0.003135924086168828,-6.570802159387459e-05,0.06607556585009904,-3.661449662635249e-05,-0.0007387815007488118,-0.001068269468320111],
			[7.749633645803256e-07,1.52959605235845e-07,4.70242034028597e-07,-1.26152749127744e-05,-9.087892084597118e-09,6.732877392695084e-09,9.223136996788684e-07],
			[-3.786796571112654e-10,-2.75455611311322e-10,2.310659372842863e-10,-9.518875102690727e-10,9.582975462768778e-12,1.990394222446036e-11,-1.945356905572362e-10],
			[3.650259032206179e-06,0.0001176838482852421,-7.787610569779464e-07,0.0001098347166087099,6.781327178264021e-08,5.975777786816036e-06,6.635394379081546e-07],
			[-2.572763998771027e-09,7.788245193306288e-13,-4.920681042211806e-10,1.014942147309786e-08,1.989432525808322e-12,-2.368300461916135e-12,-1.520724930938801e-10],
			[1.418936402692231e-08,-1.63588378878673e-07,1.249986433801026e-07,0.06088904173199739,-5.594546761702789e-11,0.001009383669048825,-0.0006593340092738083],
			[0.009481000639962055,-0.03782077950375205,0.1135024536634484,-0.02993774968555708,-0.01438980036286283,0.3654341525946028,-2.863254928667784],
			[-0.0001900012989763211,0.0001265533298076031,0.0001481709921641652,-0.0003833156260655246,0.0003606059868113368,-0.0002461011221688595,-0.0003485928563585036],
			[1.10456862999685e-06,-2.229999421079935e-07,-7.509608934759943e-07,-1.482785408214323e-06,-1.194867485464886e-06,-8.396596430291269e-08,2.578233758529845e-06],
			[-1.703364585977919e-09,4.297350473371336e-10,1.086362090986727e-09,1.007563089507564e-09,1.514607189411204e-09,2.828444061143636e-10,-4.274428720760309e-09],
			[-0.09491119476730767,-0.7341092362644032,-0.159755121802447,-4.415846176984795,-0.004341111383287095,5.388396711692488,4278.936270206781],
			[-0.0001388459005739024,0.0003709059943430418,-0.00117840279231095,8.12134096318385e-05,5.450964048750972e-05,-0.0006544908856577792,0.004447061763171673],
			[1.041937433907496e-06,-4.421736743419967e-07,-1.092343174760735e-07,2.897544529406888e-06,1.683044982263167e-07,7.665750377988079e-07,4.319447340694379e-07],
			[-2.937879387212344e-09,-6.25778722146374e-10,5.047969712557641e-10,2.498667696578428e-09,1.150698386337067e-09,9.009583486369797e-10,6.808407020212261e-10],
			[-0.003197010096941508,0.003185570566373909,0.001983433421722342,-0.1132402684081075,-7.120959567724649e-05,0.0002847125551518581,-0.0004171088073594274],
			[3.792711807611846e-07,-1.472739888816355e-06,3.938804310872372e-06,1.013200622461384e-07,-1.315109213737093e-08,4.228307776314251e-07,-2.25542047009696e-06],
			[2.676190098559792e-09,3.437444760632544e-09,1.792328000765695e-09,-2.533815202091184e-09,1.806940933582397e-10,-1.456896443340901e-11,9.509881469898402e-11],
			[8.64679801972791e-06,-0.0001173556949730191,-1.731881770809075e-05,-1.554809482326338e-05,-6.154263514622881e-08,-2.606725973560868e-06,-3.779955468020489e-07],
			[-2.432276558896102e-09,2.01094600938035e-09,-4.210891883949841e-09,-1.811471101728643e-10,-6.365506383430322e-12,-8.983001843530174e-11,3.799381311020854e-10],
			[-5.512589221767517e-09,-3.126367644289303e-07,-1.308145258855569e-08,4.210569336926453e-08,-1.32607013702154e-11,1.495552746964803e-09,-3.173076736828196e-10],
			[0.0002501035212093567,-0.002412913888433909,0.00332602458855283,-0.1012560543177364,-0.0005694165500886583,0.05274723967038744,-0.8800391428472206],
			[1.903089350185806e-06,-4.975268450221412e-06,-2.405550277896022e-05,1.033466700887467e-05,-3.220208464777972e-07,-1.66553958096346e-05,-0.0001485474649643861],
			[-9.227720060298917e-09,7.411601399080204e-09,8.678333791946347e-08,1.385524338453201e-07,7.579820777511375e-08,9.484660315880702e-08,3.157609372900611e-07],
			[2.000450557298672e-11,-2.191019371655436e-11,-1.050377507665903e-10,-1.608756633800372e-10,-1.821989557324598e-10,-2.093427025749761e-10,-5.95312465844526e-10],
			[0.03706370555719445,3.015992684849046,-1.621959031906346,-4.09188379033619,0.008108648365819583,-4.335206806046432,-4307.82922401257],
			[-2.757181769673329e-05,2.618328737366344e-05,-3.061024062095036e-05,0.0006289389067395349,5.55228045334792e-06,-0.0001025878737287237,0.001387471532186523],
			[-7.205164369901417e-08,2.012635642624934e-08,4.451841969082229e-08,-1.980457576212475e-07,6.596720919438283e-08,8.14647781048372e-08,1.781280862105111e-07],
			[1.196387746844701e-10,9.553452166632221e-11,-3.172169093808444e-11,-8.288982669957834e-11,9.023538913198751e-11,9.06512542927232e-11,7.953287162067486e-11],
			[0.001044443298536922,-0.001070853911026668,-0.002551950201803998,0.05561641603999122,8.375212204862928e-05,-0.0005551516300749768,0.000574899680141672],
			[4.625716710678431e-07,-1.860141585626303e-07,9.797973938725971e-08,-1.226474513658331e-06,-5.100219803070706e-09,6.810147184021565e-08,-7.24117776583661e-07],
			[1.420798320514009e-10,1.103101112107893e-10,2.230480471923783e-10,5.796169906722698e-10,1.063643396205813e-11,3.623141489603687e-12,-1.955310153018834e-11],
			[-7.886410496370943e-06,4.028460782699218e-06,1.931435713715011e-05,-0.0001110668337024464,1.645946953083315e-08,-2.92169298018843e-06,-1.587138801050121e-08],
			[-1.995939098383474e-09,4.219476258929392e-10,-1.106489325292764e-10,7.235951084506152e-10,1.182502525275489e-12,-1.475046631653315e-11,1.25686166690736e-10],
			[-2.492300080372671e-08,4.696295563199911e-07,-1.127731491563465e-07,-0.06088907183512258,6.191299238739497e-11,-0.001009385238470472,0.0006593342975074875],
			[2.497900048290293e-07,2.465870329825175e-07,-3.202891077911783e-08,-7.337168143601115e-08,-1.155910492046123e-07,-8.29457014928899e-08,-7.694228998753947e-08],
			[1.811875835086914e-07,1.439806473429229e-07,7.862583119310838e-09,-9.115294678182587e-09,-2.940211229394284e-08,-2.242124322997611e-08,-2.50001269126534e-08],
			[3.512205906001145e-09,7.530363428166219e-08,4.129754379235034e-08,1.639041601472536e-08,1.663041907846344e-09,-2.171076129379877e-09,-3.383382564320536e-09],
			[3.995914950092886e-10,-1.367536462953214e-10,-4.059735076208455e-11,-5.306360593592847e-11,6.557542470604884e-12,2.837572028861249e-11,1.648099415225207e-11],
			[-5.661374544266387e-10,-2.577600597163695e-10,7.336813170620413e-11,1.916763180053358e-10,2.200692635208825e-10,1.864825284248997e-10,1.750094401676843e-10],
			[-1.389117795587293e-09,-7.217048466476824e-10,-5.406713391056537e-11,-2.203773477868519e-11,3.019044794777718e-11,5.732086362482543e-12,5.904331174884778e-12],
			[1.11094141683898e-10,9.198542535031512e-12,-8.644386821601849e-12,-3.376788783003952e-12,1.129031340342212e-11,1.862448796537757e-11,1.692700876067673e-11],
			[-3.907362696089148e-10,-2.177622493960672e-10,-2.733202659710492e-11,1.934175234512779e-11,4.209312952162237e-11,5.653960654030869e-11,5.133847270757572e-11],
			[-8.012773016670658e-10,-3.382695299695894e-10,-1.500477358609e-11,-1.246866042926257e-11,7.914111564343239e-12,-1.931436687075735e-12,6.36988744796171e-13],
			[-5.401354866578264e-12,-1.048237513892013e-10,-3.377457995740049e-11,-3.336805578147805e-11,-1.565800903676045e-11,-1.521957773046451e-11,-1.253326328361616e-11],
			[6.620740676004742e-11,-2.522800294264143e-11,-5.745374187318054e-11,-5.82694574404836e-11,-2.02853925418105e-11,-5.659605984584793e-12,-3.400647959656817e-12],
			[-1.232996288525777e-10,-7.506752740704234e-11,-5.802909334709517e-11,3.792826733121501e-12,1.877303379235329e-12,1.570343879393069e-12,1.753953841485904e-12],
			[5.168095142921772e-11,-1.313126524523573e-10,-6.228396202167768e-13,1.968054296961973e-11,2.259862138480559e-11,2.021224848050066e-11,1.787553736687053e-11]
		],
		"blue": [
			[0.03970904440956781,-1.738573203768669,-8.082043419282591,109.0658053090661,-1.58301750273703,-214.3613802453832,-617.7989068059028],
			[-0.0002533745482444432,-0.002264315620677934,-0.003030207739663757,-0.8503064505406807,-0.0001238371231187425,0.01163871706827656,0.3534142627067146],
			[3.52737582057497e-06,2.872489117955699e-06,-4.157985267502812e-06,-0.0001650054535586454,1.158239731810085e-05,-4.134340405572134e-05,-0.0007717930158229133],
			[-1.611137451164286e-08,-2.519669764961214e-08,1.738677943212737e-08,-3.112554305667288e-08,-3.498775431962875e-08,5.498575507396964e-09,2.718420139793397e-07],
			[2.492510825977087e-11,8.253895098324859e-11,2.60325082433862e-11,4.268498988289795e-11,3.250559279421515e-11,-2.559344494490652e-11,-3.041982852249162e-10],
			[0.04540856880283166,-2.008143394007895,0.1655140334431446,-13.65594835842484,0.01348586302918237,-0.09902895628920561,37.97716049910121],
			[3.587018080750735e-05,1.564124542385994e-06,1.864837529367939e-05,0.006223788970578631,5.954260002340317e-06,-1.01830557620913e-05,-0.0004538135893455206],
			[-1.130883770648795e-07,1.684854495233686e-08,3.206415706289897e-08,8.296778282798999e-07,4.767503321213416e-08,9.789614603127102e-08,8.093361068361893e-07],
			[1.124857650067307e-10,-9.213151186410391e-11,-1.118958296040761e-10,4.081300662394397e-12,5.099256639267354e-11,5.252976963928239e-11,-1.638897206742322e-11],
			[0.0006361502411040711,-0.002621565112426416,-4.972203537110016e-05,0.04829055525408848,-9.196870201401288e-06,-0.0004235951978160008,-0.0009176949080395909],
			[-1.988807559267063e-07,-3.697425097529679e-08,-4.608635677959932e-08,-1.514914405112545e-05,-5.954406651976531e-09,2.498375030407213e-09,1.899647534840835e-07],
			[4.099381887085193e-10,2.114379749583463e-10,1.802943734036653e-10,-8.374096279217109e-10,-2.710341475173275e-13,-1.272365292696957e-11,-1.898639023590129e-10],
			[1.55919547043136e-06,0.0001001159609237697,-6.330152264154221e-06,0.0002415521393055367,5.436564711979795e-08,3.45277812755356e-06,7.523214107011248e-07],
			[-3.249061722420808e-12,1.24686531043491e-10,2.712345421803206e-11,1.226962887285433e-08,2.411455113151142e-12,4.558362661759576e-13,-2.513529601071044e-11],
			[1.111773889606349e-08,-1.443584369166684e-07,1.101214953948752e-08,0.008481144726211653,2.077158978610535e-12,0.001250532743330488,-0.0002029146030740867],
			[-0.002617129757405714,-0.01660787384624374,0.04821526189943538,-0.008367606292883235,-0.005274156409637546,0.1314800655648898,-0.7511805242168418],
			[3.325154742712573e-05,-7.289534114825697e-05,3.799546653600452e-05,-0.0003385169422361893,0.0001131228751273623,-8.586767914901548e-05,-0.0003953328352149014],
			[-1.509280815101594e-07,2.887765161547481e-07,-2.473247563413048e-07,-4.390548985511863e-07,-3.418829703017195e-07,8.03246036711512e-09,9.419270829396463e-07],
			[2.297041640347397e-10,-2.250284548336268e-10,3.312314375224575e-10,2.975723040210555e-10,3.77129878331781e-10,-1.434051284530213e-11,-1.622229389815213e-09],
			[-0.02193098735982817,-0.5174587323192439,0.04760060744343823,-11.45219161912018,-0.001153334585892506,3.140565413851326,5605.724131858591],
			[0.0001709562253019237,0.0002497377820735544,-0.0004974935770639881,7.256601575354784e-05,2.002644546005879e-05,-0.0002378488611956695,0.001200085686391873],
			[-8.237713565880972e-07,4.781773319677739e-07,4.087872663812251e-08,1.949608985262945e-06,7.345266657307798e-08,2.693365778163354e-07,4.384510939899102e-07],
			[1.212656535840281e-09,-1.078833222719843e-09,2.185524696205074e-10,7.51639674521591e-10,4.026308805002225e-10,3.238951253290224e-10,2.476006758735618e-10],
			[0.001757462983057774,0.002826308085213728,-0.0001565322935225036,-0.1708756810963486,-5.206676375759913e-05,0.0003137420442442387,-0.0004531777018648185],
			[-1.089009580032217e-06,-1.544043934252709e-06,1.606044972061129e-06,-2.152277897775099e-07,-8.490986049251004e-09,1.533348746334099e-07,-6.233189867290031e-07],
			[2.521675611913144e-09,3.62501080146649e-10,5.150444687862473e-10,-1.946277340873423e-09,5.939678394575176e-11,-3.108043598952322e-12,-3.926515459345734e-11],
			[-1.803029344224268e-05,-0.0001001531288402714,-5.152894989704745e-07,1.081587993009717e-05,-4.463682513484189e-08,-1.537347521006978e-06,-4.916469910546586e-07],
			[1.436218688011798e-09,2.967127795669159e-09,-1.672813878711562e-09,2.355608762201307e-10,-1.733975694182485e-13,-3.252725339053196e-11,1.07476468696046e-10],
			[1.168336815988281e-08,-2.691440795789732e-07,1.861473903685238e-08,-2.370951669753772e-07,9.635645916929029e-12,8.75406833345516e-10,-2.894798200020763e-10],
			[-0.0004976816746459611,0.01077163535977426,0.03912764177466174,-1.269590341391087,-1.655657171859264e-05,0.07931060825908957,-1.111816514696484],
			[6.314359025759276e-06,-8.776902709394917e-05,7.437295272307152e-06,-0.0002831729278381406,2.341864092265989e-05,7.457330620005487e-06,-0.0004333600261694449],
			[-2.540832420569951e-08,2.222403477663596e-07,-9.118376458791103e-08,-1.264156799654099e-08,2.42542489771916e-09,-9.429459980986196e-08,-2.358834504895598e-07],
			[3.357464513572667e-11,-2.144245775527937e-10,3.501822205379535e-11,-1.454026834285479e-10,-5.516500069373548e-11,4.851349652978186e-11,-4.032366484107376e-10],
			[-0.03105976261171885,2.590342389540102,-0.1222913485250943,24.27852575009053,-0.005093581457788276,-2.464914157695935,-5642.568595751673],
			[8.489836601340003e-05,-0.0001633591185442304,-0.0003925532253816061,0.009188887141451966,-3.445386032263098e-06,-0.0001564965425247439,0.001784159569184636],
			[-3.159990438163505e-07,6.09385277231321e-07,1.009172456612556e-08,1.334179871444563e-06,1.791271225367305e-07,1.963408586811965e-07,6.941463005816825e-07],
			[3.65330850085608e-10,-5.635117589783329e-10,3.166153513542354e-10,3.315901460317895e-10,1.817119496332095e-10,2.479458336207446e-10,4.443808158215786e-10],
			[-0.002363999283380163,-0.000890331629118744,-0.0001775754098812775,0.1247381599118104,4.513477434040712e-05,-0.0004700039136629679,0.000602260007122893],
			[-5.462335853178828e-07,5.226249448245597e-07,1.224552954662119e-06,-2.215038659000412e-05,5.649924847937224e-09,1.031302665849311e-07,-9.535571220482562e-07],
			[1.162515995842813e-09,-4.476763119403259e-10,5.09857080912952e-10,-1.065581461193204e-09,2.29480280728215e-11,1.192316072482721e-11,-1.39423264761419e-10],
			[1.699611482033168e-05,3.005114109499794e-06,7.547266220402546e-06,-0.000254424293737967,4.882093848739945e-09,-1.657831848202085e-06,-3.293080450932666e-08],
			[4.19750740313089e-10,-3.98962449159782e-10,-1.264510116106207e-09,1.777015695744988e-08,-3.254546695306958e-12,-2.253208776641393e-11,1.701848736941589e-10],
			[-2.566341114690508e-08,4.088813892624747e-07,-3.009441053276104e-08,-0.008480907259591006,-1.636100894818401e-11,-0.00125053366138869,0.0002029148678193758],
			[-2.817406160379604e-07,1.69481072911994e-07,2.789306065212635e-08,-4.851743168008455e-08,-3.981825225729872e-08,-2.535563731308767e-08,-3.199774619139013e-08],
			[-6.568573164835964e-07,2.721697770026603e-07,5.237148664517792e-08,6.259630140401103e-10,-1.69557836976297e-08,-1.945037343514812e-08,-2.067711419473154e-08],
			[-1.00157798212623e-07,1.187473893717819e-07,4.749513906714919e-08,2.164486498734677e-08,2.010434590510461e-10,-4.690323177863803e-09,-1.009102349327286e-08],
			[2.828869969577219e-10,-1.213224160615489e-11,-4.476013287050294e-11,-1.438489182107766e-11,1.154632095479635e-11,1.543400157928205e-11,1.312371436893019e-11],
			[4.820359932283304e-10,-1.801184363594963e-10,-1.991408997780056e-11,2.763601861069697e-11,5.684942284536713e-11,5.09764099008761e-11,4.475391359570267e-11],
			[9.312101272316152e-10,-3.72262482787835e-10,-5.469682472679857e-11,7.025267202092862e-11,1.262257622568716e-11,4.939148482074053e-13,5.612946948792301e-12],
			[8.372651782790216e-10,-1.193442092394464e-10,-4.706959815046807e-11,-1.090861147911632e-11,1.884504304043957e-11,3.591456291219712e-11,4.72231346077021e-11],
			[1.129659390496524e-09,-1.509937314139719e-10,-2.880067161975523e-11,1.452909672785757e-11,2.385815439599423e-11,2.93552222714582e-11,2.829745397744223e-11],
			[2.338155825309292e-09,-7.2035125541613e-10,-7.418496368808037e-11,-8.575382836216768e-12,3.698166902809198e-12,4.415145409571913e-13,4.789535589156884e-14],
			[9.547230400934168e-11,3.294060471070247e-12,-4.162622348579635e-11,1.403775924213663e-11,2.076378893747815e-12,1.659367614383437e-12,1.920775343838353e-12],
			[9.76590368659565e-11,-9.270767259328964e-11,-5.552898256378121e-11,-4.871141671884246e-11,-1.362228094641178e-11,6.141548591023772e-12,1.421709553372281e-11],
			[3.140362418076517e-10,-2.089837472813256e-10,-4.203441501942991e-11,-3.306232898512791e-11,1.484483203291669e-12,9.7981418031585e-13,2.883134734300426e-12],
			[3.798898467525041e-10,-2.838195771159258e-10,-6.50781924987353e-11,-1.441518521658371e-11,3.86503507758223e-12,8.436042818363122e-12,5.660552461623174e-12]
		],
		"ir": [
			[-0.5603047256857211,-18.09069111611349,-44.0789398982734,466.9784725704814,-3.932844336319425,-981.0728868588187,-2006.470041530232],
			[-0.000696533900832734,-0.01973512347888218,0.1422910126347883,-3.1185472213684,-0.002127205633744187,0.06260053604530162,-3.540926101944252],
			[7.856165956400035e-05,6.102750956302799e-05,7.637594532999918e-05,-0.001044267984561854,0.0002457866847473974,-0.0001025994422743711,-0.004125942664889613],
			[-2.66828392458526e-07,-2.078104159012009e-07,-8.294158612058883e-07,-1.601561851867782e-06,-8.206955023403764e-07,-2.850304722262186e-07,5.080396767762822e-06],
			[3.861946705784071e-10,4.280816309159992e-10,1.187669755887736e-09,1.220955410407506e-09,1.068817019895925e-09,3.693982516306214e-10,-5.283475301114604e-09],
			[0.0001650420473927744,-10.45495991281451,-10.08312574687942,-13.66960702863883,0.01294636523159295,-0.1708302052132357,11.97265663081263],
			[-5.044939810617057e-05,0.0002781440592492154,-0.001267621843358661,0.02283514709822683,9.398596665497142e-05,-3.140281736577335e-05,0.005959326676380477],
			[1.241312917007776e-07,3.462388819108714e-07,4.181079486428182e-07,6.220959057706772e-06,4.135480328982764e-07,7.454225900505655e-07,4.123266657976985e-06],
			[3.32103663578772e-10,-1.051079719102664e-09,3.735281418874144e-10,2.27135024968921e-09,7.491556377706589e-10,7.448720085575258e-10,-6.608770678546706e-10],
			[-0.0003704320274171146,-0.01517687774459826,0.0001966081588618131,0.2200307459389124,-5.746961909956254e-05,-0.00196882722431067,-0.0007313757204884612],
			[1.477297461112249e-06,-1.003197369633806e-06,4.157178418663024e-06,-5.533339093739434e-05,-4.515543318542305e-08,2.509325685758539e-08,-3.253242826839063e-06],
			[1.29068390694947e-10,1.581376182019403e-09,1.073842367910107e-09,-6.407710874478503e-09,1.087845164267319e-10,4.564594205634603e-12,-7.557536488865815e-10],
			[1.349146315113018e-05,0.0005597300444214857,-0.0001275062312991685,0.0006777183597324943,1.45378987389492e-07,1.596809460376076e-05,1.322581273167728e-06],
			[-9.09862320487794e-09,1.642060687457008e-09,-4.259772849170026e-09,4.480890775011249e-08,3.898824413930123e-12,-4.300107954889148e-12,5.876792315598287e-10],
			[-2.124896077663917e-08,-7.925848322195157e-07,-6.822009894442921e-07,0.1252526882172161,-9.643172887581025e-12,0.01346529174751711,-0.0003885300132709383],
			[0.001503698052890978,-0.0141327239231795,0.1984860810344767,-0.008384289386330535,-0.01650763494020356,0.6696567010398308,-5.773262688720969],
			[0.0001061615214319623,5.06106683172427e-05,0.000168913107726759,-0.001414514850145032,0.0005497317139072072,-0.0004330734474054753,-0.002075660689520089],
			[-4.309168964006481e-07,-2.041515707300399e-07,-1.183321172169218e-06,-2.255993736018065e-06,-1.691726675509406e-06,1.781570106553108e-07,4.622702576864325e-06],
			[7.118906802717545e-10,4.734447591826129e-10,1.659235234191371e-09,1.626981298269743e-09,2.010600661024617e-09,-2.361927812727482e-10,-7.66269512563862e-09],
			[-0.05753344995504789,-3.371809653572346,1.268749977841295,-30.94129062059461,-0.002129209324653351,14.31881702305442,8527.48884081363],
			[-4.513974426840357e-05,0.0002462925902375218,-0.001872534646725502,0.0002833744931843515,0.0001455153313886774,-0.001177880911340223,0.009186200207611647],
			[1.597497432751293e-07,3.681546333414584e-07,1.138054621723598e-07,8.271036102368903e-06,3.773268797870947e-07,1.346430962549764e-06,2.337519002579033e-06],
			[5.234049536447906e-10,-1.105414964246185e-09,9.528542796966246e-10,3.746955510213246e-09,1.924478066184059e-09,1.559848399713958e-09,1.141185651500564e-09],
			[-0.0007904250802790728,0.0163387292272996,-0.01675543306324074,-0.5474605969709065,-0.0001783615901243241,0.0008151273726343034,0.0002483966837060696],
			[1.323471581533513e-06,-8.290681676185596e-07,6.318522382677622e-06,-8.220167492955191e-07,-5.563490696431465e-08,7.774607861651761e-07,-4.769387314180061e-06],
			[3.42561937554575e-10,3.029675580775705e-09,2.739765475573249e-09,-7.873503602419724e-09,3.07914531701382e-10,-1.126792307456741e-11,-2.267200758312866e-10],
			[-8.778447055785832e-07,-0.0005606471620735392,0.0001168010295963253,-9.717532668754173e-06,-1.155557850828581e-07,-6.967622738588462e-06,-3.31947991034455e-07],
			[-8.093609499883992e-09,1.434877983158402e-09,-6.680366133967114e-09,1.017061923662461e-09,-3.582269359603989e-12,-1.671582533560191e-10,8.240151412940713e-10],
			[-2.955345751770305e-09,-1.472779353714141e-06,4.448003138570851e-07,-3.82213931975263e-07,-2.093664608846737e-11,3.999861190808773e-09,1.386783290336003e-10],
			[0.001391380500944979,0.0063705876337829,0.0588747735983061,-2.405641878487573,0.002025887075619195,0.1348184626740925,-1.784707477414793],
			[4.562255090574226e-06,-6.157625341501091e-05,-6.576113483827735e-06,-0.0004383607354552009,-1.614018680967999e-05,-5.150009218023903e-06,-0.0001163811742418598],
			[-1.887539726849175e-08,2.087911554076078e-07,1.602246780162437e-08,7.181235160840906e-08,3.251025139261244e-07,2.300560401483732e-07,9.107295713467845e-07],
			[5.781059141147827e-11,-2.341862420277452e-10,-2.019327669913281e-10,-7.124566656322269e-10,-7.094627930490957e-10,-8.313042839649669e-10,-1.826293631425758e-09],
			[0.07157745602792323,14.26811799655323,9.328232320851397,39.42936905852946,0.01579177134103826,-11.48454323461244,-8535.516898992037],
			[-2.839927874995294e-05,-4.094514188920818e-05,-0.00056358976327046,0.01730400868639627,1.403193350311311e-05,-0.0002583129239239685,0.002786633485241882],
			[-7.211952510097513e-08,3.482389899203059e-07,-1.258689249649315e-08,2.08777429563818e-06,3.20079951439739e-07,2.769193934000439e-07,2.94501540841895e-07],
			[2.915972717017942e-10,-4.577127620901257e-10,4.28342766763132e-10,8.747725253859081e-10,2.883034050259525e-10,4.524268599569193e-10,3.557933219250586e-10],
			[0.0006457606247547645,-0.005217883540667169,0.0142738386441135,0.3484511418073223,0.0001667340627398411,-0.001542507143518654,-0.002421559064500031],
			[3.879686676143067e-07,8.228579455480687e-08,1.866638293322667e-06,-4.139569956010924e-05,-1.019240561078421e-08,1.758723975238722e-07,-1.435746090361474e-06],
			[6.724656834952687e-10,6.332174821455116e-10,9.422319337435437e-10,-1.803480330504775e-09,2.579065919948171e-11,2.654121209562931e-11,2.45234111527917e-11],
			[-6.300270471992622e-06,1.692135662813614e-05,1.517933303391833e-05,-0.0007052304861011051,3.604230428398344e-08,-7.795964190836273e-06,-4.179839883644737e-08],
			[-2.490370777564596e-09,-4.241533559883833e-11,-2.019252638377844e-09,3.300980327273209e-08,1.338967552484113e-12,-3.908170739908757e-11,2.462303048087882e-10],
			[1.662527263649493e-10,2.24238985922187e-06,2.341505596983961e-07,-0.1252522816357968,9.493881529553579e-12,-0.01346529594773642,0.0003885297585899815],
			[-3.108538729988901e-07,-2.515573240687066e-07,-5.639774000840072e-07,-6.82789625931192e-07,-5.792448308496678e-07,-3.548028826506976e-07,-2.711711563786254e-07],
			[1.625357147779057e-07,-5.241178807965307e-08,-6.280042640263735e-08,-7.528505038003585e-08,-1.046148459222665e-07,-7.469143761724788e-08,-8.194295642479467e-08],
			[1.80906467492163e-07,4.336038081086531e-09,-8.573892966256209e-08,-1.038749156364558e-07,-1.025765524436757e-07,-7.257172678374321e-08,-5.015994770893774e-08],
			[-1.663333900636418e-10,1.974950493372448e-10,5.354281086833009e-10,5.781738770729534e-10,5.037505283032277e-10,3.849258818033785e-10,2.413157205124355e-10],
			[-1.20785309267948e-10,1.096121903798786e-10,4.124014412887502e-10,6.463085233166989e-10,5.872594489555777e-10,4.818930305991767e-10,4.001050286653445e-10],
			[2.598924121010321e-09,-4.414948829771545e-10,1.209998770704591e-10,2.494663585992961e-10,1.605273916142342e-10,2.995753944613363e-11,1.596460120657887e-11],
			[1.114376738845257e-10,-9.449959139806062e-11,-1.332737305806853e-10,-1.309755740965002e-10,-4.866587902718581e-11,-5.314045770368796e-12,1.156196221662924e-11],
			[-5.147392090664152e-10,1.017213279551118e-10,9.349329351825912e-11,1.443598208045376e-10,1.334021620480871e-10,1.335836777040649e-10,1.240558061705207e-10],
			[-1.933735096512493e-10,-5.773584616987642e-11,-3.046162462968656e-11,-3.212910125437802e-11,2.896171869588238e-11,3.262167612309651e-12,8.053567857353142e-12],
			[-1.830139993669787e-10,3.567658868695162e-11,1.646746291265687e-10,2.210887281076967e-10,1.472172723385885e-10,1.174623324077423e-10,7.164035813929542e-11],
			[-2.965719127495954e-10,-2.167169856482728e-10,-1.468305909420937e-10,-1.542663199237933e-10,-6.69480900395158e-11,-7.541203299432309e-12,-5.107976623646946e-12],
			[-1.304215174439544e-10,-1.377899981654842e-10,-1.87749168050936e-11,4.687815158921866e-12,3.153162729268616e-11,8.688330102356796e-12,3.829032339389762e-12],
			[-4.718415395135836e-10,2.186364006136696e-10,3.423670308303344e-10,3.457997304728991e-10,2.409074850282911e-10,1.585584668286972e-10,1.34076646970558e-10]
		]
	}
}
