<?xml version="1.0" encoding="UTF-8"?>
<svg width="240px" height="240px" viewBox="0 0 240 240" version="1.1" xmlns="http://www.w3.org/2000/svg" xmlns:xlink="http://www.w3.org/1999/xlink">
    <title>com.vivo.health_b_s6_1x1_mc</title>
    <defs>
        <filter color-interpolation-filters="auto" id="filter-1">
            <feColorMatrix in="SourceGraphic" type="matrix" values="0 0 0 0 0.000000 0 0 0 0 1.000000 0 0 0 0 0.349020 0 0 0 1.000000 0"></feColorMatrix>
        </filter>
    </defs>
    <g id="com.vivo.health" stroke="none" stroke-width="1" fill="none" fill-rule="evenodd">
        <g id="编组-35" transform="translate(35.412451, 57.998453)" filter="url(#filter-1)">
            <g>
                <path d="M68.5024359,8.57428498 C75.3045448,8.57428498 81.6773504,10.4123512 87.1512649,13.6188961 C92.6251794,16.825441 97.2002029,21.4004645 100.406748,26.874379 C103.613293,32.3482936 105.451359,38.7210991 105.451359,45.523208 L105.451359,91.4816639 C105.451359,98.2837728 103.613293,104.656578 100.406748,110.130493 C97.2002029,115.604407 92.6251794,120.179431 87.1512649,123.385976 C81.6773504,126.592521 75.3045448,128.430587 68.5024359,128.430587 C61.700327,128.430587 55.3275215,126.592521 49.853607,123.385976 C44.3796925,120.179431 39.804669,115.604407 36.5981241,110.130493 C33.3915792,104.656578 31.5535129,98.2837728 31.5535129,91.4816639 L31.5535129,45.523208 C31.5535129,38.7210991 33.3915792,32.3482936 36.5981241,26.874379 C39.804669,21.4004645 44.3796925,16.825441 49.853607,13.6188961 C55.3275215,10.4123512 61.700327,8.57428498 68.5024359,8.57428498 Z M68.5024359,34.7247509 C62.5005751,34.7247509 57.6351056,39.5902204 57.6351056,45.5920811 L57.6351056,45.5920811 L57.6351056,91.4127907 C57.6351056,97.4146515 62.5005751,102.280121 68.5024359,102.280121 C74.5042967,102.280121 79.3697662,97.4146515 79.3697662,91.4127907 L79.3697662,91.4127907 L79.3697662,45.5920811 C79.3697662,39.5902204 74.5042967,34.7247509 68.5024359,34.7247509 Z" id="形状结合" fill="#00FF59" fill-rule="nonzero" opacity="0.949999988" transform="translate(68.502436, 68.502436) rotate(-45.000000) translate(-68.502436, -68.502436) "></path>
                <path d="M84.8194262,32.566745 L110.878038,58.6243698 C115.687855,63.4341872 118.8944,69.2401503 120.497673,75.378162 C122.100945,81.5161737 122.100945,87.986234 120.497673,94.1242457 C118.8944,100.262257 115.687855,106.068221 110.878038,110.878038 C108.139269,113.616806 105.07752,115.835746 101.815397,117.534855 C89.4897608,123.681237 74.5473873,122.706343 63.0744873,114.680767 C61.5173833,113.549542 60.0284333,112.282101 58.6243698,110.878038 L50.2744262,102.528745 L32.7694262,84.6166558 L51.0084262,66.376745 L77.0181402,92.3868661 C81.2620967,96.6308226 88.1429096,96.6308226 92.3868661,92.3868661 C96.5563672,88.217365 96.6295163,81.5027171 92.6063135,77.2439126 L92.3868661,77.0181402 L66.3774262,51.008745 L84.8194262,32.566745 Z" id="形状结合" fill="#00FF59" fill-rule="nonzero" opacity="0.900000036"></path>
            </g>
        </g>
    </g>
</svg>