<?xml version="1.0" encoding="UTF-8"?>
<svg width="240px" height="480px" viewBox="0 0 240 480" version="1.1" xmlns="http://www.w3.org/2000/svg" xmlns:xlink="http://www.w3.org/1999/xlink">
    <title>com.vivo.compass_b_s5_1x2_sc</title>
    <g id="com.vivo.compass" stroke="none" stroke-width="1" fill="none" fill-rule="evenodd">
        <g id="编组" transform="translate(107.932669, 174.287797)" fill="#F76F67">
            <g id="编组-2备份-3" transform="translate(40.835417, 40.835417) rotate(-315.000000) translate(-40.835417, -40.835417) translate(23.066186, 0.854647)">
                <path d="M20.3265407,11.5078945 L35.5384615,79.9615385 L35.5384615,79.9615385 L0,79.9615385 L15.2119209,11.5078945 C15.5257794,10.0955313 16.9251586,9.20501721 18.3375219,9.51887571 C19.3304424,9.73952472 20.1058917,10.514974 20.3265407,11.5078945 Z" id="三角形"></path>
            </g>
        </g>
    </g>
</svg>