<?xml version="1.0" encoding="UTF-8"?>
<svg width="240px" height="240px" viewBox="0 0 240 240" version="1.1" xmlns="http://www.w3.org/2000/svg" xmlns:xlink="http://www.w3.org/1999/xlink">
    <title>com.android.settings_b_s6_1x1_mc</title>
    <g id="com.android.settings" stroke="none" stroke-width="1" fill="none" fill-rule="evenodd">
        <g id="设置" transform="translate(83.032545, 83.163292)" fill="#949599">
            <path d="M37.7742876,0 C58.6364506,0 75.5485753,16.8568846 75.5485753,37.6509056 C75.5485753,58.4449265 58.6364506,75.3018111 37.7742876,75.3018111 C16.9121246,75.3018111 0,58.4449265 0,37.6509056 C0,16.8568846 16.9121246,0 37.7742876,0 Z M37.7742876,20.439063 C28.2372988,20.439063 20.5060419,28.1450674 20.5060419,37.6509056 C20.5060419,47.1567437 28.2372988,54.8627481 37.7742876,54.8627481 C47.3112764,54.8627481 55.0425334,47.1567437 55.0425334,37.6509056 C55.0425334,28.1450674 47.3112764,20.439063 37.7742876,20.439063 Z" id="形状结合备份-2"></path>
        </g>
    </g>
</svg>