<?xml version="1.0" encoding="UTF-8"?>
<svg width="240px" height="240px" viewBox="0 0 240 240" version="1.1" xmlns="http://www.w3.org/2000/svg" xmlns:xlink="http://www.w3.org/1999/xlink">
    <title>com.vivo.weather.rain_b_s5_1x1_mc</title>
    <g id="com.vivo.weather.rain" stroke="none" stroke-width="1" fill="none" fill-rule="evenodd" opacity="0.949999988">
        <g id="编组-38" transform="translate(50.700000, 54.650000)" fill="#3B9576">
            <path d="M53.1432,0 C77.7361135,0 98.4273511,16.707654 104.488783,39.3931666 C104.939516,39.3738375 105.394092,39.3646721 105.8508,39.3646721 C124.375093,39.3646721 139.392,54.4431236 139.392,73.0433361 C139.392,91.6435486 124.375093,106.722 105.8508,106.722 C105.412616,106.722 104.976395,106.713563 104.542289,106.696842 L104.542459,106.722 L54.1240756,106.722 C53.8047304,106.719097 53.4840563,106.722 53.1627138,106.722 C23.8125349,106.722 0,82.506187 0,53.1514511 C0,23.7967152 23.7930211,0 53.1432,0 Z" id="形状结合"></path>
        </g>
    </g>
</svg>