<?xml version="1.0" encoding="UTF-8"?>
<svg width="240px" height="480px" viewBox="0 0 240 480" version="1.1" xmlns="http://www.w3.org/2000/svg" xmlns:xlink="http://www.w3.org/1999/xlink">
    <title>com.vivo.weather.snow_b_s5_1x2_sc</title>
    <g id="com.vivo.weather.snow" stroke="none" stroke-width="1" fill="none" fill-rule="evenodd">
        <g id="编组-31" transform="translate(87.480000, 302.910769)" fill="#FFFFFF">
            <circle id="椭圆形" opacity="0.42" cx="3.17307692" cy="3.80769231" r="3.17307692"></circle>
            <circle id="椭圆形备份-7" opacity="0.260811942" cx="62.8269231" cy="8.25" r="3.17307692"></circle>
            <circle id="椭圆形备份-5" opacity="0.8" cx="21.5769231" cy="11.4230769" r="5.07692308"></circle>
            <circle id="椭圆形备份-6" opacity="0.607468378" cx="43.1538462" cy="3.80769231" r="3.80769231"></circle>
        </g>
    </g>
</svg>