<?xml version="1.0" encoding="UTF-8"?>
<svg width="240px" height="480px" viewBox="0 0 240 480" version="1.1" xmlns="http://www.w3.org/2000/svg" xmlns:xlink="http://www.w3.org/1999/xlink">
    <title>com.vivo.symmetry_b_s5_1x2_sc</title>
    <g id="com.vivo.symmetry" stroke="none" stroke-width="1" fill="none" fill-rule="evenodd">
        <g id="编组" transform="translate(90.000000, 164.000000)" fill="#FFFFFF">
            <path d="M30,46 C46.5685425,46 60,59.4314575 60,76 C60,92.5685425 46.5685425,106 30,106 C13.4314575,106 0,92.5685425 0,76 C0,59.4314575 13.4314575,46 30,46 Z M30,56 C18.954305,56 10,64.954305 10,76 C10,87.045695 18.954305,96 30,96 C41.045695,96 50,87.045695 50,76 C50,64.954305 41.045695,56 30,56 Z" id="形状结合" fill-rule="nonzero"></path>
            <circle id="椭圆形" cx="95" cy="11" r="11"></circle>
        </g>
    </g>
</svg>