<?xml version="1.0" encoding="UTF-8"?>
<svg width="480px" height="480px" viewBox="0 0 480 480" version="1.1" xmlns="http://www.w3.org/2000/svg" xmlns:xlink="http://www.w3.org/1999/xlink">
    <title>com.vivo.weather.sun_b_s5_2x2_sc</title>
    <g id="com.vivo.weather.sun" stroke="none" stroke-width="1" fill="none" fill-rule="evenodd" opacity="0.949999988">
        <g id="编组-38" transform="translate(266.322878, 164.106833)" fill="#7CB9A4">
            <path d="M23.500872,0 C45.1664203,0 62.729622,17.5636921 62.729622,39.22875 C62.729622,46.4779926 60.7633228,53.2679545 57.3349694,59.0943908 C49.7151284,54.9284458 40.9804261,52.5622377 31.695322,52.5622377 C30.9641499,52.5622377 30.2363908,52.5769107 29.5144027,52.6066727 C24.7140161,34.6417943 14.1830655,19.0185358 0.000148421367,7.81581726 C6.5488881,2.90789862 14.6852815,0 23.500872,0 Z" id="形状结合"></path>
        </g>
    </g>
</svg>