<?xml version="1.0" encoding="UTF-8"?>
<svg width="480px" height="480px" viewBox="0 0 480 480" version="1.1" xmlns="http://www.w3.org/2000/svg" xmlns:xlink="http://www.w3.org/1999/xlink">
    <title>com.vivo.upslide_b_s5_2x2_mc</title>
    <defs>
        <filter color-interpolation-filters="auto" id="filter-1">
            <feColorMatrix in="SourceGraphic" type="matrix" values="0 0 0 0 0.000000 0 0 0 0 0.937255 0 0 0 0 0.317647 0 0 0 1.000000 0"></feColorMatrix>
        </filter>
    </defs>
    <g id="com.vivo.upslide" stroke="none" stroke-width="1" fill="none" fill-rule="evenodd">
        <g filter="url(#filter-1)" id="编组">
            <g transform="translate(135.015950, 69.498949)">
                <path d="M323.98405,160.809051 L323.98405,327.967806 C323.98405,348.238127 321.984571,356.268625 318.217106,363.708789 L317.963325,364.204053 C317.835128,364.451376 317.704972,364.69833 317.572865,364.945348 C313.389495,372.76757 307.250569,378.906496 299.428347,383.089866 C299.181329,383.221973 298.934375,383.352129 298.687052,383.480327 L298.191788,383.734108 C290.751624,387.501572 282.721126,389.501051 262.450805,389.501051 L205.47005,389.501051 L205.471487,228.910091 L323.98405,160.809051 Z" id="形状结合" fill="#FFFFFF" opacity="0.0425920759"></path>
                <path d="M187.765904,9.39119604 C197.605001,3.74133851 209.697911,3.7142668 219.562205,9.32001548 L219.562205,9.32001548 L323.983964,68.660673 L323.983964,156.737673 L204.793925,225.6099 C204.465431,225.799713 204.069361,225.822018 203.724843,225.676411 L203.598298,225.613937 L6.48696423,113.486141 Z" id="形状结合" fill="#FFFFFF" opacity="0.100000001"></path>
                <path d="M5.68058522,116.111821 L204.197269,230.13688 L203.052585,389.500821 L84.7025852,389.500821 L20.6485455,352.528421 C11.8439439,347.446282 6.40658631,338.065078 6.37333362,327.899055 L5.68058522,116.111821 Z" id="形状结合" fill="#FFFFFF" opacity="0.0343377976"></path>
                <path d="M220.412911,4.35610232 L220.871288,4.61611189 L323.984,64.148 L323.984,69.699 L218.467442,8.77969556 C209.43782,3.56644129 198.345608,3.48498419 189.25153,8.53532427 L188.820006,8.77969556 L19.6314103,106.460777 C15.7488692,108.702363 12.4973228,111.748581 10.0381746,115.319872 L204.179,225.969 L323.984,156.686 L323.984,162.339 L206.63,230.204 L206.098,389.501 L201.204,389.501 L201.736,230.208 L7.60416129,119.56627 C5.87019949,123.269344 4.89479791,127.345569 4.81325819,131.560595 L4.80769231,132.136209 L4.80769231,327.498372 C4.80769231,337.934615 10.2934846,347.589761 19.2290133,352.937255 L19.6314103,353.173804 L82.553,389.501 L72.937,389.501 L17.2275641,357.337388 C6.70555779,351.262505 0.171264688,340.102566 0.00331745727,327.977485 L-2.84217094e-14,327.498372 L-2.84217094e-14,132.136209 C-2.84217094e-14,119.986443 6.39764367,108.74761 16.8142983,102.539623 L17.2275641,102.297193 L186.41616,4.61611189 C196.924321,-1.45077802 209.836075,-1.53744788 220.412911,4.35610232 Z M9.58734572,115.994132 C8.96844557,116.947708 8.40474817,117.936205 7.89916571,118.95458 L9.58734572,115.994132 Z" id="形状结合" fill="#FFFFFF"></path>
            </g>
        </g>
    </g>
</svg>