<?xml version="1.0" encoding="UTF-8"?>
<svg width="480px" height="240px" viewBox="0 0 480 240" version="1.1" xmlns="http://www.w3.org/2000/svg" xmlns:xlink="http://www.w3.org/1999/xlink">
    <title>com.chaozh.iReader_b_s5_2x1_mc</title>
    <defs>
        <path d="M61.5332448,-2.48601674e-15 L376.466755,2.48601674e-15 C397.863205,-1.44444732e-15 405.622075,2.22781467 413.444297,6.41118489 C421.266519,10.5945551 427.405445,16.7334809 431.588815,24.5557031 C435.772185,32.3779253 438,40.136795 438,61.5332448 L438,136.466755 C438,157.863205 435.772185,165.622075 431.588815,173.444297 C427.405445,181.266519 421.266519,187.405445 413.444297,191.588815 C405.622075,195.772185 397.863205,198 376.466755,198 L61.5332448,198 C40.136795,198 32.3779253,195.772185 24.5557031,191.588815 C16.7334809,187.405445 10.5945551,181.266519 6.41118489,173.444297 C2.22781467,165.622075 9.62964878e-16,157.863205 -1.65734449e-15,136.466755 L1.65734449e-15,61.5332448 C-9.62964878e-16,40.136795 2.22781467,32.3779253 6.41118489,24.5557031 C10.5945551,16.7334809 16.7334809,10.5945551 24.5557031,6.41118489 C32.3779253,2.22781467 40.136795,1.44444732e-15 61.5332448,-2.48601674e-15 Z" id="path-1"></path>
    </defs>
    <g id="com.chaozh.iReader" stroke="none" stroke-width="1" fill="none" fill-rule="evenodd">
        <g id="编组-35备份" transform="translate(21.000000, 21.000000)">
            <mask id="mask-2" fill="white">
                <use xlink:href="#path-1"></use>
            </mask>
            <g id="蒙版"></g>
            <g id="编组" mask="url(#mask-2)">
                <g transform="translate(77.000000, 38.000000)">
                    <path d="M28,21.9991522 L28,153.708539 C28,160.658173 28.7236012,163.178278 30.082373,165.718961 C31.4411449,168.259643 33.4350873,170.253586 35.9757697,171.612357 C38.5164521,172.971129 41.0365574,173.69473 47.9861917,173.69473 L47.9861917,173.69473 L115.61599,173.69473 C118.484913,173.69473 121.246887,174.152633 123.832814,174.999339 L26.819426,175 C22.3618323,175 20.7454011,174.535872 19.1157715,173.664336 C17.4861419,172.792801 16.207199,171.513858 15.3356635,169.884229 C14.4641281,168.254599 14,166.638168 14,162.180574 L14,34.819426 C14,30.3618323 14.4641281,28.7454011 15.3356635,27.1157715 C16.207199,25.4861419 17.4861419,24.207199 19.1157715,23.3356635 C20.7454011,22.4641281 22.3618323,22 26.819426,22 L28,21.9991522 Z M257.180574,22 C261.638168,22 263.254599,22.4641281 264.884229,23.3356635 C266.513858,24.207199 267.792801,25.4861419 268.664336,27.1157715 C269.535872,28.7454011 270,30.3618323 270,34.819426 L270,162.180574 C270,166.638168 269.535872,168.254599 268.664336,169.884229 C267.792801,171.513858 266.513858,172.792801 264.884229,173.664336 C263.254599,174.535872 261.638168,175 257.180574,175 L142,174.999152 L142,30.8603913 C142,27.1992231 141.869588,24.337118 141.614198,21.9991522 L257.180574,22 Z" id="形状结合" fill="#FFFFFF" opacity="0.4"></path>
                    <g id="编组-29" stroke-width="1" fill="none" transform="translate(28.000000, 0.000000)">
                        <g id="编组-4" fill="#FFFFFF">
                            <path d="M15.6072561,0.0167227906 L83.2617746,0.0892129413 C93.953433,0.10066879 97.8294297,1.21698913 101.736731,3.31016888 C105.644032,5.40334863 108.709849,8.47245261 110.798841,12.3819944 C112.887833,16.2915361 114,20.1687267 114,30.8603913 L114,200.07874 L114,200.07874 C114,185.507254 102.187477,173.69473 87.6159903,173.69473 L19.9861917,173.69473 C13.0365574,173.69473 10.5164521,172.971129 7.97576971,171.612357 C5.4350873,170.253586 3.44114487,168.259643 2.08237305,165.718961 C0.723601221,163.178278 1.34851928e-14,160.658173 -2.32091642e-14,153.708539 L0,15.607265 C2.4982409e-15,6.99684136 6.98012752,0.0167138411 15.5905512,0.0167138411 C15.5961195,0.0167138411 15.6016878,0.0167168243 15.6072561,0.0167227906 Z" id="矩形" opacity="0.600000024"></path>
                            <path d="M212.259482,0.0167325803 L144.671583,0.0891936992 C133.979928,0.100656243 130.103933,1.21697799 126.196634,3.31015861 C122.289335,5.40333923 119.22352,8.47244301 117.13453,12.3819839 C115.045539,16.2915247 113.933374,20.168714 113.933374,30.8603747 L113.933374,200.07874 L113.933374,200.07874 C113.933374,185.507254 125.745897,173.69473 140.317383,173.69473 L207.880556,173.69473 C214.83019,173.69473 217.350295,172.971129 219.890978,171.612357 C222.43166,170.253586 224.425603,168.259643 225.784374,165.718961 C227.143146,163.178278 227.866747,160.658173 227.866747,153.708539 L227.866747,15.6072748 C227.866747,6.99685114 220.88662,0.0167236204 212.276196,0.0167236204 C212.270625,0.0167236204 212.265053,0.016726607 212.259482,0.0167325803 Z" id="形状结合"></path>
                        </g>
                    </g>
                </g>
            </g>
        </g>
    </g>
</svg>