<?xml version="1.0" encoding="UTF-8"?>
<svg width="240px" height="240px" viewBox="0 0 240 240" version="1.1" xmlns="http://www.w3.org/2000/svg" xmlns:xlink="http://www.w3.org/1999/xlink">
    <title>com.android.dialer_b_s6_1x1_1_bg</title>
    <g id="com.android.dialer" stroke="none" stroke-width="1" fill="none" fill-rule="evenodd">
        <g id="编组-13备份-4" transform="translate(27.000000, 27.000000)" fill="#27D1B5">
            <path d="M93,-2.83590458e-17 C110.159305,-3.12375406e-15 126.212406,4.61356515 139.990184,12.6715748 C153.767962,20.7295844 165.270416,32.2320384 173.328425,46.0098162 C181.386435,59.787594 186,75.8406955 186,93 C186,110.159305 181.386435,126.212406 173.328425,139.990184 C165.270416,153.767962 153.767962,165.270416 139.990184,173.328425 C126.212406,181.386435 110.159305,186 93,186 C75.8406955,186 59.787594,181.386435 46.0098162,173.328425 C32.2320384,165.270416 20.7295844,153.767962 12.6715748,139.990184 C4.61356515,126.212406 2.08250271e-15,110.159305 -1.89060306e-17,93 C-2.08250271e-15,75.8406955 4.61356515,59.787594 12.6715748,46.0098162 C20.7295844,32.2320384 32.2320384,20.7295844 46.0098162,12.6715748 C59.787594,4.61356515 75.8406955,3.12375406e-15 93,-2.83590458e-17 Z" id="矩形"></path>
        </g>
    </g>
</svg>