<?xml version="1.0" encoding="UTF-8"?>
<svg width="480px" height="480px" viewBox="0 0 480 480" version="1.1" xmlns="http://www.w3.org/2000/svg" xmlns:xlink="http://www.w3.org/1999/xlink">
    <title>com.vivo.childrenmode_b_s5_2x2_mc</title>
    <defs>
        <linearGradient x1="50%" y1="0%" x2="50%" y2="100%" id="linearGradient-1">
            <stop stop-color="#FFFFFF" offset="0%"></stop>
            <stop stop-color="#F5FAF1" offset="100%"></stop>
        </linearGradient>
    </defs>
    <g id="com.vivo.childrenmode" stroke="none" stroke-width="1" fill="none" fill-rule="evenodd">
        <g id="编组-7" transform="translate(160.940055, 214.748573)" fill-rule="nonzero">
            <g id="编组-5">
                <g id="编组-10" fill="#FFFFFF" fill-opacity="0.5">
                    <path d="M158.234136,13.592764 C160.825599,23.2642331 155.178685,33.2023076 145.595137,35.9561539 L145.270611,36.0462487 L116.115,43.858 L94.4600807,22.3349026 C90.4329553,18.3321784 85.1486681,16.3615529 79.8837938,16.4230142 L79.4451266,16.4328399 C74.0361406,16.2537373 68.5693416,18.2210916 64.4304522,22.3349026 L64.4304522,22.3349026 L42.445,44.186 L13.592764,36.4548095 C3.81262674,33.8342296 -1.99134128,23.7814621 0.629238602,14.0013249 C3.24981849,4.22118757 13.302586,-1.58278045 23.0827233,1.03779943 L78.67,15.932 L135.780652,0.629238602 C145.560789,-1.99134128 155.613557,3.81262674 158.234136,13.592764 Z" id="形状结合"></path>
                </g>
                <path d="M64.4304522,22.3349026 C68.5693416,18.2210916 74.0361406,16.2537373 79.4451266,16.4328399 C84.8541265,16.2536417 90.3210907,18.2209916 94.4600807,22.3349026 L151.809986,79.3373117 C159.680376,87.1600136 159.719035,99.8817784 151.896333,107.752169 L151.809986,107.838516 L151.809986,107.838516 C143.87756,115.722878 131.067459,115.722878 123.135033,107.838516 L79.4453707,64.41362 L35.7554998,107.838516 C27.9142513,115.632253 15.3068138,115.721836 7.35599779,108.107266 L7.08054739,107.838516 C7.05167748,107.809821 7.02289484,107.781039 6.99419986,107.752169 C-0.828502026,99.8817784 -0.789842917,87.1600136 7.08054739,79.3373117 L7.08054739,79.3373117 Z" id="形状结合" fill="url(#linearGradient-1)"></path>
            </g>
        </g>
    </g>
</svg>