<?xml version="1.0" encoding="UTF-8"?>
<svg width="240px" height="240px" viewBox="0 0 240 240" version="1.1" xmlns="http://www.w3.org/2000/svg" xmlns:xlink="http://www.w3.org/1999/xlink">
    <title>com.vivo.Tips_b_s6_1x1_sc</title>
    <g id="com.vivo.Tips" stroke="none" stroke-width="1" fill="none" fill-rule="evenodd">
        <g id="编组-2备份-3" transform="translate(70.000000, 60.000000)">
            <path d="M73.3333333,94.4444444 L73.3333333,100 C73.3333333,112.886644 62.8866442,123.333333 50,123.333333 C37.1133558,123.333333 26.6666667,112.886644 26.6666667,100 L26.6666667,94.4444444 L26.6678935,94.2336712 C33.6333253,97.9153678 41.5732167,100 50,100 C58.4265753,100 66.3662827,97.9154708 73.3315905,94.2339439 C73.3330196,94.3032667 73.3333333,94.3738189 73.3333333,94.4444444 Z" id="形状结合" fill="#5A5A5A"></path>
            <g id="编组-12备份"></g>
        </g>
    </g>
</svg>