<?xml version="1.0" encoding="UTF-8"?>
<svg width="240px" height="240px" viewBox="0 0 240 240" version="1.1" xmlns="http://www.w3.org/2000/svg" xmlns:xlink="http://www.w3.org/1999/xlink">
    <title>com.vivo.childrenmode_b_s6_1x1_sc</title>
    <g id="com.vivo.childrenmode" stroke="none" stroke-width="1" fill="none" fill-rule="evenodd">
        <g id="编组-7" transform="translate(102.222222, 63.333333)" fill="#FFFFFF">
            <circle id="椭圆形" cx="17.7777778" cy="17.7777778" r="17.7777778"></circle>
        </g>
    </g>
</svg>