<?xml version="1.0" encoding="UTF-8"?>
<svg width="240px" height="240px" viewBox="0 0 240 240" version="1.1" xmlns="http://www.w3.org/2000/svg" xmlns:xlink="http://www.w3.org/1999/xlink">
    <title>com.vivo.easyshare_b_s5_1x1_sc</title>
    <g id="com.vivo.easyshare" stroke="none" stroke-width="1" fill="none" fill-rule="evenodd">
        <path d="M145,70 C172.614237,70 195,92.3857625 195,120 C195,147.614237 172.614237,170 145,170 C135.893055,170 127.354771,167.565268 120.000565,163.311217 C125.737367,159.991926 130.753709,155.56607 134.757297,150.325232 C137.972271,151.411255 141.417381,152 145,152 C162.673112,152 177,137.673112 177,120 C177,102.326888 162.673112,88 145,88 C141.417381,88 137.972271,88.5887447 134.756142,89.6747615 C130.753709,84.4339298 125.737367,80.0080737 120.000431,76.6893589 C127.354771,72.4347325 135.893055,70 145,70 Z M105.243858,89.6747615 C111.109535,91.6554731 116.213537,95.2902912 120.000925,100.024277 C115.619122,105.498929 113,112.4436 113,120 C113,127.5564 115.619122,134.501071 119.999075,139.975723 C116.213537,144.709709 111.109535,148.344527 105.243858,150.325239 C98.8168902,141.913615 95,131.402549 95,120 C95,108.678163 98.7630467,98.2352319 105.106643,89.8537052 Z" id="形状结合" fill="#6ED9BD" fill-rule="nonzero"></path>
        <g id="互传备份" transform="translate(105.242479, 76.688795)" fill="#6ED9BD" fill-rule="nonzero" opacity="0.5">
            <g id="编组-37">
                <path d="M29.5129345,73.6361976 L29.1821242,74.0670862 C25.2346983,79.1199364 20.3370721,83.3944248 14.7579512,86.6218462 C9.02004671,83.3030696 4.00362493,78.8771104 9.76996262e-15,73.6361439 C5.86664444,71.6558708 10.9703424,68.0214232 14.7576498,63.2879237 C18.5445421,68.0212273 23.6479743,71.6555699 29.5129345,73.6361976 Z M29.5148176,12.9859733 L29.1678574,13.1049604 C23.447689,15.1102224 18.4699042,18.6943765 14.7571992,23.3347268 C10.9705152,18.6011099 5.86674372,14.9665728 0.00137842895,12.9859665 C4.00381179,7.74513483 9.02015356,3.3192787 14.75709,0.000563889299 C20.4948877,3.3192787 25.5112295,7.74513483 29.5148176,12.9859733 Z" id="形状结合"></path>
            </g>
        </g>
    </g>
</svg>