<?xml version="1.0" encoding="UTF-8"?>
<svg width="240px" height="240px" viewBox="0 0 240 240" version="1.1" xmlns="http://www.w3.org/2000/svg" xmlns:xlink="http://www.w3.org/1999/xlink">
    <title>com.bbk.theme_b_s5_1x1_sc</title>
    <g id="com.bbk.theme" stroke="none" stroke-width="1" fill="none" fill-rule="evenodd" opacity="0.59778443">
        <g id="编组-17" transform="translate(76.846154, 64.153846)" fill="#FFFFFF">
            <path d="M0,0 L86.3076923,0 L86.3076923,44.618757 C86.3076923,46.3160715 86.1309666,46.9315588 85.7991127,47.5520716 C85.4672588,48.1725844 84.9802768,48.6595665 84.3597639,48.9914204 C83.7392511,49.3232743 83.1237639,49.5 81.4264493,49.5 L4.88124298,49.5 C3.18392845,49.5 2.56844119,49.3232743 1.94792837,48.9914204 C1.32741555,48.6595665 0.840433459,48.1725844 0.508579571,47.5520716 C0.176725683,46.9315588 -1.87059334e-16,46.3160715 3.21945031e-16,44.618757 L0,0 L0,0 Z" id="矩形" transform="translate(43.153846, 24.750000) scale(1, -1) translate(-43.153846, -24.750000) "></path>
        </g>
    </g>
</svg>