<?xml version="1.0" encoding="UTF-8"?>
<svg width="240px" height="240px" viewBox="0 0 240 240" version="1.1" xmlns="http://www.w3.org/2000/svg" xmlns:xlink="http://www.w3.org/1999/xlink">
    <title>com.android.mms_b_s6_1x1_bg</title>
    <defs>
        <path d="M61.5332448,-2.48601674e-15 L118.466755,2.48601674e-15 C139.863205,-1.44444732e-15 147.622075,2.22781467 155.444297,6.41118489 C163.266519,10.5945551 169.405445,16.7334809 173.588815,24.5557031 C177.772185,32.3779253 180,40.136795 180,61.5332448 L180,118.466755 C180,139.863205 177.772185,147.622075 173.588815,155.444297 C169.405445,163.266519 163.266519,169.405445 155.444297,173.588815 C147.622075,177.772185 139.863205,180 118.466755,180 L61.5332448,180 C40.136795,180 32.3779253,177.772185 24.5557031,173.588815 C16.7334809,169.405445 10.5945551,163.266519 6.41118489,155.444297 C2.22781467,147.622075 9.62964878e-16,139.863205 -1.65734449e-15,118.466755 L1.65734449e-15,61.5332448 C-9.62964878e-16,40.136795 2.22781467,32.3779253 6.41118489,24.5557031 C10.5945551,16.7334809 16.7334809,10.5945551 24.5557031,6.41118489 C32.3779253,2.22781467 40.136795,1.44444732e-15 61.5332448,-2.48601674e-15 Z" id="path-1"></path>
    </defs>
    <g id="com.android.mms" stroke="none" stroke-width="1" fill="none" fill-rule="evenodd">
        <g id="编组-4" transform="translate(30.000000, 30.000000)">
            <g id="编组-7备份-3">
                <mask id="mask-2" fill="white">
                    <use xlink:href="#path-1"></use>
                </mask>
                <use id="mask" fill="#FFFFFF" xlink:href="#path-1"></use>
            </g>
            <g id="编组-11" transform="translate(39.642857, 18.214286)">
                <g id="编组-7" transform="translate(18.750000, 0.000000)"></g>
            </g>
        </g>
    </g>
</svg>