<?xml version="1.0" encoding="UTF-8"?>
<svg width="480px" height="240px" viewBox="0 0 480 240" version="1.1" xmlns="http://www.w3.org/2000/svg" xmlns:xlink="http://www.w3.org/1999/xlink">
    <title>com.vivo.moodcube_b_s5_2x1_sc</title>
    <defs>
        <filter color-interpolation-filters="auto" id="filter-1">
            <feColorMatrix in="SourceGraphic" type="matrix" values="0 0 0 0 1.000000 0 0 0 0 1.000000 0 0 0 0 1.000000 0 0 0 1.000000 0"></feColorMatrix>
        </filter>
    </defs>
    <g id="com.vivo.moodcube" stroke="none" stroke-width="1" fill="none" fill-rule="evenodd">
        <g id="编组-10" transform="translate(207.403160, 46.000000)" filter="url(#filter-1)">
            <g>
                <polygon id="路径-17" fill-opacity="0.7" fill="#FFFFFF" points="64.7109605 55.3517802 64.7109605 112.210191 96.5968404 94 96.5968404 37"></polygon>
                <polygon id="路径-10" fill-opacity="0.8" fill="#FFFFFF" points="64.6872338 55.9168667 96.6863605 37 32.5968404 0 -0.000639851888 18.8001846"></polygon>
                <polygon id="路径" fill-opacity="0.700313115" fill="#FFFFFF" fill-rule="nonzero" opacity="0.699999988" points="11.6301737 25.9 64.6635071 55.9168667 85.6301737 43.5488825 32.5864909 14.2128232"></polygon>
            </g>
        </g>
    </g>
</svg>