<?xml version="1.0" encoding="UTF-8"?>
<svg width="240px" height="240px" viewBox="0 0 240 240" version="1.1" xmlns="http://www.w3.org/2000/svg" xmlns:xlink="http://www.w3.org/1999/xlink">
    <title>com.android.mms_b_s6_1x1_sc</title>
    <g id="com.android.mms" stroke="none" stroke-width="1" fill="none" fill-rule="evenodd">
        <path d="M170.946609,62.0010753 L171.763626,62.0096591 L172.531713,62.0267786 L173.253394,62.0523837 L173.931188,62.0864244 L174.567619,62.1288505 L175.165207,62.1796119 L175.726475,62.2386584 L176.253945,62.3059401 C176.50965,62.3416313 176.753626,62.3803919 176.987292,62.4221937 L176.987292,62.4221937 L177.441298,62.5098438 C177.735364,62.5709693 178.012781,62.637468 178.276913,62.7092729 L178.276913,62.7092729 L178.663565,62.8209518 C178.789408,62.859499 178.91235,62.8993646 179.032811,62.9405399 L179.032811,62.9405399 L179.387171,63.0679874 C179.445131,63.0898808 179.502575,63.1120995 179.559557,63.1346427 L179.559557,63.1346427 L179.896317,63.273785 C179.951658,63.2976213 180.006642,63.3217798 180.061321,63.3462595 L180.061321,63.3462595 L180.386155,63.496984 L180.70619,63.6553673 L181.023948,63.8213593 C183.24617,65.0098168 184.990183,66.7538298 186.178641,68.976052 L186.178641,68.976052 L186.344633,69.2938102 L186.503016,69.6138452 C186.528776,69.6675143 186.554218,69.7213832 186.579339,69.7755046 L186.579339,69.7755046 L186.726215,70.1036833 C186.750051,70.1590248 186.773565,70.2147238 186.796756,70.2708329 L186.796756,70.2708329 L186.932013,70.6128291 L187.05946,70.967189 C187.100635,71.0876499 187.140501,71.2105916 187.179048,71.3364346 L187.179048,71.3364346 L187.290727,71.7230875 C187.362532,71.9872189 187.429031,72.2646364 187.490156,72.5587023 L187.490156,72.5587023 L187.577806,73.0127076 C187.619608,73.2463737 187.658369,73.4903502 187.69406,73.7460555 L187.69406,73.7460555 L187.761342,74.2735249 L187.820388,74.8347929 L187.87115,75.4323814 L187.913576,76.068812 L187.947616,76.7466064 L187.973221,77.4682866 L187.990341,78.2363741 C187.992484,78.368396 187.994272,78.5024567 187.995703,78.6386086 L187.995703,78.6386086 L188,79.4810355 L188,147.036274 L187.995298,147.204453 C187.907926,148.763028 186.613724,150 185.03,150 C184.348817,150 183.688336,149.76634 183.159265,149.338185 L183.159265,149.338185 L175.919487,143.478554 C171.883232,140.32013 166.527001,139.00389 161,139.00389 L161,139.00389 L160.550901,139.000283 L143.999075,139.000075 L144,107.053391 L143.991416,106.236374 L143.974297,105.468287 L143.948692,104.746606 L143.914651,104.068812 L143.872225,103.432381 L143.821463,102.834793 L143.762417,102.273525 L143.695135,101.746055 C143.659444,101.49035 143.620683,101.246374 143.578882,101.012708 L143.578882,101.012708 L143.491232,100.558702 C143.430106,100.264636 143.363607,99.9872189 143.291802,99.7230875 L143.291802,99.7230875 L143.180124,99.3364346 C143.141576,99.2105916 143.101711,99.0876499 143.060535,98.967189 L143.060535,98.967189 L142.933088,98.6128291 C142.911195,98.5548694 142.888976,98.497425 142.866433,98.4404431 L142.866433,98.4404431 L142.72729,98.1036833 C142.703454,98.0483418 142.679296,97.9933578 142.654816,97.9386789 L142.654816,97.9386789 L142.504091,97.6138452 L142.345708,97.2938102 L142.179716,96.976052 C140.991259,94.7538298 139.247246,93.0098168 137.025023,91.8213593 L137.025023,91.8213593 L136.707265,91.6553673 L136.38723,91.496984 L136.225571,91.4206613 L135.897392,91.273785 C135.842051,91.2499487 135.786352,91.2264347 135.730242,91.203244 L135.730242,91.203244 L135.388246,91.0679874 L135.033886,90.9405399 C134.913425,90.8993646 134.790484,90.859499 134.664641,90.8209518 L134.664641,90.8209518 L134.277988,90.7092729 C134.013856,90.637468 133.736439,90.5709693 133.442373,90.5098438 L133.442373,90.5098438 L132.988368,90.4221937 C132.754702,90.3803919 132.510725,90.3416313 132.25502,90.3059401 L132.25502,90.3059401 L131.72755,90.2386584 L131.166282,90.1796119 L130.568694,90.1288505 L129.932263,90.0864244 L129.254469,90.0523837 L128.532789,90.0267786 L127.764701,90.0096591 L126.947685,90.0010753 L96.0010753,90.0010753 L96.0010753,79.0533907 L96.0096591,78.2363741 L96.0267786,77.4682866 L96.0523837,76.7466064 L96.0864244,76.068812 L96.1288505,75.4323814 L96.1796119,74.8347929 L96.2386584,74.2735249 L96.3059401,73.7460555 C96.3416313,73.4903502 96.3803919,73.2463737 96.4221937,73.0127076 L96.4221937,73.0127076 L96.5098438,72.5587023 C96.5709693,72.2646364 96.637468,71.9872189 96.7092729,71.7230875 L96.7092729,71.7230875 L96.8209518,71.3364346 C96.859499,71.2105916 96.8993646,71.0876499 96.9405399,70.967189 L96.9405399,70.967189 L97.0679874,70.6128291 C97.0898808,70.5548694 97.1120995,70.497425 97.1346427,70.4404431 L97.1346427,70.4404431 L97.273785,70.1036833 C97.2976213,70.0483418 97.3217798,69.9933578 97.3462595,69.9386789 L97.3462595,69.9386789 L97.496984,69.6138452 L97.6553673,69.2938102 L97.8213593,68.976052 C99.0098168,66.7538298 100.75383,65.0098168 102.976052,63.8213593 L102.976052,63.8213593 L103.29381,63.6553673 L103.613845,63.496984 L103.613845,63.496984 L103.775505,63.4206613 L104.103683,63.273785 C104.159025,63.2499487 104.214724,63.2264347 104.270833,63.203244 L104.270833,63.203244 L104.612829,63.0679874 L104.967189,62.9405399 C105.08765,62.8993646 105.210592,62.859499 105.336435,62.8209518 L105.336435,62.8209518 L105.723087,62.7092729 C105.987219,62.637468 106.264636,62.5709693 106.558702,62.5098438 L106.558702,62.5098438 L107.012708,62.4221937 C107.246374,62.3803919 107.49035,62.3416313 107.746055,62.3059401 L107.746055,62.3059401 L108.273525,62.2386584 L108.834793,62.1796119 L109.432381,62.1288505 L110.068812,62.0864244 L110.746606,62.0523837 L111.468287,62.0267786 L112.236374,62.0096591 L113.053391,62.0010753 L170.946609,62.0010753 Z" id="形状结合" fill="#4BDCE2"></path>
    </g>
</svg>