<?xml version="1.0" encoding="UTF-8"?>
<svg width="240px" height="240px" viewBox="0 0 240 240" version="1.1" xmlns="http://www.w3.org/2000/svg" xmlns:xlink="http://www.w3.org/1999/xlink">
    <title>com.android.bbksoundrecorder_b_s5_1x1_mc</title>
    <g id="com.android.bbksoundrecorder" stroke="none" stroke-width="1" fill="none" fill-rule="evenodd">
        <g id="编组-49备份-2" transform="translate(101.000000, 75.000000)" fill="#FFFFFF">
            <path d="M40,0 C44.418278,-8.11624501e-16 48,3.581722 48,8 L48,82 C48,86.418278 44.418278,90 40,90 C35.581722,90 32,86.418278 32,82 L32,8 C32,3.581722 35.581722,8.11624501e-16 40,0 Z M8,20 C12.418278,20 16,23.581722 16,28 L16,62 C16,66.418278 12.418278,70 8,70 C3.581722,70 5.41083001e-16,66.418278 0,62 L0,28 C-5.41083001e-16,23.581722 3.581722,20 8,20 Z M72,20 C76.418278,20 80,23.581722 80,28 L80,62 C80,66.418278 76.418278,70 72,70 C67.581722,70 64,66.418278 64,62 L64,28 C64,23.581722 67.581722,20 72,20 Z" id="形状结合"></path>
        </g>
    </g>
</svg>