<?xml version="1.0" encoding="UTF-8"?>
<svg width="240px" height="240px" viewBox="0 0 240 240" version="1.1" xmlns="http://www.w3.org/2000/svg" xmlns:xlink="http://www.w3.org/1999/xlink">
    <title>com.vivo.weather.rain_b_s6_1x1_sc</title>
    <g id="com.vivo.weather.rain" stroke="none" stroke-width="1" fill="none" fill-rule="evenodd">
        <g id="编组-3" transform="translate(80.414662, 163.601557)">
            <g id="编组-2">
                <path d="M68.7001935,16.4583887 L68.7028347,16.4583881 C70.9288651,16.4559003 72.733856,18.2600185 72.7343943,20.4860495 C72.7343944,20.4866995 72.7343944,20.4873494 72.7324448,20.487999 L72.7283295,37.4932302 C72.7258405,39.7184991 70.9220375,41.5223017 68.6967686,41.5247902 L68.6941274,41.5247909 C66.468097,41.5272787 64.663106,39.7231604 64.6625678,37.4971295 C64.6625676,37.4964795 64.6625676,37.4958295 64.6645173,37.49518 L64.6686326,20.4899488 C64.6711216,18.2646798 66.4749245,16.4608772 68.7001935,16.4583887 Z" id="矩形备份-28" fill="#FFFFFF" opacity="0.5" transform="translate(68.698481, 28.991589) rotate(-345.000000) translate(-68.698481, -28.991589) "></path>
                <path d="M38.2357959,16.3361477 L38.2384371,16.3361471 C40.4644675,16.3336593 42.2694584,18.1377776 42.2699967,20.3638085 C42.2699968,20.3644585 42.2699968,20.3651085 42.2680472,20.365758 L42.2621987,44.5328184 C42.2597097,46.7580873 40.4559068,48.5618899 38.2306378,48.5643785 L38.2279966,48.5643791 C36.0019662,48.5668669 34.1969753,46.7627486 34.196437,44.5367177 C34.1964369,44.5360677 34.1964369,44.5354177 34.1983865,44.5347682 L34.204235,20.3677078 C34.2067239,18.1424388 36.0105269,16.3386362 38.2357959,16.3361477 Z" id="矩形备份-24" fill="#FFFFFF" opacity="0.78" transform="translate(38.233217, 32.450263) rotate(-345.000000) translate(-38.233217, -32.450263) "></path>
                <g id="编组-24" transform="translate(38.218490, 28.699222) rotate(-345.000000) translate(-38.218490, -28.699222) translate(4.169077, 8.110298)"></g>
            </g>
            <path d="M8.06534518,16.5806297 L8.06798635,16.580629 C10.2940168,16.5781413 12.0990077,18.3822595 12.099546,20.6082905 C12.0995461,20.6089404 12.0995461,20.6095904 12.0975965,20.61024 L12.0952144,30.4536419 C12.0927254,32.6789109 10.2889224,34.4827135 8.06365344,34.485202 L8.06101227,34.4852027 C5.83498183,34.4876904 4.02999089,32.6835722 4.02945265,30.4575413 C4.02945249,30.4568913 4.02945249,30.4562413 4.03140216,30.4555918 L4.03378427,20.6121898 C4.03627324,18.3869208 5.84007622,16.5831182 8.06534518,16.5806297 Z" id="矩形" fill="#FFFFFF" opacity="0.68" transform="translate(8.064499, 25.532916) rotate(-345.000000) translate(-8.064499, -25.532916) "></path>
        </g>
        <g id="编组-44备份" transform="translate(27.000000, 28.000000)" fill="#3B9576" opacity="0.949999988">
            <g id="编组-38">
                <path d="M70.9125,0 C103.72814,0 131.337615,22.2301018 139.426086,52.4140861 C140.027524,52.3892491 140.634214,52.3770492 141.24375,52.3770492 C165.961944,52.3770492 186,72.4398301 186,97.1885246 C186,121.937219 165.961944,142 141.24375,142 C140.658798,142 140.076466,141.988764 139.496959,141.966497 L139.497943,142 L72.2213474,142 L72.2214022,141.988461 C71.7946931,141.996142 71.3670613,142 70.9385385,142 C31.7746462,142 0,109.779413 0,70.7211827 C0,31.662952 31.7486077,0 70.9125,0 Z" id="形状结合"></path>
            </g>
        </g>
    </g>
</svg>