<?xml version="1.0" encoding="UTF-8"?>
<svg width="480px" height="240px" viewBox="0 0 480 240" version="1.1" xmlns="http://www.w3.org/2000/svg" xmlns:xlink="http://www.w3.org/1999/xlink">
    <title>com.vivo.wallet_b_s5_2x1_mc</title>
    <defs>
        <filter color-interpolation-filters="auto" id="filter-1">
            <feColorMatrix in="SourceGraphic" type="matrix" values="0 0 0 0 0.223529 0 0 0 0 0.560784 0 0 0 0 0.984314 0 0 0 1.000000 0"></feColorMatrix>
        </filter>
        <path d="M336.052804,45 C342.293435,45 344.556438,45.6497793 346.83792,46.8699289 C349.119401,48.0900786 350.909921,49.8805986 352.130071,52.1620801 C353.350221,54.4435616 354,56.7065652 354,62.9471964 L354,62.9471964 L354,135.052804 C354,141.293435 353.350221,143.556438 352.130071,145.83792 C350.909921,148.119401 349.119401,149.909921 346.83792,151.130071 C344.556438,152.350221 342.293435,153 336.052804,153 L336.052804,153 L328,153 L328,45 Z" id="path-2"></path>
        <filter x="-1.9%" y="-0.5%" width="103.8%" height="100.9%" filterUnits="objectBoundingBox" id="filter-3">
            <feOffset dx="0" dy="1" in="SourceAlpha" result="shadowOffsetInner1"></feOffset>
            <feComposite in="shadowOffsetInner1" in2="SourceAlpha" operator="arithmetic" k2="-1" k3="1" result="shadowInnerInner1"></feComposite>
            <feColorMatrix values="0 0 0 0 1   0 0 0 0 0.902032568   0 0 0 0 0.647846799  0 0 0 1 0" type="matrix" in="shadowInnerInner1"></feColorMatrix>
        </filter>
        <path d="M288.052804,42 C294.293435,42 296.556438,42.6497793 298.83792,43.8699289 C301.119401,45.0900786 302.909921,46.8805986 304.130071,49.1620801 C305.350221,51.4435616 306,53.7065652 306,59.9471964 L306,59.9471964 L306,138.052804 C306,144.293435 305.350221,146.556438 304.130071,148.83792 C302.909921,151.119401 301.119401,152.909921 298.83792,154.130071 C296.556438,155.350221 294.293435,156 288.052804,156 L288.052804,156 L274,156 L274,42 Z" id="path-4"></path>
        <filter x="-1.6%" y="-0.4%" width="103.1%" height="100.9%" filterUnits="objectBoundingBox" id="filter-5">
            <feOffset dx="0" dy="1" in="SourceAlpha" result="shadowOffsetInner1"></feOffset>
            <feComposite in="shadowOffsetInner1" in2="SourceAlpha" operator="arithmetic" k2="-1" k3="1" result="shadowInnerInner1"></feComposite>
            <feColorMatrix values="0 0 0 0 0.772452777   0 0 0 0 1   0 0 0 0 0.57101753  0 0 0 0 0" type="matrix" in="shadowInnerInner1"></feColorMatrix>
        </filter>
        <path d="M231.488918,39 C238.621068,39 241.207358,39.7426049 243.814766,41.1370616 C246.422173,42.5315184 248.468482,44.577827 249.862938,47.1852344 C251.257395,49.7926418 252,52.3789317 252,59.5110816 L252,59.5110816 L252,138.488918 C252,145.621068 251.257395,148.207358 249.862938,150.814766 C248.468482,153.422173 246.422173,155.468482 243.814766,156.862938 C241.207358,158.257395 238.621068,159 231.488918,159 L231.488918,159 L194,159 L194,39 Z" id="path-6"></path>
        <path d="M194,39 L193.999,159 L101.511082,159 C94.5306796,159 91.9047545,158.288659 89.3516799,156.95106 L89.1852344,156.862938 C86.577827,155.468482 84.5315184,153.422173 83.1370616,150.814766 C81.7426049,148.207358 81,145.621068 81,138.488918 L81,138.488918 L81,59.5110816 C81,52.3789317 81.7426049,49.7926418 83.1370616,47.1852344 C84.5315184,44.577827 86.577827,42.5315184 89.1852344,41.1370616 C91.7926418,39.7426049 94.3789317,39 101.511082,39 L101.511082,39 L194,39 Z" id="path-8"></path>
    </defs>
    <g id="com.vivo.wallet" stroke="none" stroke-width="1" fill="none" fill-rule="evenodd">
        <g filter="url(#filter-1)" id="编组-2">
            <g transform="translate(21.000000, 21.000000)">
                <g id="编组" transform="translate(-0.000000, 0.000000)">
                    <g id="编组-11备份" transform="translate(-0.000000, 0.000000)">
                        <g id="形状结合" opacity="0.15">
                            <use fill="#FFFFFF" fill-rule="evenodd" xlink:href="#path-2"></use>
                            <use fill="black" fill-opacity="1" filter="url(#filter-3)" xlink:href="#path-2"></use>
                        </g>
                        <polygon id="矩形" fill-opacity="0.7" fill="#FFFFFF" opacity="0.05" transform="translate(301.000000, 99.000000) rotate(-720.000000) translate(-301.000000, -99.000000) " points="274 1.56319402e-13 328 1.56319402e-13 328 198 274 198"></polygon>
                        <polygon id="路径" fill-opacity="0.799961757" fill="#FFFFFF" opacity="0.1" points="274 1.47971996e-13 274 198 194 198 194 1.27897692e-13"></polygon>
                        <g id="形状结合" opacity="0.5">
                            <use fill="#FFFFFF" fill-rule="evenodd" xlink:href="#path-4"></use>
                            <use fill="black" fill-opacity="1" filter="url(#filter-5)" xlink:href="#path-4"></use>
                        </g>
                        <path d="M61.5332448,4.01465474e-14 L194,4.26325641e-14 L194,4.26325641e-14 L194,198 L61.5332448,198 C40.136795,198 32.3779253,195.772185 24.5557031,191.588815 C16.7334809,187.405445 10.5945551,181.266519 6.41118489,173.444297 C2.22781467,165.622075 9.62964878e-16,157.863205 -1.65734449e-15,136.466755 L1.65734449e-15,61.5332448 C-9.62964878e-16,40.136795 2.22781467,32.3779253 6.41118489,24.5557031 C10.5945551,16.7334809 16.7334809,10.5945551 24.5557031,6.41118489 C32.3779253,2.22781467 40.136795,4.40770115e-14 61.5332448,4.01465474e-14 Z" id="矩形" fill-opacity="0.799961757" fill="#FFFFFF" opacity="0.15" transform="translate(97.000000, 99.000000) rotate(-720.000000) translate(-97.000000, -99.000000) "></path>
                        <mask id="mask-7" fill="white">
                            <use xlink:href="#path-6"></use>
                        </mask>
                        <use id="形状结合" fill="#FFFFFF" xlink:href="#path-6"></use>
                        <mask id="mask-9" fill="white">
                            <use xlink:href="#path-8"></use>
                        </mask>
                        <use id="形状结合" fill="#FFFFFF" opacity="0.05" xlink:href="#path-8"></use>
                    </g>
                </g>
            </g>
        </g>
    </g>
</svg>