<?xml version="1.0" encoding="UTF-8"?>
<svg width="240px" height="240px" viewBox="0 0 240 240" version="1.1" xmlns="http://www.w3.org/2000/svg" xmlns:xlink="http://www.w3.org/1999/xlink">
    <title>com.android.bbkcalculator_b_s6_1x1_mc</title>
    <defs>
        <filter color-interpolation-filters="auto" id="filter-1">
            <feColorMatrix in="SourceGraphic" type="matrix" values="0 0 0 0 1.000000 0 0 0 0 1.000000 0 0 0 0 1.000000 0 0 0 1.000000 0"></feColorMatrix>
        </filter>
    </defs>
    <g id="com.android.bbkcalculator" stroke="none" stroke-width="1" fill="none" fill-rule="evenodd">
        <g id="编组-2" transform="translate(53.636364, 53.636364)">
            <g id="编组-9备份-2" transform="translate(74.545455, 74.545455)"></g>
            <g id="编组-10备份" transform="translate(84.545455, 88.181818)">
                <g id="编组-4备份" transform="translate(12.272727, 9.545455) rotate(-270.000000) translate(-12.272727, -9.545455) translate(2.727273, -2.727273)"></g>
            </g>
            <g id="编组-5备份" opacity="0.289999992" transform="translate(35.000000, 97.727273) rotate(-315.000000) translate(-35.000000, -97.727273) translate(22.727273, 85.454545)"></g>
            <g filter="url(#filter-1)" id="编组">
                <g>
                    <path d="M29.0909091,58.1818182 C45.1573745,58.1818182 58.1818182,45.1573745 58.1818182,29.0909091 C58.1818182,13.0244436 45.1573745,0 29.0909091,0 C13.0244436,0 0,13.0244436 0,29.0909091 C0,45.1573745 13.0244436,58.1818182 29.0909091,58.1818182 Z" id="椭圆形备份-10" fill-opacity="0.195394449" fill="#FFFFFF" opacity="0.400000006"></path>
                    <path d="M103.636364,58.1818182 C119.702829,58.1818182 132.727273,45.1573745 132.727273,29.0909091 C132.727273,13.0244436 119.702829,0 103.636364,0 C87.5698982,0 74.5454545,13.0244436 74.5454545,29.0909091 C74.5454545,45.1573745 87.5698982,58.1818182 103.636364,58.1818182 Z" id="椭圆形备份-16" fill-opacity="0.195394449" fill="#FFFFFF" opacity="0.400000006"></path>
                    <path d="M29.0909091,132.727273 C45.1573745,132.727273 58.1818182,119.702829 58.1818182,103.636364 C58.1818182,87.5698982 45.1573745,74.5454545 29.0909091,74.5454545 C13.0244436,74.5454545 0,87.5698982 0,103.636364 C0,119.702829 13.0244436,132.727273 29.0909091,132.727273 Z" id="椭圆形备份-17" fill-opacity="0.195394449" fill="#FFFFFF" opacity="0.400000006"></path>
                    <path d="M31.5618704,88.1818182 C31.9671062,88.1818182 32.1140544,88.2240116 32.2622026,88.3032421 C32.4103507,88.3824726 32.5266183,88.4987402 32.6058488,88.6468883 C32.6850793,88.7950365 32.7272727,88.9419848 32.7272727,89.3472205 L32.7263636,99.9998182 L43.3800522,100 C43.785288,100 43.9322363,100.042193 44.0803844,100.121424 C44.2285326,100.200654 44.3448001,100.316922 44.4240306,100.46507 C44.5032611,100.613218 44.5454545,100.760167 44.5454545,101.165402 L44.5454545,106.107325 C44.5454545,106.512561 44.5032611,106.659509 44.4240306,106.807657 C44.3448001,106.955805 44.2285326,107.072073 44.0803844,107.151303 C43.9322363,107.230534 43.785288,107.272727 43.3800522,107.272727 L32.7263636,107.271818 L32.7272727,117.925507 C32.7272727,118.330743 32.6850793,118.477691 32.6058488,118.625839 C32.5266183,118.773987 32.4103507,118.890255 32.2622026,118.969485 C32.1140544,119.048716 31.9671062,119.090909 31.5618704,119.090909 L26.6199478,119.090909 C26.214712,119.090909 26.0677637,119.048716 25.9196156,118.969485 C25.7714674,118.890255 25.6551999,118.773987 25.5759694,118.625839 C25.4967389,118.477691 25.4545455,118.330743 25.4545455,117.925507 L25.4543636,107.271818 L14.801766,107.272727 C14.3965302,107.272727 14.2495819,107.230534 14.1014338,107.151303 C13.9532856,107.072073 13.8370181,106.955805 13.7577876,106.807657 C13.6785571,106.659509 13.6363636,106.512561 13.6363636,106.107325 L13.6363636,101.165402 C13.6363636,100.760167 13.6785571,100.613218 13.7577876,100.46507 C13.8370181,100.316922 13.9532856,100.200654 14.1014338,100.121424 C14.2495819,100.042193 14.3965302,100 14.801766,100 L25.4543636,99.9998182 L25.4545455,89.3472205 C25.4545455,88.9419848 25.4967389,88.7950365 25.5759694,88.6468883 C25.6551999,88.4987402 25.7714674,88.3824726 25.9196156,88.3032421 C26.0677637,88.2240116 26.214712,88.1818182 26.6199478,88.1818182 L31.5618704,88.1818182 Z" id="形状结合备份" fill="#FFFFFF" opacity="0.600000024" transform="translate(29.090909, 103.636364) rotate(-315.000000) translate(-29.090909, -103.636364) "></path>
                    <path d="M89.3472205,25.4545455 L117.925507,25.4545455 C118.330743,25.4545455 118.477691,25.4967389 118.625839,25.5759694 C118.773987,25.6551999 118.890255,25.7714674 118.969485,25.9196156 C119.048716,26.0677637 119.090909,26.214712 119.090909,26.6199478 L119.090909,31.5618704 C119.090909,31.9671062 119.048716,32.1140544 118.969485,32.2622026 C118.890255,32.4103507 118.773987,32.5266183 118.625839,32.6058488 C118.477691,32.6850793 118.330743,32.7272727 117.925507,32.7272727 L89.3472205,32.7272727 C88.9419848,32.7272727 88.7950365,32.6850793 88.6468883,32.6058488 C88.4987402,32.5266183 88.3824726,32.4103507 88.3032421,32.2622026 C88.2240116,32.1140544 88.1818182,31.9671062 88.1818182,31.5618704 L88.1818182,26.6199478 C88.1818182,26.214712 88.2240116,26.0677637 88.3032421,25.9196156 C88.3824726,25.7714674 88.4987402,25.6551999 88.6468883,25.5759694 C88.7950365,25.4967389 88.9419848,25.4545455 89.3472205,25.4545455 Z" id="矩形备份-34" fill="#FFFFFF" opacity="0.600000024" transform="translate(103.636364, 29.090909) rotate(-540.000000) translate(-103.636364, -29.090909) "></path>
                    <path d="M31.5618704,13.6363636 C31.9671062,13.6363636 32.1140544,13.6785571 32.2622026,13.7577876 C32.4103507,13.8370181 32.5266183,13.9532856 32.6058488,14.1014338 C32.6850793,14.2495819 32.7272727,14.3965302 32.7272727,14.801766 L32.7263636,25.4543636 L43.3800522,25.4545455 C43.785288,25.4545455 43.9322363,25.4967389 44.0803844,25.5759694 C44.2285326,25.6551999 44.3448001,25.7714674 44.4240306,25.9196156 C44.5032611,26.0677637 44.5454545,26.214712 44.5454545,26.6199478 L44.5454545,31.5618704 C44.5454545,31.9671062 44.5032611,32.1140544 44.4240306,32.2622026 C44.3448001,32.4103507 44.2285326,32.5266183 44.0803844,32.6058488 C43.9322363,32.6850793 43.785288,32.7272727 43.3800522,32.7272727 L32.7263636,32.7263636 L32.7272727,43.3800522 C32.7272727,43.785288 32.6850793,43.9322363 32.6058488,44.0803844 C32.5266183,44.2285326 32.4103507,44.3448001 32.2622026,44.4240306 C32.1140544,44.5032611 31.9671062,44.5454545 31.5618704,44.5454545 L26.6199478,44.5454545 C26.214712,44.5454545 26.0677637,44.5032611 25.9196156,44.4240306 C25.7714674,44.3448001 25.6551999,44.2285326 25.5759694,44.0803844 C25.4967389,43.9322363 25.4545455,43.785288 25.4545455,43.3800522 L25.4543636,32.7263636 L14.801766,32.7272727 C14.3965302,32.7272727 14.2495819,32.6850793 14.1014338,32.6058488 C13.9532856,32.5266183 13.8370181,32.4103507 13.7577876,32.2622026 C13.6785571,32.1140544 13.6363636,31.9671062 13.6363636,31.5618704 L13.6363636,26.6199478 C13.6363636,26.214712 13.6785571,26.0677637 13.7577876,25.9196156 C13.8370181,25.7714674 13.9532856,25.6551999 14.1014338,25.5759694 C14.2495819,25.4967389 14.3965302,25.4545455 14.801766,25.4545455 L25.4543636,25.4543636 L25.4545455,14.801766 C25.4545455,14.3965302 25.4967389,14.2495819 25.5759694,14.1014338 C25.6551999,13.9532856 25.7714674,13.8370181 25.9196156,13.7577876 C26.0677637,13.6785571 26.214712,13.6363636 26.6199478,13.6363636 L31.5618704,13.6363636 Z" id="形状结合" fill="#FFFFFF" opacity="0.600000024"></path>
                </g>
            </g>
        </g>
    </g>
</svg>