<?xml version="1.0" encoding="UTF-8"?>
<svg width="240px" height="480px" viewBox="0 0 240 480" version="1.1" xmlns="http://www.w3.org/2000/svg" xmlns:xlink="http://www.w3.org/1999/xlink">
    <title>com.android.filemanager_b_s5_1x2_1_mc</title>
    <g id="com.android.filemanager" stroke="none" stroke-width="1" fill="none" fill-rule="evenodd">
        <path d="M219,248.892 L200.349132,248.892795 C195.536864,248.892795 191.407052,245.465246 190.520353,240.735374 L190.520353,240.735374 L189.440124,234.973163 C188.464756,229.770304 183.921962,226 178.628467,226 L178.628467,226 L86,226 L86,126.383311 C86,121.034199 86.5569537,119.094481 87.6027962,117.138926 C88.6486388,115.18337 90.1833702,113.648639 92.1389258,112.602796 C94.0944813,111.556954 96.0341988,111 101.383311,111 L219,111 L219,248.892 Z" id="形状结合" fill="#D5D5D5"></path>
        <path d="M124.383311,91 L219,91 L219,91 L219,111 L109,111 L109,106.383311 C109,101.034199 109.556954,99.0944813 110.602796,97.1389258 C111.648639,95.1833702 113.18337,93.6486388 115.138926,92.6027962 C117.094481,91.5569537 119.034199,91 124.383311,91 Z" id="矩形" fill="#D5D5D5" opacity="0.5"></path>
    </g>
</svg>