<?xml version="1.0" encoding="UTF-8"?>
<svg width="240px" height="240px" viewBox="0 0 240 240" version="1.1" xmlns="http://www.w3.org/2000/svg" xmlns:xlink="http://www.w3.org/1999/xlink">
    <title>com.vivo.minigamecenter_b_s5_1x1_mc</title>
    <defs>
        <filter color-interpolation-filters="auto" id="filter-1">
            <feColorMatrix in="SourceGraphic" type="matrix" values="0 0 0 0 0.000000 0 0 0 0 0.941176 0 0 0 0 0.321569 0 0 0 1.000000 0"></feColorMatrix>
        </filter>
        <path d="M61.5332448,-2.48601674e-15 L136.466755,2.48601674e-15 C157.863205,-1.44444732e-15 165.622075,2.22781467 173.444297,6.41118489 C181.266519,10.5945551 187.405445,16.7334809 191.588815,24.5557031 C195.772185,32.3779253 198,40.136795 198,61.5332448 L198,136.466755 C198,157.863205 195.772185,165.622075 191.588815,173.444297 C187.405445,181.266519 181.266519,187.405445 173.444297,191.588815 C165.622075,195.772185 157.863205,198 136.466755,198 L61.5332448,198 C40.136795,198 32.3779253,195.772185 24.5557031,191.588815 C16.7334809,187.405445 10.5945551,181.266519 6.41118489,173.444297 C2.22781467,165.622075 9.62964878e-16,157.863205 -1.65734449e-15,136.466755 L1.65734449e-15,61.5332448 C-9.62964878e-16,40.136795 2.22781467,32.3779253 6.41118489,24.5557031 C10.5945551,16.7334809 16.7334809,10.5945551 24.5557031,6.41118489 C32.3779253,2.22781467 40.136795,1.44444732e-15 61.5332448,-2.48601674e-15 Z" id="path-2"></path>
        <path d="M42.4999751,0.760803923 C42.6184763,0.862819395 42.7291962,0.973539273 42.8312116,1.09204049 L56.1260494,16.53533 C57.1975118,17.7799412 58.9555357,18.1799893 60.4600466,17.5215552 L76.4991914,10.5021839 C78.0887523,9.80652843 79.9412862,10.531182 80.6369416,12.1207429 C80.8107645,12.5179251 80.9004991,12.9467856 80.9004991,13.3803385 L80.9,51.967 L74.5350151,59.2899855 C70.6004373,63.8161996 71.0039464,70.6348091 75.3905133,74.6686604 L75.6250612,74.8783697 L80.9,79.464 L80.9004991,89.3132159 L20.1967208,89.3132159 C9.04237992,89.3132159 -1.75722726e-12,80.270836 -1.76214598e-12,69.1164951 L-1.76214598e-12,13.3803385 C-1.7614703e-12,11.6452188 1.40659243,10.2386264 3.14171213,10.2386264 C3.57526502,10.2386264 4.00412548,10.328361 4.40130771,10.5021839 L20.4404525,17.5215552 C21.9449635,18.1799893 23.7029873,17.7799412 24.7744497,16.53533 L38.0692875,1.09204049 C39.2013196,-0.222928555 41.185006,-0.371228219 42.4999751,0.760803923 Z M66.1295126,35.7032675 L65.9879538,35.7965356 L55.1482237,43.5239593 L25.5596152,44.0117361 L13.9002451,36.4774983 C13.5331365,36.2402742 13.1053453,36.1140829 12.6682595,36.1140829 C11.4668443,36.1140829 10.4834266,37.0474416 10.4035609,38.2286046 L10.3983241,38.3840183 L10.3983241,63.5209601 C10.3983241,67.4060095 13.4835043,70.5704764 17.337524,70.6980202 L17.5793804,70.7020164 L62.3944848,70.7020164 C66.2795341,70.7020164 69.444001,67.6168363 69.5715448,63.7628165 L69.5755411,63.5209601 L69.5755411,37.6448864 C69.5755411,37.1725018 69.4281662,36.7118854 69.1539564,36.3272347 C68.4593156,35.3528194 67.1362054,35.092035 66.1295126,35.7032675 Z" id="path-4"></path>
        <path d="M40.4761667,0.724575165 C40.589025,0.821732757 40.6944725,0.92718026 40.7916301,1.04003856 L53.4533804,15.7479334 C54.4738208,16.9332774 56.1481292,17.3142756 57.5809968,16.6871954 L72.8563728,10.0020799 C74.3702403,9.33955089 76.1345583,10.0296971 76.7970873,11.5435647 C76.9626328,11.9218335 77.0480944,12.330272 77.0480944,12.7431795 L77.0480944,66.1814366 C77.0480944,76.6078928 68.5957816,85.0602056 58.1693254,85.0602056 L-1.62145852e-11,85.0602056 L0.000581919619,84.7478119 C3.77156746,81.5599666 5.05406311,76.1098321 2.79049421,71.4688281 L2.79049421,71.4688281 L-1.31095135e-11,65.747 L-1.62145852e-11,12.7431795 C-1.62130112e-11,11.0906846 1.33961184,9.75107273 2.99210679,9.75107273 C3.4050143,9.75107273 3.81345283,9.83653431 4.19172163,10.0020799 L19.4670976,16.6871954 C20.8999652,17.3142756 22.5742736,16.9332774 23.594714,15.7479334 L36.2564643,1.04003856 C37.3345901,-0.21231291 39.2238153,-0.353550685 40.4761667,0.724575165 Z M62.9870149,33.9991647 L62.8456703,34.0919387 L52.5221178,41.4513898 L24.3424907,41.9159391 L13.2383286,34.7404745 C12.8887015,34.5145469 12.4812812,34.3943646 12.0650091,34.3943646 C10.922967,34.3943646 9.98775751,35.2799201 9.90859382,36.4018179 L9.90316581,36.5562079 L9.90316581,60.4961525 C9.90316581,64.1945936 12.8388826,67.2073613 16.5071488,67.331288 L16.742267,67.3352538 L59.4233188,67.3352538 C63.1217599,67.3352538 66.1345276,64.3995369 66.2584543,60.7312708 L66.2624201,60.4961525 L66.2624201,35.8522728 C66.2624201,35.4023827 66.122063,34.9637004 65.8609109,34.5973663 C65.2008483,33.6714562 63.9449549,33.4221156 62.9870149,33.9991647 Z" id="path-6"></path>
        <path d="M65.3951674,1.17065715 C65.5775065,1.32762945 65.7478723,1.49799532 65.9048446,1.68033441 L86.361754,25.4430896 C88.0104247,27.3581862 90.7155149,27.9737445 93.030522,26.9606048 L117.710126,16.1598229 C120.156001,15.0894104 123.006514,16.2044427 124.076927,18.6503171 C124.34439,19.2614656 124.482465,19.9213578 124.482465,20.5884703 L124.482465,106.92579 C124.482465,123.771255 110.826518,137.427203 93.9810529,137.427203 L31.0769109,137.427203 C13.9136069,137.427203 -3.6353603e-12,123.513596 -3.64508423e-12,106.350292 L-3.64508423e-12,20.5884703 C-3.64452302e-12,17.918623 2.16433886,15.7542842 4.83418614,15.7542842 C5.50129862,15.7542842 6.1611908,15.8923599 6.77233937,16.1598229 L31.4519435,26.9606048 C33.7669506,27.9737445 36.4720408,27.3581862 38.1207115,25.4430896 L58.5776209,1.68033441 C60.3194908,-0.343022559 63.3718104,-0.571212841 65.3951674,1.17065715 Z M106.407934,55.8971055 C105.288185,54.326365 103.107113,53.9607642 101.536372,55.0805132 L101.536372,55.0805132 L84.8571631,66.9707828 L39.328854,67.7213302 L21.3884561,56.1283177 C20.8235823,55.7632985 20.1653353,55.5691265 19.4927868,55.5691265 C17.563781,55.5691265 16.0000128,57.1328947 16.0000128,59.0619005 L16.0000128,59.0619005 L16.0000128,97.7403825 C16.0000128,103.842891 20.947073,108.789951 27.0495811,108.789951 L27.0495811,108.789951 L96.0070627,108.789951 C102.109571,108.789951 107.056631,103.842891 107.056631,97.7403825 L107.056631,97.7403825 L107.056631,57.9245904 C107.056631,57.1977272 106.829864,56.4889718 106.407934,55.8971055 Z" id="path-8"></path>
    </defs>
    <g id="com.vivo.minigamecenter" stroke="none" stroke-width="1" fill="none" fill-rule="evenodd">
        <g filter="url(#filter-1)" id="秒玩小游戏-新备份-2">
            <g transform="translate(21.000000, 21.000000)">
                <mask id="mask-3" fill="white">
                    <use xlink:href="#path-2"></use>
                </mask>
                <g id="蒙版"></g>
                <g id="编组-6" mask="url(#mask-3)">
                    <g transform="translate(-67.331058, 26.853929)" id="编组-21">
                        <path d="M206.88732,59.3866105 C210.753314,59.3866105 213.88732,56.2526037 213.88732,52.3866105 C213.88732,48.5206172 210.753314,45.3866105 206.88732,45.3866105 C203.021327,45.3866105 199.88732,48.5206172 199.88732,52.3866105 C199.88732,56.2526037 203.021327,59.3866105 206.88732,59.3866105 Z" id="椭圆形备份-35" fill="#EFBCFF" fill-rule="nonzero"></path>
                        <path d="M86.4864221,83.4667901 C90.3524154,83.4667901 93.4864221,80.3327834 93.4864221,76.4667901 C93.4864221,72.6007969 90.3524154,69.4667901 86.4864221,69.4667901 C82.6204289,69.4667901 79.4864221,72.6007969 79.4864221,76.4667901 C79.4864221,80.3327834 82.6204289,83.4667901 86.4864221,83.4667901 Z" id="椭圆形备份-36" fill="#8FE7FD" fill-rule="nonzero" opacity="0.5"></path>
                        <path d="M255.04768,96.1405689 C258.913673,96.1405689 262.04768,93.0065622 262.04768,89.1405689 C262.04768,85.2745757 258.913673,82.1405689 255.04768,82.1405689 C251.181687,82.1405689 248.04768,85.2745757 248.04768,89.1405689 C248.04768,93.0065622 251.181687,96.1405689 255.04768,96.1405689 Z" id="椭圆形备份-36" fill="#FD928F" fill-rule="nonzero" opacity="0.5"></path>
                        <g id="粉色icon" transform="translate(78.519841, 145.691717) rotate(-63.000000) translate(-78.519841, -145.691717) translate(21.160594, 86.792836)">
                            <g id="编组备份" transform="translate(57.359248, 58.898882) rotate(30.000000) translate(-57.359248, -58.898882) translate(16.908998, 14.242274)">
                                <g id="Mask-Copy备份-5" transform="translate(-0.000000, -0.000000)">
                                    <mask id="mask-5" fill="white">
                                        <use xlink:href="#path-4"></use>
                                    </mask>
                                    <use id="形状结合" fill="#F86EC6" opacity="0.5" xlink:href="#path-4"></use>
                                </g>
                            </g>
                            <circle id="椭圆形" fill="#000000" cx="38.1019784" cy="62.6554707" r="5.29651603"></circle>
                            <circle id="椭圆形备份-7" fill="#000000" opacity="0.5" cx="61.5486631" cy="76.251092" r="5.29651603"></circle>
                        </g>
                        <g id="紫色icon" opacity="0.900000036" transform="translate(251.052889, 148.063697) rotate(4.000000) translate(-251.052889, -148.063697) translate(196.425034, 91.969524)">
                            <g id="编组备份" transform="translate(54.627855, 56.094173) rotate(30.000000) translate(-54.627855, -56.094173) translate(16.103808, 13.564070)">
                                <g id="Mask-Copy备份-5" transform="translate(-0.000000, 0.000000)">
                                    <mask id="mask-7" fill="white">
                                        <use xlink:href="#path-6"></use>
                                    </mask>
                                    <use id="形状结合" fill="#4710FF" opacity="0.5" xlink:href="#path-6"></use>
                                </g>
                            </g>
                            <circle id="椭圆形备份" fill="#000000" cx="62.2798389" cy="75.3805762" r="5.04430098"></circle>
                            <circle id="椭圆形备份-6" fill="#000000" opacity="0.5" cx="37.6913427" cy="61.2746877" r="5.04430098"></circle>
                        </g>
                        <g id="黄色icon" transform="translate(164.906590, 117.091646) rotate(-22.000000) translate(-164.906590, -117.091646) translate(76.647301, 26.463305)">
                            <g id="编组备份" transform="translate(88.259289, 90.628341) rotate(30.000000) translate(-88.259289, -90.628341) translate(26.018057, 21.914739)">
                                <g id="Mask-Copy备份-5" transform="translate(-0.000000, 0.000000)">
                                    <g id="编组" transform="translate(-0.000000, 0.000000)">
                                        <mask id="mask-9" fill="white">
                                            <use xlink:href="#path-8"></use>
                                        </mask>
                                        <use id="形状结合" fill="#FFD82E" xlink:href="#path-8"></use>
                                        <circle id="椭圆形" fill="#000000" transform="translate(39.469868, 88.535175) rotate(-30.000000) translate(-39.469868, -88.535175) " cx="39.4698682" cy="88.5351748" r="8.14980601"></circle>
                                        <circle id="椭圆形备份" fill="#000000" transform="translate(85.393866, 88.908329) rotate(-30.000000) translate(-85.393866, -88.908329) " cx="85.3938664" cy="88.9083289" r="8.14980601"></circle>
                                    </g>
                                </g>
                            </g>
                        </g>
                    </g>
                </g>
            </g>
        </g>
    </g>
</svg>