<?xml version="1.0" encoding="UTF-8"?>
<svg width="480px" height="480px" viewBox="0 0 480 480" version="1.1" xmlns="http://www.w3.org/2000/svg" xmlns:xlink="http://www.w3.org/1999/xlink">
    <title>com.android.mms_b_s5_2x2_1_mc</title>
    <defs>
        <path d="M156.489514,3.00524292 C160.145436,4.96045132 163.01693,7.82696186 164.977494,11.4782717 L164.985,11.1503098 L179.476,45 L95.1,45 C82.4698001,45 72.207086,55.1364121 72.0030947,67.7179993 L72,68.1 L72,125.999 L139.156292,126 L139.156292,126 L37.6447306,125.999973 C31.1227069,127.146858 25.1506012,129.889798 20.1460732,133.811132 L8.06789161,143.607173 C7.18610635,144.322275 6.08530467,144.712533 4.95,144.712533 C2.28813284,144.712533 0.117000067,142.61145 0.00457331871,139.977254 L0,139.762533 L7.76880231e-16,28.8437085 C-4.51389787e-16,18.8141227 1.04428813,15.1771525 3.00524292,11.5104858 C4.96619771,7.84381917 7.84381917,4.96619771 11.5104858,3.00524292 C15.112825,1.07869084 18.6865005,0.0369238267 28.3217036,0.000963565837 L139.156292,1.16532035e-15 C149.185877,-6.7708468e-16 152.822847,1.04428813 156.489514,3.00524292 Z M166.314,111.577 L166.211415,111.858327 C165.856393,112.787493 165.450311,113.637702 164.994757,114.489514 C163.033802,118.156181 160.156181,121.033802 156.489514,122.994757 C155.689933,123.422378 154.891765,123.806407 154.02841,124.145523 L153.547,124.326 L153.95055,124.159641 C159.430705,121.823676 163.823676,117.430719 166.159658,111.95111 L166.314,111.577 Z M143.25,18 C139.522078,18 136.5,21.0220779 136.5,24.75 C136.5,28.4779221 139.522078,31.5 143.25,31.5 C146.977922,31.5 150,28.4779221 150,24.75 C150,21.0220779 146.977922,18 143.25,18 Z" id="path-1"></path>
        <path d="M107.476,0 L115.202652,18.0479072 C116.832821,21.8557725 115.067449,26.2641699 111.259583,27.8943384 C110.32682,28.2936594 109.322731,28.4995635 108.308086,28.4995883 L96,28.5 L96,52.1562915 C96,59.5991355 95.4249148,63.5215923 94.3268989,66.548238 C91.9828067,72.3501321 87.3501321,76.9828067 81.5476369,79.3268799 C78.5215923,80.4249148 74.5991355,81 67.1562915,81 L0,80.999 L1.70530257e-12,23.1 C1.7072929e-12,10.3422223 10.3422223,1.82133297e-12 23.1,1.8189894e-12 L107.476,0 Z" id="path-3"></path>
    </defs>
    <g id="com.android.mms" stroke="none" stroke-width="1" fill="none" fill-rule="evenodd">
        <g id="矩形" transform="translate(128.000000, 146.000000)">
            <mask id="mask-2" fill="white">
                <use xlink:href="#path-1"></use>
            </mask>
            <use id="形状结合" fill="#4194FD" xlink:href="#path-1"></use>
        </g>
        <g id="编组" opacity="0.5" transform="translate(200.000000, 191.000000)">
            <g id="矩形" transform="translate(0.000000, 0.000000)">
                <mask id="mask-4" fill="white">
                    <use xlink:href="#path-3"></use>
                </mask>
                <use id="形状结合" fill="#053777" xlink:href="#path-3"></use>
            </g>
        </g>
    </g>
</svg>