<?xml version="1.0" encoding="UTF-8"?>
<svg width="240px" height="240px" viewBox="0 0 240 240" version="1.1" xmlns="http://www.w3.org/2000/svg" xmlns:xlink="http://www.w3.org/1999/xlink">
    <title>com.vivo.compass_b_s6_1x1_sc</title>
    <g id="com.vivo.compass" stroke="none" stroke-width="1" fill="none" fill-rule="evenodd">
        <g id="编组" transform="translate(108.128585, 57.742771)" fill="#EE5B5B">
            <g id="编组-2备份-3" transform="translate(36.964180, 36.964180) rotate(-315.000000) translate(-36.964180, -36.964180) translate(20.879489, 0.773626)">
                <path d="M18.3995649,10.416935 L32.169381,72.3811073 L32.169381,72.3811073 L-1.13686838e-13,72.3811073 L13.7698161,10.416935 C14.0539205,9.13846513 15.3206372,8.33237268 16.599107,8.61647709 C17.4978978,8.81620836 18.1998337,9.51814428 18.3995649,10.416935 Z" id="三角形"></path>
            </g>
        </g>
    </g>
</svg>