<?xml version="1.0" encoding="UTF-8"?>
<svg width="240px" height="480px" viewBox="0 0 240 480" version="1.1" xmlns="http://www.w3.org/2000/svg" xmlns:xlink="http://www.w3.org/1999/xlink">
    <title>com.android.filemanager_b_s5_1x2_0_sc</title>
    <g id="com.android.filemanager" stroke="none" stroke-width="1" fill="none" fill-rule="evenodd">
        <path d="M104.999881,225.999 L178.628467,226 C183.921962,226 188.464756,229.770304 189.440124,234.973163 L190.524422,240.757078 C191.409303,245.477258 195.524631,248.901892 200.327022,248.914465 L218.999881,248.963381 L219,397.466755 C219,415.272841 217.457119,423.63417 214.52827,430.447163 L214.30601,430.955358 C214.193583,431.208127 214.079213,431.458996 213.962908,431.708383 L213.724888,432.211195 C213.363902,432.96276 212.985134,433.703244 212.588815,434.444297 C208.405445,442.266519 202.266519,448.405445 194.444297,452.588815 L193.950218,452.850425 L193.703002,452.979275 L193.703002,452.979275 L193.207738,453.233056 C185.850243,456.95866 177.915459,458.955349 158.137915,458.99926 L82.5332448,459 C65.1146289,459 56.7341967,457.523536 49.999881,454.7175 L49.999881,226 L105,226 L104.999881,225.999 Z" id="形状结合" fill="#FFFFFF"></path>
        <path d="M85.9999073,166.967381 L86,226 L50,225.999381 L50.0007548,219.191612 L50.0126943,217.298933 L50.0285351,216.083717 L50.0506807,214.904694 L50.0956811,213.202025 L50.1335097,212.109493 L50.1775797,211.049961 L50.227873,210.022518 L50.2843716,209.026252 C50.2943041,208.862756 50.3044944,208.70052 50.3149421,208.539526 L50.3807145,207.588315 L50.4526469,206.666001 L50.530721,205.771673 L50.6149187,204.904417 L50.7052221,204.063323 L50.8016128,203.247478 L50.9040729,202.45597 L51.0125841,201.687888 L51.1271284,200.942319 C51.1467208,200.819883 51.1665639,200.698347 51.1866573,200.577692 L51.3102172,199.864183 L51.4397648,199.170909 L51.5752821,198.496955 L51.716751,197.841412 C51.7408241,197.733638 51.7651444,197.626594 51.7897115,197.520259 L51.9400736,196.89062 C51.9656267,196.78705 51.9914258,196.684152 52.0174707,196.581907 L52.1766853,195.976121 L52.341779,195.385098 L52.5127335,194.807924 L52.6895309,194.243689 L52.8721529,193.69148 C52.9030743,193.600397 52.9342376,193.509777 52.9656425,193.419601 L53.1569676,192.883722 L53.4547858,192.097892 L53.6605253,191.58467 L53.8719988,191.078913 L54.1999208,190.332284 L54.4256502,189.841205 C54.4637448,189.75974 54.5020757,189.678453 54.5406425,189.597325 L54.7688715,189.124555 C55.0382696,188.574778 55.3186147,188.030685 55.6097868,187.48624 C59.2702357,180.641796 64.6417958,175.270236 71.4862402,171.609787 L71.9529617,171.362865 L72.4203558,171.121263 C76.157112,169.213518 80.0389312,167.81608 85.9999073,166.967381 Z" id="形状结合" fill="#FFFFFF" opacity="0.600000024"></path>
    </g>
</svg>