<?xml version="1.0" encoding="UTF-8"?>
<svg width="480px" height="480px" viewBox="0 0 480 480" version="1.1" xmlns="http://www.w3.org/2000/svg" xmlns:xlink="http://www.w3.org/1999/xlink">
    <title>com.android.bbkmusic_b_s5_2x2_mc</title>
    <g id="com.android.bbkmusic" stroke="none" stroke-width="1" fill="none" fill-rule="evenodd">
        <path d="M241.204364,217 C227.324923,217 216.073412,228.282424 216.073412,242.2 C216.073412,256.117576 227.324923,267.4 241.204364,267.4 C255.083806,267.4 266.335317,256.117576 266.335317,242.2 C266.335317,228.282424 255.083806,217 241.204364,217 Z M241.204364,315 C201.87928,315 170,283.033131 170,243.6 C170,204.166869 201.87928,172.2 241.204364,172.2 C250.20611,172.2 258.817711,173.874998 266.746108,176.931129 L266.334146,176.773808 L266.334146,176.773808 L266.333395,152.111355 L266.362745,152.109867 C266.69488,147.690149 269.815343,143.932794 274.160224,142.845481 L328.788698,129.174614 C331.8996,128.396106 335.05086,130.293813 335.827236,133.413263 C335.94198,133.874303 336,134.347696 336,134.822877 L336,170.062248 C336,174.070525 333.278644,177.564079 329.400302,178.534641 L316.164685,181.824498 C313.957937,182.373009 312.408729,184.35443 312.408729,186.628326 L312.408,243.599 L312.402995,242.684474 C312.402623,242.65477 312.402233,242.62507 312.401824,242.595374 L312.408729,243.6 L312.408729,243.6 L312.408729,243.8 L312.406395,243.8 L312.408729,243.6 C312.408729,283.033131 280.529449,315 241.204364,315 Z" id="形状结合" fill="#FFFFFF"></path>
        <path d="M240,60 C339.411255,60 420,140.588745 420,240 C420,339.411255 339.411255,420 240,420 C140.588745,420 60,339.411255 60,240 C60,140.588745 140.588745,60 240,60 Z M240,103.875 C164.820238,103.875 103.875,164.820238 103.875,240 C103.875,315.179762 164.820238,376.125 240,376.125 C315.179762,376.125 376.125,315.179762 376.125,240 C376.125,164.820238 315.179762,103.875 240,103.875 Z" id="形状结合" fill-opacity="0.12" fill="#FFFFFF"></path>
    </g>
</svg>