<?xml version="1.0" encoding="UTF-8"?>
<svg width="240px" height="240px" viewBox="0 0 240 240" version="1.1" xmlns="http://www.w3.org/2000/svg" xmlns:xlink="http://www.w3.org/1999/xlink">
    <title>com.android.filemanager_b_s5_1x1_0_mc</title>
    <defs>
        <path d="M68.6284672,34 C73.9219622,34 78.4647562,37.7703038 79.4401245,42.9731631 L80.5203531,48.7353741 C81.4070515,53.4652463 85.5368643,56.8927951 90.3491324,56.8927951 L150,56.892 L150,124.616689 C150,129.965801 149.443046,131.905519 148.397204,133.861074 C147.351361,135.81663 145.81663,137.351361 143.861074,138.397204 C141.905519,139.443046 139.965801,140 134.616689,140 L15.3833112,140 C10.0341988,140 8.09448133,139.443046 6.13892578,138.397204 C4.18337022,137.351361 2.64863878,135.81663 1.60279622,133.861074 C0.556953667,131.905519 2.4074122e-16,129.965801 -4.14336123e-16,124.616689 L0,34 L68.6284672,34 Z" id="path-1"></path>
    </defs>
    <g id="com.android.filemanager" stroke="none" stroke-width="1" fill="none" fill-rule="evenodd">
        <g id="编组" transform="translate(45.000000, 50.000000)">
            <path d="M143.861074,1.60279622 C145.81663,2.64863878 147.351361,4.18337022 148.397204,6.13892578 C149.443046,8.09448133 150,10.0341988 150,15.3833112 L150,56.892 L90.3491324,56.8927951 C85.6294079,56.8927951 81.5661428,53.5958075 80.5750887,49.0067913 L80.5203531,48.7353741 L79.4401245,42.9731631 C78.4647562,37.7703038 73.9219622,34 68.6284672,34 L68.6284672,34 L0,34 L4.14336123e-16,15.3833112 C-2.4074122e-16,10.0341988 0.556953667,8.09448133 1.60279622,6.13892578 C2.64863878,4.18337022 4.18337022,2.64863878 6.13892578,1.60279622 C8.09448133,0.556953667 10.0341988,6.66826157e-13 15.3833112,6.60108617e-13 L134.616689,6.64978962e-13 C139.965801,6.63996346e-13 141.905519,0.556953667 143.861074,1.60279622 Z" id="形状结合" fill="#FFFFFF"></path>
            <mask id="mask-2" fill="white">
                <use xlink:href="#path-1"></use>
            </mask>
            <use id="形状结合" fill="#FFFFFF" opacity="0.1" xlink:href="#path-1"></use>
        </g>
    </g>
</svg>