<?xml version="1.0" encoding="UTF-8"?>
<svg width="480px" height="480px" viewBox="0 0 480 480" version="1.1" xmlns="http://www.w3.org/2000/svg" xmlns:xlink="http://www.w3.org/1999/xlink">
    <title>com.android.filemanager_b_s5_2x2_1_mc</title>
    <g id="com.android.filemanager" stroke="none" stroke-width="1" fill="none" fill-rule="evenodd">
        <g id="矩形" transform="translate(139.000000, 112.000000)">
            <path d="M320,0 L320,167.488918 C320,168.827672 319.973835,170.006257 319.922106,171.054878 L319.921875,147.089322 L290.731624,147.089322 C284.103104,147.089322 278.399454,142.444286 277.034923,135.987886 L276.971329,135.668911 L275.451642,127.562452 C274.107144,120.3905 267.920727,115.162888 260.656599,115.003736 L260.315318,115 L0,115 L5.52448164e-16,20.5110816 C-3.20988293e-16,13.3789317 0.742604889,10.7926418 2.13706163,8.18523437 C3.53151837,5.57782696 5.57782696,3.53151837 8.18523437,2.13706163 C10.7926418,0.742604889 13.3789317,4.81482439e-16 20.5110816,-8.28672246e-16 L320,0 Z M192.42202,68.1010101 L32.9859053,68.1010101 C32.5401459,68.1010101 32.3785028,68.1474229 32.2155399,68.2345765 C32.0525769,68.32173 31.9246826,68.4496243 31.8375291,68.6125872 C31.7503755,68.7755502 31.7039627,68.9371933 31.7039627,69.3829527 L31.7039627,69.3829527 L31.7039627,74.8190675 C31.7039627,75.2648269 31.7503755,75.42647 31.8375291,75.589433 C31.9246826,75.7523959 32.0525769,75.8802902 32.2155399,75.9674437 C32.3785028,76.0545973 32.5401459,76.1010101 32.9859053,76.1010101 L32.9859053,76.1010101 L192.42202,76.1010101 C192.867779,76.1010101 193.029423,76.0545973 193.192386,75.9674437 C193.355349,75.8802902 193.483243,75.7523959 193.570396,75.589433 C193.65755,75.42647 193.703963,75.2648269 193.703963,74.8190675 L193.703963,74.8190675 L193.703963,69.3829527 C193.703963,68.9371933 193.65755,68.7755502 193.570396,68.6125872 C193.483243,68.4496243 193.355349,68.32173 193.192386,68.2345765 C193.029423,68.1474229 192.867779,68.1010101 192.42202,68.1010101 L192.42202,68.1010101 Z M42.1375417,35.7336566 L32.4500417,35.7336566 L32.4500417,50.7336566 L35.0733824,50.7336566 L35.0733824,44.8463509 L41.3488249,44.8463509 L41.3488249,42.2232939 L35.0733824,42.2232939 L35.0733824,38.3761436 L42.1375417,38.3761436 L42.1375417,35.7336566 Z M46.9812917,39.7336566 L44.0750417,39.7336566 L44.0750417,50.7336566 L46.9812917,50.7336566 L46.9812917,39.7336566 Z M50.8562917,35.7336566 L47.9500417,35.7336566 L47.9500417,50.7336566 L50.8562917,50.7336566 L50.8562917,35.7336566 Z M57.6718945,38.7336566 C56.6184075,38.7336566 55.7252338,38.9965517 54.9923733,39.5223421 C54.2595127,40.0481324 53.7098674,40.7602789 53.3434371,41.6587814 C52.9770068,42.5572839 52.7937917,43.5656033 52.7937917,44.6837398 C52.7937917,45.8418096 52.9827323,46.8767514 53.3606135,47.7885651 C53.7384947,48.7003787 54.3053165,49.4191807 55.0610789,49.944971 C55.8168413,50.4707614 56.732917,50.7336566 57.8093059,50.7336566 C58.9773023,50.7336566 59.9391818,50.4541225 60.6949442,49.8950542 C61.3967236,49.3759195 61.9257164,48.5296768 62.2819226,47.3563263 L62.2819226,47.3563263 L62.3610568,47.0797464 L59.9735346,47.0797464 L59.8986945,47.245185 C59.7367454,47.5646525 59.5011831,47.8156627 59.1920076,47.9982156 C58.8313028,48.211194 58.3704022,48.3176832 57.8093059,48.3176832 C57.3169152,48.3176832 56.8875048,48.2045384 56.5210745,47.9782489 C56.1546442,47.7519594 55.8740961,47.445803 55.67943,47.0597797 C55.5172083,46.7380936 55.426555,46.3932979 55.40747,46.0253926 L55.40747,46.0253926 L55.4046073,45.8018762 L62.4812917,45.8018762 L62.4812917,44.5639394 L62.474824,44.2081127 C62.4403298,43.2687729 62.2678588,42.4056847 61.9574109,41.6188479 C61.6081571,40.7336566 61.0728254,40.0314935 60.3514158,39.5123587 C59.6300062,38.993224 58.7368325,38.7336566 57.6718945,38.7336566 Z M72.2039627,46.2663434 L69.2039627,46.2663434 L69.2039627,50.2663434 L72.2039627,50.2663434 L72.2039627,46.2663434 Z M58.1497543,41.7336566 C58.6693904,41.7336566 59.1116996,41.8364343 59.476682,42.0419899 C59.8416645,42.2475455 60.1107617,42.503101 60.2839737,42.8086566 C60.4571857,43.1142121 60.5437917,43.4225455 60.5437917,43.7336566 L60.5437917,43.7336566 L55.7000417,43.7336566 L55.7075166,43.5783325 C55.732433,43.3198448 55.8196405,43.0632862 55.9691389,42.8086566 C56.1485371,42.503101 56.4207274,42.2475455 56.7857098,42.0419899 C57.1506922,41.8364343 57.6053738,41.7336566 58.1497543,41.7336566 Z M45.5369735,34.7336566 C45.1025038,34.7336566 44.7502311,34.869459 44.4801553,35.141064 C44.2100796,35.4126689 44.0750417,35.7768664 44.0750417,36.2336566 C44.0750417,36.6534097 44.2130152,37.0083479 44.4889622,37.2984714 C44.7649091,37.5885948 45.1142462,37.7336566 45.5369735,37.7336566 C45.9362159,37.7336566 46.2767462,37.5885948 46.5585644,37.2984714 C46.8403826,37.0083479 46.9812917,36.6534097 46.9812917,36.2336566 C46.9812917,35.7892121 46.8433182,35.428101 46.5673712,35.1503232 C46.2914243,34.8725455 45.9479584,34.7336566 45.5369735,34.7336566 Z" id="形状结合" fill="#FFFFFF"></path>
            <g id="编组-8备份-2" transform="translate(31.703963, 24.733657)"></g>
        </g>
        <path d="M188,88 L459,88 L459,88 L459,112 L171,112 L171,105 C171,95.6111593 178.611159,88 188,88 Z" id="矩形" fill="#FFFFFF" opacity="0.5"></path>
    </g>
</svg>