<?xml version="1.0" encoding="UTF-8"?>
<svg width="240px" height="240px" viewBox="0 0 240 240" version="1.1" xmlns="http://www.w3.org/2000/svg" xmlns:xlink="http://www.w3.org/1999/xlink">
    <title>com.iqoo.secure_b_s6_1x1_mc</title>
    <g id="com.iqoo.secure" stroke="none" stroke-width="1" fill="none" fill-rule="evenodd">
        <path d="M182.184615,67.9192653 L182.184615,67.9192653 L182.184615,67.9192653 L182.184615,113.141285 C182.184615,135.143641 170.292217,155.427661 151.092308,166.173227 L123.866596,181.410574 C121.464194,182.75512 118.535806,182.75512 116.133404,181.410574 L88.9076923,166.173227 C69.7077833,155.427661 57.8153846,135.143641 57.8153846,113.141285 L57.8153846,67.9192653 L57.8153846,67.9192653 C96.4424801,46.2588651 143.55752,46.2588651 182.184615,67.9192653 Z" id="多边形" fill="#329071"></path>
    </g>
</svg>