<?xml version="1.0" encoding="UTF-8"?>
<svg width="240px" height="240px" viewBox="0 0 240 240" version="1.1" xmlns="http://www.w3.org/2000/svg" xmlns:xlink="http://www.w3.org/1999/xlink">
    <title>com.vivo.wallet_b_s6_1x1_mc</title>
    <g id="com.vivo.wallet" stroke="none" stroke-width="1" fill="none" fill-rule="evenodd">
        <g id="编组" transform="translate(48.181818, 48.181818)" fill="#398FFB">
            <path d="M113.779006,1.30095542e-15 C117.704376,-7.87883307e-16 119.228021,0.428425898 120.732295,1.23292017 C122.236568,2.03741444 123.417131,3.21797709 124.221625,4.7222506 C125.02612,6.2265241 125.454545,7.75016973 125.454545,11.6755398 L125.456169,14.6329339 C124.690225,14.5749293 123.791397,14.5454545 122.712138,14.5454545 L122.712138,14.5454545 L20.9242254,14.5454545 C19.8449671,14.5454545 18.9461385,14.5749293 18.1801942,14.6329339 L18.1818182,11.6755398 C18.1818182,7.75016973 18.6102441,6.2265241 19.4147384,4.7222506 C20.2192326,3.21797709 21.3997953,2.03741444 22.9040688,1.23292017 C24.4083423,0.428425898 25.9319879,-2.43919874e-16 29.857358,4.02761271e-16 L113.779006,1.30095542e-15 Z" id="形状结合" opacity="0.200000003"></path>
            <path d="M20.9242254,14.5454545 L122.712138,14.5454545 C126.82684,14.5454545 128.31893,14.9738804 129.823204,15.7783747 C131.327477,16.582869 132.50804,17.7634316 133.312534,19.2677051 C134.117029,20.7719786 134.545455,22.264069 134.545455,26.3787709 L134.545455,41.8030473 C134.545455,45.9177492 134.117029,47.4098395 133.312534,48.914113 C132.50804,50.4183865 131.327477,51.5989492 129.823204,52.4034435 C128.31893,53.2079377 126.82684,53.6363636 122.712138,53.6363636 L20.9242254,53.6363636 C16.8095235,53.6363636 15.3174332,53.2079377 13.8131597,52.4034435 C12.3088862,51.5989492 11.1283235,50.4183865 10.3238293,48.914113 C9.51933499,47.4098395 9.09090909,45.9177492 9.09090909,41.8030473 L9.09090909,26.3787709 C9.09090909,22.264069 9.51933499,20.7719786 10.3238293,19.2677051 C11.1283235,17.7634316 12.3088862,16.582869 13.8131597,15.7783747 C15.3174332,14.9738804 16.8095235,14.5454545 20.9242254,14.5454545 Z" id="矩形" opacity="0.400000006"></path>
            <path d="M131.803047,32.7272727 C135.917749,32.7272727 137.40984,33.1556986 138.914113,33.9601929 C140.418387,34.7646872 141.598949,35.9452498 142.403443,37.4495233 C143.207938,38.9537968 143.636364,40.4458872 143.636364,44.560589 L143.636,68.2722727 L0,86.9442727 L3.18720095e-16,44.560589 C-1.85185553e-16,40.4458872 0.428425898,38.9537968 1.23292017,37.4495233 C2.03741444,35.9452498 3.21797709,34.7646872 4.7222506,33.9601929 C6.2265241,33.1556986 7.71861443,32.7272727 11.8333163,32.7272727 L131.803047,32.7272727 Z" id="形状结合"></path>
        </g>
    </g>
</svg>