<?xml version="1.0" encoding="UTF-8"?>
<svg width="240px" height="480px" viewBox="0 0 240 480" version="1.1" xmlns="http://www.w3.org/2000/svg" xmlns:xlink="http://www.w3.org/1999/xlink">
    <title>com.android.VideoPlayer_b_s5_1x2_mc</title>
    <g id="com.android.VideoPlayer" stroke="none" stroke-width="1" fill="none" fill-rule="evenodd">
        <path d="M140.30203,199.964977 L186.613893,281.936975 C189.292006,286.677235 187.620305,292.691016 182.880045,295.369129 C181.400571,296.204989 179.730157,296.644231 178.030891,296.644231 L85.3989511,296.644231 C79.7911367,296.644231 75.2451049,292.098199 75.2451049,286.490385 C75.2451049,284.740141 75.6975234,283.019614 76.5584599,281.495757 L122.621047,199.964977 C125.379504,195.082509 131.573698,193.360657 136.456166,196.119114 C138.063994,197.027491 139.393652,198.357149 140.30203,199.964977 Z" id="三角形" fill="#FFFFFF" opacity="0.800000012" transform="translate(131.461538, 240.480769) rotate(-270.000000) translate(-131.461538, -240.480769) "></path>
        <path d="M85.4519231,184.264336 C86.5096269,184.264336 87.556478,184.429559 88.5556305,184.750317 L150.187325,219.571555 C153.849176,221.640397 155.140565,226.286043 153.071722,229.947894 C152.390439,231.153765 151.393196,232.151008 150.187325,232.832291 L75.2980769,275.142336 L75.2980769,194.418182 C75.2980769,188.810367 79.8441087,184.264336 85.4519231,184.264336 Z" id="形状结合" fill="#FFFFFF" opacity="0.699999988"></path>
        <path d="M85.4519231,184.264336 C86.5202216,184.264336 87.5774488,184.432886 88.5856407,184.760003 L124.906935,205.281677 C127.348169,206.660906 128.209095,209.758003 126.829866,212.199237 C126.375678,213.003151 125.710848,213.66798 124.906935,214.122169 L75.2980769,242.149336 L75.2980769,194.418182 C75.2980769,188.810367 79.8441087,184.264336 85.4519231,184.264336 Z" id="形状结合" fill="#FFFFFF"></path>
    </g>
</svg>