<?xml version="1.0" encoding="UTF-8"?>
<svg width="240px" height="480px" viewBox="0 0 240 480" version="1.1" xmlns="http://www.w3.org/2000/svg" xmlns:xlink="http://www.w3.org/1999/xlink">
    <title>com.bbk.cloud_b_s5_1x2_mc</title>
    <g id="com.bbk.cloud" stroke="none" stroke-width="1" fill="none" fill-rule="evenodd">
        <path d="M51,231.769231 C51,203.730159 73.7301589,181 101.769231,181 C128.094766,181 149.740442,201.036858 152.287764,226.692078 L139.510622,226.692154 C137.028486,208.063173 121.077106,193.692308 101.769231,193.692308 C80.7399268,193.692308 63.6923077,210.739927 63.6923077,231.769231 C63.6923077,251.945472 79.3848917,268.456514 99.230571,269.762868 L99.2307692,254.49495 C99.2307692,254.272739 99.3469945,254.066714 99.5371814,253.951794 C99.8371586,253.770532 100.22728,253.86677 100.408541,254.166747 L100.408541,254.166747 L115.806836,279.650006 C115.986334,279.947063 116.081212,280.287538 116.081212,280.634615 C116.081212,281.686081 115.228831,282.538462 114.177366,282.538462 L114.177366,282.538462 L99.2307692,282.538462 L99.2304434,282.476088 C72.3708517,281.153307 51,258.956984 51,231.769231 Z" id="形状结合" fill="#FFFFFF"></path>
    </g>
</svg>