<?xml version="1.0" encoding="UTF-8"?>
<svg width="480px" height="240px" viewBox="0 0 480 240" version="1.1" xmlns="http://www.w3.org/2000/svg" xmlns:xlink="http://www.w3.org/1999/xlink">
    <title>com.vivo.translator_b_s5_2x1_sc</title>
    <g id="com.vivo.translator" stroke="none" stroke-width="1" fill="none" fill-rule="evenodd">
        <g id="翻译机备份-6" transform="translate(175.269231, 55.269231)" fill="#4382E0" fill-rule="nonzero">
            <g id="闹钟时钟">
                <path d="M98.8323952,12.1779469 C99.0521355,12.4153744 99.2110011,12.702563 99.2953644,13.0148777 L100.571739,17.7359262 C114.68392,19.4198722 125.625327,31.4299528 125.625327,45.9955357 C125.625327,47.6948734 124.247742,49.0724587 122.548404,49.0724587 C120.849066,49.0724587 119.471481,47.6948734 119.471481,45.9955357 C119.471481,34.768928 111.178356,25.4792836 100.384068,23.9185658 L88.3076923,23.9186126 C87.2031228,23.9186126 86.3076923,23.0231821 86.3076923,21.9186126 C86.3076923,21.3613277 86.5402093,20.8293145 86.9492089,20.4507833 L96.0060825,12.0686011 C96.8167422,11.3183314 98.0821255,11.3672872 98.8323952,12.1779469 Z" id="形状结合" transform="translate(105.966510, 30.304440) rotate(11.000000) translate(-105.966510, -30.304440) "></path>
            </g>
            <g id="编组" transform="translate(58.730769, 60.730769)">
                <path d="M14.5964286,57 L18.7896764,46.1466643 L42.2697057,46.1466643 L46.3309524,57 L61,57 L38.6333333,0 L23.0202381,0 L0,57 L14.5964286,57 Z M38,34 L22,34 L30.0464424,16 L30.2089613,16 L38,34 Z" id="A"></path>
            </g>
        </g>
    </g>
</svg>