<?xml version="1.0" encoding="UTF-8"?>
<svg width="480px" height="240px" viewBox="0 0 480 240" version="1.1" xmlns="http://www.w3.org/2000/svg" xmlns:xlink="http://www.w3.org/1999/xlink">
    <title>com.android.bbksoundrecorder_b_s5_2x1_sc</title>
    <g id="com.android.bbksoundrecorder" stroke="none" stroke-width="1" fill="none" fill-rule="evenodd">
        <circle id="椭圆形备份-7" fill="#F82E52" cx="191" cy="120" r="12"></circle>
    </g>
</svg>