<?xml version="1.0" encoding="UTF-8"?>
<svg width="240px" height="240px" viewBox="0 0 240 240" version="1.1" xmlns="http://www.w3.org/2000/svg" xmlns:xlink="http://www.w3.org/1999/xlink">
    <title>com.android.mms_b_s5_1x1_0_sc</title>
    <g id="com.android.mms" stroke="none" stroke-width="1" fill="none" fill-rule="evenodd">
        <path d="M143.625,136.875 L143.625,100.875 C143.625,93.4191559 137.580844,87.375 130.125,87.375 L96.375,87.375 L96.375,73.1812251 C96.375,67.1634736 97.0015729,64.9812915 98.1781458,62.7812915 C99.3547186,60.5812915 101.081292,58.8547186 103.281292,57.6781458 C105.481292,56.5015729 107.663474,55.875 113.681225,55.875 L113.681225,55.875 L178.068775,55.875 C184.086526,55.875 186.268708,56.5015729 188.468708,57.6781458 C190.668708,58.8547186 192.395281,60.5812915 193.571854,62.7812915 C194.748427,64.9812915 195.375,67.1634736 195.375,73.1812251 L195.375,73.1812251 L195.375,147.193019 L195.369809,147.347068 C195.290645,148.517858 194.315864,149.443019 193.125,149.443019 C192.528263,149.443019 191.955967,149.205967 191.53401,148.78401 L191.53401,148.78401 L181.787271,139.036107 C180.294142,137.75696 178.377143,136.958397 176.275987,136.88013 L176.275987,136.88013 L176.032,136.875 L175.771,136.875 L175.68853,136.877099 L175.689,136.875 L143.625,136.875 Z" id="形状结合" fill="#4BDCE2"></path>
    </g>
</svg>