<?xml version="1.0" encoding="UTF-8"?>
<svg width="480px" height="240px" viewBox="0 0 480 240" version="1.1" xmlns="http://www.w3.org/2000/svg" xmlns:xlink="http://www.w3.org/1999/xlink">
    <title>com.android.mms_b_s5_2x1_1_mc</title>
    <defs>
        <path d="M92.770861,7.76880231e-16 C99.4572515,-4.51389787e-16 101.881898,0.696192084 104.326343,2.00349528 C106.76338,3.30683695 108.67757,5.21759164 109.984603,7.65144949 L109.99,7.43353989 L119.671,30.049 L119.65,30 L63.4,30 C54.9998171,30 48.1704878,36.7256234 48.0031427,45.0857394 L48,45.4 L48,83.999 L92.770861,84 L25.097448,83.9998127 C20.7456156,84.764908 16.7610094,86.5959021 13.4227927,89.2136317 L5.37859441,95.7381151 C4.79073757,96.2148501 4.05686978,96.4750222 3.3,96.4750222 C1.54030652,96.4750222 0.102304136,95.0976989 0.00522393978,93.3622834 L0,93.1750222 L5.17920154e-16,19.229139 C-3.00926524e-16,12.5427485 0.696192084,10.1181017 2.00349528,7.67365722 C3.31079847,5.22921278 5.22921278,3.31079847 7.67365722,2.00349528 C10.1181017,0.696192084 12.5427485,4.51389787e-16 19.229139,-7.76880231e-16 L92.770861,7.76880231e-16 Z M110.87,74.398 L110.929174,74.2406435 C110.664901,74.9928217 110.353487,75.6588441 109.996505,76.3263428 C108.689202,78.7707872 106.770787,80.6892015 104.326343,81.9965047 C103.699401,82.3317971 103.073761,82.6268905 102.377189,82.8803495 C106.119976,81.3642177 109.131815,78.419153 110.735069,74.7222608 L110.87,74.398 Z M95.5,12 C93.0147186,12 91,14.0147186 91,16.5 C91,18.9852814 93.0147186,21 95.5,21 C97.9852814,21 100,18.9852814 100,16.5 C100,14.0147186 97.9852814,12 95.5,12 Z" id="path-1"></path>
        <path d="M71.65,0 L76.8017681,12.0319381 C77.8885471,14.570515 76.7116324,17.5094466 74.1730555,18.5962256 C73.5512135,18.8624396 72.8818204,18.999709 72.2053905,18.9997255 L64,19 L64,34.770861 C64,39.7300366 63.6170302,42.3448602 62.885803,44.3621727 C61.3233378,48.2326877 58.2326877,51.3233378 54.3614029,52.8860761 C52.3448602,53.6170302 49.7300366,54 44.770861,54 L0,53.999 L1.13686838e-12,15.4 C1.13582679e-12,6.89481485 6.89481485,9.07504365e-13 15.4,9.09494702e-13 L71.65,0 Z" id="path-3"></path>
    </defs>
    <g id="com.android.mms" stroke="none" stroke-width="1" fill="none" fill-rule="evenodd">
        <g id="矩形" transform="translate(165.000000, 57.000000)">
            <mask id="mask-2" fill="white">
                <use xlink:href="#path-1"></use>
            </mask>
            <use id="形状结合" fill="#4194FD" xlink:href="#path-1"></use>
        </g>
        <g id="编组" opacity="0.5" transform="translate(213.000000, 87.000000)">
            <g id="矩形">
                <mask id="mask-4" fill="white">
                    <use xlink:href="#path-3"></use>
                </mask>
                <use id="形状结合" fill="#053777" xlink:href="#path-3"></use>
            </g>
        </g>
    </g>
</svg>