<?xml version="1.0" encoding="UTF-8"?>
<svg width="480px" height="480px" viewBox="0 0 480 480" version="1.1" xmlns="http://www.w3.org/2000/svg" xmlns:xlink="http://www.w3.org/1999/xlink">
    <title>com.android.filemanager_b_s5_2x2_2_sc</title>
    <g id="com.android.filemanager" stroke="none" stroke-width="1" fill="none" fill-rule="evenodd">
        <path d="M85,227 L399.315318,227 C406.72622,227 413.086136,232.278438 414.451642,239.562452 L415.971329,247.668911 C417.212698,254.290742 422.99444,259.089322 429.731624,259.089322 L458.921875,259.089322 L458.921875,259.089322 L458.921875,411 C458.921875,437.509668 437.431543,459 410.921875,459 L85,459 L85,459 L85,227 Z" id="蒙版备份-2" fill="#FFFFFF"></path>
        <path d="M139,166 L139.001,227 L85,227 L85.0007548,219.207948 L85.0067871,217.96798 L85.0188355,216.763727 L85.0368833,215.594346 L85.0609137,214.458991 L85.0909099,213.356818 L85.1268552,212.286984 L85.1687328,211.248642 L85.2165258,210.24095 L85.2702176,209.263062 L85.3297912,208.314135 L85.3952301,207.393323 L85.4665173,206.499783 L85.543636,205.632669 L85.6265696,204.791139 L85.7153013,203.974346 L85.8098142,203.181447 L85.9100915,202.411598 L86.0161166,201.663954 L86.1278725,200.93767 L86.2453426,200.231902 L86.3685101,199.545806 L86.4973581,198.878538 C86.5193052,198.768848 86.5414883,198.659908 86.563907,198.5517 L86.7012445,197.911089 L86.8442205,197.287194 C86.8685188,197.184558 86.8930513,197.082583 86.9178178,196.981252 L87.0692203,196.380849 L87.2262195,195.795051 C87.2528514,195.698588 87.2797159,195.602698 87.3068126,195.507365 L87.4721753,194.941891 L87.5569407,194.663893 L87.5569407,194.663893 L87.7306293,194.116844 L87.9098474,193.581024 L88.0945782,193.055586 L88.2848051,192.539687 L88.4805112,192.032483 L88.6816797,191.533129 L88.8882938,191.040781 L89.1003369,190.554594 L89.317792,190.073723 L89.5406425,189.597325 L89.7688715,189.124555 L90.0024623,188.654569 L90.362865,187.952962 L90.6097868,187.48624 C94.2702357,180.641796 99.6417958,175.270236 106.48624,171.609787 L107.194674,171.237185 L107.905662,170.876852 L108.622156,170.528848 L109.104334,170.303723 L109.836559,169.976396 L110.331957,169.765111 L110.834173,169.559391 L111.344081,169.359255 L111.862555,169.164719 L112.390469,168.975802 L112.928698,168.79252 C113.019311,168.762444 113.11039,168.732603 113.201954,168.702998 L113.757294,168.528202 L114.039597,168.442933 L114.039597,168.442933 L114.614015,168.276662 C114.710878,168.249425 114.808317,168.222426 114.906349,168.195664 L115.501813,168.037958 L116.112399,167.885982 L116.738982,167.739754 L117.382436,167.599293 L118.043636,167.464614 L118.723455,167.335737 L119.422768,167.212677 L120.14245,167.095452 L120.883373,166.98408 L121.646413,166.878579 L122.432443,166.778964 L123.242339,166.685255 L124.076973,166.597467 L124.937221,166.515619 L125.823956,166.439729 L126.738053,166.369812 L127.680386,166.305887 L128.651828,166.247971 L130.165486,166.172402 L131.213529,166.129585 L132.293741,166.092837 L133.406998,166.062177 L134.554173,166.037621 L135.73614,166.019187 L136.953773,166.006893 L138.207948,166 L139,166 Z" id="形状结合" fill="#FFFFFF" opacity="0.600000024"></path>
    </g>
</svg>