<?xml version="1.0" encoding="UTF-8"?>
<svg width="480px" height="240px" viewBox="0 0 480 240" version="1.1" xmlns="http://www.w3.org/2000/svg" xmlns:xlink="http://www.w3.org/1999/xlink">
    <title>com.vivo.weather.overcast_b_s5_2x1_mc</title>
    <defs>
        <filter color-interpolation-filters="auto" id="filter-1">
            <feColorMatrix in="SourceGraphic" type="matrix" values="0 0 0 0 0.231373 0 0 0 0 0.584314 0 0 0 0 0.462745 0 0 0 1.000000 0"></feColorMatrix>
        </filter>
    </defs>
    <g id="com.vivo.weather.overcast" stroke="none" stroke-width="1" fill="none" fill-rule="evenodd" opacity="0.949999988">
        <g id="编组-38" transform="translate(104.520000, 55.320000)" filter="url(#filter-1)">
            <g>
                <path d="M64.416,0 C94.225551,0 119.305811,20.2516459 126.65304,47.7491789 C127.199408,47.7258638 127.750412,47.7147541 128.304,47.7147541 C150.757689,47.7147541 168.96,65.9916649 168.96,88.537377 C168.96,111.083089 150.757689,129.36 128.304,129.36 C127.773001,129.36 127.244379,129.349778 126.718319,129.329521 L126.718132,129.36 L65.6049401,129.36 L65.6050671,129.349486 C65.2174244,129.356485 64.8289434,129.36 64.4396531,129.36 C28.8636786,129.36 0,100.007499 0,64.4260014 C0,28.8445033 28.8400256,0 64.416,0 Z" id="形状结合" fill="#3B9576"></path>
            </g>
        </g>
    </g>
</svg>