<?xml version="1.0" encoding="UTF-8"?>
<svg width="480px" height="240px" viewBox="0 0 480 240" version="1.1" xmlns="http://www.w3.org/2000/svg" xmlns:xlink="http://www.w3.org/1999/xlink">
    <title>com.vivo.gallery_b_s5_2x1_sc</title>
    <g id="com.vivo.gallery" stroke="none" stroke-width="1" fill="none" fill-rule="evenodd">
        <g id="编组-40" transform="translate(255.917833, 59.280000)">
            <path d="M34.9021666,19.8 C40.3697857,19.8 44.8021666,15.367619 44.8021666,9.9 C44.8021666,4.43238098 40.3697857,0 34.9021666,0 C29.4345476,0 25.0021666,4.43238098 25.0021666,9.9 C25.0021666,15.367619 29.4345476,19.8 34.9021666,19.8 Z" id="太阳" fill="#C9BA6A"></path>
            <path d="M18.4118008,38.8412991 C19.7017835,39.7050266 20.8099707,40.8132139 21.6736982,42.1031965 L46.997708,79.9247696 C50.2425082,84.7708997 48.9443738,91.3298946 44.0982437,94.5746947 C42.3599092,95.738623 40.3150304,96.36 38.2230133,96.36 L27.4842271,96.3604975 C28.1331089,93.1853969 27.6212424,89.7660773 25.7856553,86.7902013 L25.7856553,86.7902013 L0,44.9855901 L1.93063506,42.1031965 C5.58103523,36.6513002 12.9599045,35.190899 18.4118008,38.8412991 Z" id="形状结合" fill="#00FF59" opacity="0.949999988"></path>
        </g>
    </g>
</svg>