<?xml version="1.0" encoding="UTF-8"?>
<svg width="480px" height="240px" viewBox="0 0 480 240" version="1.1" xmlns="http://www.w3.org/2000/svg" xmlns:xlink="http://www.w3.org/1999/xlink">
    <title>com.bbk.calendar_b_s5_2x1_1_bg</title>
    <g id="com.bbk.calendar" stroke="none" stroke-width="1" fill="none" fill-rule="evenodd">
        <path d="M82.5332448,21 L397.466755,21 C418.863205,21 426.622075,23.2278147 434.444297,27.4111849 C442.266519,31.5945551 448.405445,37.7334809 452.588815,45.5557031 C456.772185,53.3779253 459,61.136795 459,82.5332448 L459,157.466755 C459,178.863205 456.772185,186.622075 452.588815,194.444297 C448.405445,202.266519 442.266519,208.405445 434.444297,212.588815 C426.622075,216.772185 418.863205,219 397.466755,219 L82.5332448,219 C61.136795,219 53.3779253,216.772185 45.5557031,212.588815 C37.7334809,208.405445 31.5945551,202.266519 27.4111849,194.444297 C23.2278147,186.622075 21,178.863205 21,157.466755 L21,82.5332448 C21,61.136795 23.2278147,53.3779253 27.4111849,45.5557031 C31.5945551,37.7334809 37.7334809,31.5945551 45.5557031,27.4111849 C53.3779253,23.2278147 61.136795,21 82.5332448,21 Z" id="蒙版备份-3" fill="#FFFFFF"></path>
    </g>
</svg>