<?xml version="1.0" encoding="UTF-8"?>
<svg width="480px" height="480px" viewBox="0 0 480 480" version="1.1" xmlns="http://www.w3.org/2000/svg" xmlns:xlink="http://www.w3.org/1999/xlink">
    <title>com.vivo.weather.rain_b_s5_2x2_sc</title>
    <g id="com.vivo.weather.rain" stroke="none" stroke-width="1" fill="none" fill-rule="evenodd">
        <g id="编组" transform="translate(206.891213, 319.590909)" fill="#FFFFFF">
            <path d="M62.3996076,0.575356581 C64.4784051,0.575431573 66.1635847,2.26061118 66.1636597,4.33940869 L66.164233,20.2344266 C66.164308,22.3130302 64.4793276,23.9981321 62.400724,23.9982071 C62.4006335,23.9982071 62.400543,23.9982071 62.4004525,23.9982071 C60.321655,23.9981321 58.6364754,22.3129525 58.6364004,20.234155 L58.635827,4.33913713 C58.6357521,2.26053351 60.3207325,0.575431556 62.3993361,0.575356581 C62.3994266,0.575356578 62.3995171,0.575356578 62.3996076,0.575356581 Z" id="矩形备份-28" opacity="0.5" transform="translate(62.400030, 12.286782) rotate(-345.000000) translate(-62.400030, -12.286782) "></path>
            <path d="M33.9612829,0.461235711 C36.0400584,0.461235711 37.72526,2.14637649 37.725335,4.22515204 L37.7261497,26.8126845 C37.7262247,28.8913631 36.0411835,30.5765258 33.9625049,30.5766008 C33.9624596,30.5766008 33.9624144,30.5766008 33.9623691,30.5766008 C31.8835936,30.5766008 30.198392,28.89146 30.198317,26.8126845 L30.1975023,4.22515204 C30.1974273,2.14647343 31.8824685,0.461310692 33.9611471,0.461235714 C33.9611924,0.461235712 33.9612376,0.461235711 33.9612829,0.461235711 Z" id="矩形备份-24" opacity="0.78" transform="translate(33.961826, 15.518918) rotate(-345.000000) translate(-33.961826, -15.518918) "></path>
            <path d="M5.80013559,0.689341668 C7.8789331,0.68941666 9.5641127,2.37459627 9.56418768,4.45339378 L9.56451963,13.6561686 C9.5645946,15.7347723 7.87961421,17.4198742 5.80101059,17.4199492 C5.80092008,17.4199492 5.80082957,17.4199492 5.80073906,17.4199492 C3.72194155,17.4198742 2.03676195,15.7346946 2.03668697,13.6558971 L2.03635502,4.45312222 C2.03628005,2.37451859 3.72126044,0.689416644 5.79986406,0.689341668 C5.79995457,0.689341665 5.80004508,0.689341665 5.80013559,0.689341668 Z" id="矩形" opacity="0.68" transform="translate(5.800437, 9.054645) rotate(-345.000000) translate(-5.800437, -9.054645) "></path>
        </g>
    </g>
</svg>