<?xml version="1.0" encoding="UTF-8"?>
<svg width="240px" height="480px" viewBox="0 0 240 480" version="1.1" xmlns="http://www.w3.org/2000/svg" xmlns:xlink="http://www.w3.org/1999/xlink">
    <title>com.android.mms_b_s5_1x2_bg</title>
    <defs>
        <path d="M82.5332448,21 L157.466755,21 C178.863205,21 186.622075,23.2278147 194.444297,27.4111849 C202.266519,31.5945551 208.405445,37.7334809 212.588815,45.5557031 C216.772185,53.3779253 219,61.136795 219,82.5332448 L219,397.466755 C219,418.863205 216.772185,426.622075 212.588815,434.444297 C208.405445,442.266519 202.266519,448.405445 194.444297,452.588815 C186.622075,456.772185 178.863205,459 157.466755,459 L82.5332448,459 C61.136795,459 53.3779253,456.772185 45.5557031,452.588815 C37.7334809,448.405445 31.5945551,442.266519 27.4111849,434.444297 C23.2278147,426.622075 21,418.863205 21,397.466755 L21,82.5332448 C21,61.136795 23.2278147,53.3779253 27.4111849,45.5557031 C31.5945551,37.7334809 37.7334809,31.5945551 45.5557031,27.4111849 C53.3779253,23.2278147 61.136795,21 82.5332448,21 Z" id="path-1"></path>
    </defs>
    <g id="com.android.mms" stroke="none" stroke-width="1" fill="none" fill-rule="evenodd">
        <mask id="mask-2" fill="white">
            <use xlink:href="#path-1"></use>
        </mask>
        <use id="矩形备份-17" fill="#FFFFFF" xlink:href="#path-1"></use>
    </g>
</svg>