<?xml version="1.0" encoding="UTF-8"?>
<svg width="480px" height="480px" viewBox="0 0 480 480" version="1.1" xmlns="http://www.w3.org/2000/svg" xmlns:xlink="http://www.w3.org/1999/xlink">
    <title>com.android.bbk.lockscreen3_b_s5_2x2_sc</title>
    <g id="com.android.bbk.lockscreen3" stroke="none" stroke-width="1" fill="none" fill-rule="evenodd">
        <g id="编组-20" transform="translate(213.000000, 195.000000)" fill="#FFFFFF">
            <path d="M27,0 C41.9116882,0 54,12.0883118 54,27 C54,37.9937687 47.4293972,47.4528909 38.0009932,51.6645651 L38,77.2 C38,83.1646753 33.1646753,88 27.2,88 L26.8,88 C20.8353247,88 16,83.1646753 16,77.2 L16.0000085,51.6650125 C6.57106815,47.4535609 0,37.994158 0,27 C0,12.0883118 12.0883118,0 27,0 Z" id="形状结合"></path>
        </g>
    </g>
</svg>