<?xml version="1.0" encoding="UTF-8"?>
<svg width="240px" height="480px" viewBox="0 0 240 480" version="1.1" xmlns="http://www.w3.org/2000/svg" xmlns:xlink="http://www.w3.org/1999/xlink">
    <title>com.vivo.Tips_b_s5_1x2_mc</title>
    <g id="com.vivo.Tips" stroke="none" stroke-width="1" fill="none" fill-rule="evenodd">
        <path d="M120,174 C149.823376,174 174,198.176624 174,228 C174,257.823376 149.823376,282 120,282 C90.1766235,282 66,257.823376 66,228 C66,198.176624 90.1766235,174 120,174 Z M120,207 C108.40202,207 99,216.40202 99,228 C99,239.59798 108.40202,249 120,249 C131.59798,249 141,239.59798 141,228 C141,216.40202 131.59798,207 120,207 Z" id="椭圆形备份-2" fill="#00F052" fill-rule="nonzero"></path>
    </g>
</svg>