<?xml version="1.0" encoding="UTF-8"?>
<svg width="480px" height="240px" viewBox="0 0 480 240" version="1.1" xmlns="http://www.w3.org/2000/svg" xmlns:xlink="http://www.w3.org/1999/xlink">
    <title>com.vivo.browser_b_s5_2x1_sc</title>
    <g id="com.vivo.browser" stroke="none" stroke-width="1" fill="none" fill-rule="evenodd">
        <g id="编组" transform="translate(172.000000, 52.000000)" fill="#FFFFFF">
            <path d="M68,0 C88.1310279,0 106.218898,8.74779857 118.669681,22.6494667 C102.592916,25.5240669 79.9709929,34.5333187 56.5093309,48.0789155 C33.0276553,61.6360672 13.9018611,76.7367866 3.37947271,89.2285071 C1.18614214,82.5486521 0,75.4128452 0,68 C0,30.444637 30.444637,0 68,0 Z" id="形状"></path>
        </g>
    </g>
</svg>