{
	"param30000": {
		"cureent_mode": "BIAOZHUNMOSHI_Udc_acl3",
		"param_golden_value": [308,308,308,308,308,308,308],
		"param_section": [108,248,388,448,1208,1808],
		"red": [
			[-0.009096507749435944,-0.8978533225640604,1.878920274508026,208.6056461232845,-4.426023381208124,-400.1820005380756,-1035.651532108242],
			[0.001441029613465262,0.002544553776709208,0.06019620473048945,-1.480596683359652,0.01567213847320954,0.02431518882535477,-4.142401905657564],
			[-4.511695270212488e-05,4.920748980291196e-05,1.555595835815935e-05,-0.0002266960496983096,0.0001596010602717002,2.675223842153615e-05,-0.0005676192460185475],
			[2.906024304207908e-07,-2.241524088026832e-07,-2.128254952905683e-07,-1.301802432313591e-06,-5.37285580219452e-07,-1.746874385797337e-07,1.553397159294726e-06],
			[-4.345343239383551e-10,2.404037802776465e-10,6.914594457148167e-10,8.49946231497947e-10,2.555928795892652e-10,-1.237340768984821e-09,-4.14809583468034e-09],
			[0.03962822721000407,-0.9177766190391611,-0.0475209229160727,1.609208858138963,0.008000797480498902,-0.07902527535805789,15.73054295096822],
			[-0.0002646626677897072,-8.215505341226715e-05,-0.0005587038188152018,0.01064482379804501,2.296593766777601e-06,-1.353417007616554e-06,0.006469776366548147],
			[1.003890702202016e-06,-9.017166450322335e-08,-1.951250806212875e-08,1.887091074048973e-06,2.014188248994174e-07,2.917707435762305e-07,6.432095910982939e-07],
			[-1.687261438108916e-09,3.526055482716929e-10,-5.289111357102418e-10,2.07039880344194e-09,9.940694846347643e-10,1.427252116700625e-09,1.279897986830671e-09],
			[-0.0006053676358314741,-0.001178065085901793,0.004212298671555049,0.08813443425236459,-5.318011166450432e-05,-0.0008222178446652306,-0.0005128516988565086],
			[1.380227576134759e-06,5.129178253167693e-07,1.769920814035395e-06,-2.551715949853894e-05,2.690481191760145e-08,6.685480411310905e-09,-3.330680113437695e-06],
			[-9.991122850295022e-10,1.112123950795128e-09,1.654683100311886e-09,-1.628771743478892e-09,9.966221367627661e-11,2.619468641031448e-11,-5.042008279044144e-11],
			[-1.747479071323971e-05,4.821337609852475e-05,2.438734818905867e-07,0.0002557383879395535,6.046339305301725e-08,6.751054621460537e-06,1.097788069571188e-06],
			[-3.390456463813091e-10,-6.832328496208045e-10,-1.652716702367813e-09,2.064526701112352e-08,-1.576487256902662e-11,-1.882550580589447e-12,5.701410016477949e-10],
			[5.563872891629884e-08,-6.714199231029164e-08,0.4948584948216173,0.008238723775222707,-1.007546860205737e-10,0.01094617992805006,-0.0002159264169485137],
			[-0.002366499563229491,-0.00870844694592331,0.05572511473131125,-0.03740681328888112,0.0009269837900341585,0.1595126832615598,-1.792945781147151],
			[2.671451605674451e-05,5.521845485396326e-05,-4.234623987455508e-05,0.0004157671792817953,9.683396160225312e-05,0.0001847928367812916,-0.0001032036334806035],
			[-9.262280678294181e-08,-1.081350027116297e-07,1.404354862396202e-07,-8.682294073891223e-07,-2.975135400561588e-07,-8.877633042048388e-07,-6.326692774370335e-07],
			[1.609061089785475e-10,1.037410939394421e-10,-2.050329105659974e-10,5.076631584219347e-11,1.131646564306678e-10,3.05377730934959e-10,-8.54097600967285e-10],
			[0.06970690664319307,-0.3228294776092867,0.28362023590554,-11.43387791574669,-0.002627211080659368,6.409051193492052,6917.141483876951],
			[-0.0001361094009352697,0.000118498335067964,-0.0004768290816289618,-8.879679968224399e-05,4.656801471977189e-05,-0.0002940456517514056,0.002801680472030529],
			[-3.746294359071554e-08,-4.962313315639868e-07,-8.557975735979799e-08,-1.435672473202839e-06,2.237559891226463e-08,1.119100670967764e-08,2.899667129822215e-07],
			[3.254341926777728e-10,3.822275194912448e-10,8.444110182434664e-11,2.337448799179588e-09,9.322933894834756e-10,1.402454709799162e-09,1.583315732037094e-09],
			[0.001993898999868684,0.001593593242560741,-0.0005865919313267836,-0.2111066031977648,-0.0001089235820830869,0.0003273991288645832,-0.0001780789800329723],
			[5.814801603885798e-07,-3.771920318301363e-07,1.548207704691123e-06,1.010462985200942e-06,-1.891808456027608e-08,2.098860517028505e-07,-1.43390501160397e-06],
			[1.365243231338275e-09,1.792549395153587e-09,1.068483497117871e-09,1.655818123218602e-09,8.376165197825376e-11,3.294164594501717e-11,-5.731680232979253e-11],
			[2.040496067967026e-06,-4.869526856294792e-05,-2.069171324518389e-06,-3.678889130141923e-06,-4.674989904395811e-08,-2.945811473769758e-06,-3.491548410626361e-07],
			[1.410878205283395e-09,4.374134986195327e-10,-1.541288416069419e-09,-1.16830986714989e-09,1.380150981731577e-12,-4.668996862321404e-11,2.457387339110311e-10],
			[-4.647425808189627e-08,-1.254316940241561e-07,7.460532894777353e-11,-7.198615517799865e-08,-2.611075929156121e-11,1.691021567245358e-09,4.259946588832632e-11],
			[0.00118974933868807,0.001826344165655132,0.02071921882236269,-0.7198853305764115,0.003255777911609168,0.05015230107943156,-1.404484934458717],
			[-1.358850931301473e-05,-3.305967770195123e-05,-4.207017787327943e-05,4.976658659659756e-05,-0.000187353975802673,-0.0002921550099001569,-0.0008543329673888981],
			[6.791970828981177e-08,1.889449344140769e-07,4.136553860693947e-07,6.505017371592352e-07,1.295595793390667e-06,2.284411062440681e-06,3.219361546914232e-06],
			[-1.027428375624058e-10,-3.715912870058708e-10,-9.664556432966853e-10,-1.722504948416789e-09,-2.769322785929237e-09,-5.189602319277766e-09,-7.020720561536896e-09],
			[-0.1013408988779465,1.257015243930396,-0.294266377177108,7.827341850150508,0.01663408999615358,-5.229488754876898,-6930.565339136554],
			[-8.135410611356904e-05,-2.0131069054019e-06,-0.0001801245205523968,0.005054392736710555,5.255160371253835e-05,-5.195101411960517e-05,0.002265920161508928],
			[9.77133279273504e-08,-1.078617901029619e-08,-2.455574674035581e-07,-8.356679457367417e-07,3.88817134579903e-08,-5.508972879850878e-08,3.839307701700851e-07],
			[-1.521794776368925e-11,1.212697769813842e-10,4.506353284193498e-10,8.352361847605359e-10,5.486451943370077e-10,7.809358896289709e-10,7.876638099582396e-10],
			[-0.001151508060725423,-0.0005741794870638156,-0.00322538450215861,0.1301541241406461,0.0001170983591920944,-0.0006327195193471694,-0.001226863693833648],
			[5.512332361484783e-07,-1.202229694753096e-09,6.726286272544525e-07,-1.167153508217436e-05,-3.764123384108474e-08,5.110597469977956e-08,-1.17643274106144e-06],
			[-4.968593091040779e-10,4.020151568932455e-10,6.509371772364282e-10,1.158197268952638e-09,5.61553266460432e-12,1.638760922255133e-11,-9.858870196667484e-11],
			[1.095226909723535e-05,1.105307053634267e-06,7.425468518488985e-07,-0.0002635747014421562,2.438266830739295e-08,-3.295838437203898e-06,-4.315193931431694e-08],
			[-3.413134325648548e-10,1.147938148500198e-10,-6.945678552854122e-10,9.077512384819843e-09,1.316097535962218e-11,-1.171748819001426e-11,2.048867925610988e-10],
			[8.488201400815862e-09,1.917195729062913e-07,-0.4948584938796189,-0.008238644855152617,1.152910066903466e-10,-0.01094618170472902,0.0002159262774190686],
			[2.011874614722934e-06,1.044172240082383e-08,-5.442439108366134e-10,3.579008785421734e-08,-8.043056237769834e-08,-1.71247088304322e-08,1.113215194825063e-08],
			[3.158525678161742e-07,4.838021793995801e-08,-3.796811472983605e-08,-4.664501886547437e-08,-3.874017652378073e-08,-1.229314517080896e-08,1.865622239234477e-09],
			[5.038360641558527e-07,3.478008434115914e-08,3.502323976483471e-08,4.721371919872515e-08,-5.363799980131783e-08,1.34259910447113e-08,3.357776316939046e-08],
			[-2.196669166394731e-09,-6.886385088472979e-12,1.919571102412843e-10,2.54545765750803e-10,1.280699349792636e-10,2.646083228461183e-11,-1.809701447989079e-11],
			[-1.856972361152295e-09,-8.943370474301358e-11,-4.649801238010046e-11,-8.815559256113346e-11,-1.102321841670581e-10,-1.623011135170925e-10,-1.974346849565191e-10],
			[-8.75912497029211e-09,-2.420776882140319e-11,-2.63830343187448e-10,-3.325895424817327e-10,1.944467477520465e-11,3.374547300530955e-12,1.163436710004707e-13],
			[6.593653640170444e-11,-1.742134336820553e-11,7.428205971988035e-11,6.776583750635365e-11,6.026324860460034e-11,3.212073879171942e-11,7.353749914148642e-12],
			[4.03551192105852e-11,8.301552732359274e-12,1.795744548977564e-10,2.242721162366615e-10,2.123251068719957e-10,1.706862669593145e-10,1.449204191123341e-10],
			[-1.263526789206563e-09,-1.362457241464221e-10,-3.490322252551238e-11,-7.561807505662414e-12,-7.488623483619409e-12,-1.001343880694134e-11,-9.409304230677441e-12],
			[-4.006043790103289e-10,8.546800610919613e-11,2.240727803775512e-10,3.187798576644274e-10,1.49823445060888e-10,1.343626704364905e-11,-4.008136733782655e-11],
			[-1.954535905492158e-10,-1.256815665438768e-10,-1.557758036910778e-10,-1.825781002364975e-10,-2.034492063266519e-10,-2.327015036617074e-10,-2.564288144994788e-10],
			[-2.08854136671169e-09,-1.736917302495605e-10,-2.818315310961145e-10,-3.257982034426854e-10,1.426038260901431e-11,-1.804729555146247e-12,-8.050893239499489e-13],
			[-1.383787729155995e-09,-1.716790534385946e-10,-1.830187085721051e-10,-2.772011388171007e-10,-3.104234348537496e-10,-3.476790081284737e-10,-3.646583047479142e-10]
		],
		"green": [
			[0.11512449577718,-1.022766572389139,31.20555038848195,125.6350345600017,-3.433227689489447,-330.6781632996154,-717.7705271415089],
			[0.0001091043838971431,0.004415875574484362,0.009004082667127898,-0.8767574313105213,0.002518656669097397,0.0109797870658743,-1.301552117738062],
			[-9.22778895205536e-07,2.412282661841917e-07,-4.965740276954738e-05,-8.544552630155918e-05,-2.156312665664432e-05,-7.535316944240521e-05,-0.0003794739068435896],
			[6.627843089368087e-09,4.816632330549027e-09,1.910331082280993e-07,-8.630381475708119e-08,2.099465097100588e-07,5.222876342682705e-07,9.535997855366613e-07],
			[-1.538052526116212e-11,-2.77346854724025e-11,-1.405892308555375e-10,-2.671853521418043e-10,-5.200750195675812e-10,-1.266089450527447e-09,-1.78317800184397e-09],
			[-0.02927160156684219,-1.066413383147771,0.2563947909958509,3.141378856122031,0.006007258811706991,-0.02549941721100325,-5.778810268103005],
			[6.835043031233326e-07,-9.539582150988604e-05,-8.303569068957515e-05,0.006310691188070042,1.772239903078264e-06,-1.365246670780926e-05,0.002045548435890495],
			[-3.353018405951104e-08,-4.723683882614246e-08,1.194429538805898e-07,4.862187261951088e-07,4.904066725943611e-08,5.938545846149165e-08,3.016519062648426e-07],
			[5.104898852241254e-11,6.977135063178812e-11,-4.38458379971776e-10,4.568464945341802e-10,8.209286271862648e-11,1.430555713532661e-10,5.319885512528855e-11],
			[0.001774124062649771,-0.001332360293749416,0.005597260953607674,0.05549877899308042,-5.770644286957262e-05,-0.0006556875520049579,-0.0004526536687032432],
			[1.050216077820058e-07,5.01390584783704e-07,2.348270060801656e-07,-1.515902963193804e-05,4.5950489995135e-10,9.686310779166624e-09,-1.063216795684101e-06],
			[6.582026104714862e-11,2.603101852287309e-10,2.675703552904759e-10,-5.543595110743707e-10,1.304530301552603e-11,1.251556411610025e-12,-5.15950986257704e-11],
			[1.581621783233747e-05,5.539339773850443e-05,-2.116637518303137e-07,0.0001426099788180653,1.137384727893298e-07,5.3683611929945e-06,4.810190752045662e-07],
			[-7.334708637192557e-10,-8.344489547802747e-10,-2.25334108661248e-10,1.217491952633332e-08,-8.957956868663795e-13,-2.032941347721135e-12,1.835487489894406e-10],
			[3.067585354738633e-08,-7.669547319782398e-08,-0.7797895253622699,0.02457279031220684,-1.401185041370206e-10,0.001179965348247558,0.0001586563238565456],
			[-0.008347585969968433,-0.01423662058930267,0.05489619004750894,-0.04473240820010518,-0.006478241747193058,0.2800274711049985,-4.170390079999908],
			[0.000110087156967717,-2.398356032361954e-05,2.283360644323859e-05,0.0003795756490002969,0.0003055060247163168,0.0005446405787092715,0.0004280738021648295],
			[-5.300704165364906e-07,2.571646433410759e-07,-7.716195097814531e-08,-1.213683688155662e-06,-9.943179377685309e-07,-2.304809518059487e-06,-2.190269751290363e-06],
			[8.559575605471585e-10,-3.133415224049573e-11,1.166714141704672e-10,5.389611432222575e-10,9.219565050581413e-10,1.543576154645188e-09,2.163968008230571e-10],
			[-0.05089432220561642,-0.3200721600793772,0.2703538428247435,-6.180059672934104,-0.006258130829847569,5.052222631887028,1517.174164570195],
			[0.000278743176939892,0.0001152578601308091,-0.0005531867159047961,-7.799062642403521e-05,1.860446581279792e-05,-0.000583547912001123,0.006422608218555617],
			[-1.819297252138315e-06,-4.761298844768632e-08,-1.61763272433703e-07,-1.039368073178201e-06,4.324832970127408e-08,-2.843409250065467e-08,1.152134363494366e-07],
			[3.330367223179183e-09,-1.393064575390571e-09,5.589955488233352e-11,2.431325372925711e-09,1.442803246039599e-09,2.362621779892748e-09,2.666622899781725e-09],
			[-0.004121881012206341,0.001524393596014837,0.002883628532988322,-0.1228624823160896,-0.0001044143300234675,0.0002063044345387842,-3.176170980473682e-05],
			[-2.152296031904185e-06,-4.476463883168073e-07,1.751657395866339e-06,9.546766055364616e-07,1.41245437830662e-08,4.092636676072239e-07,-3.282505432952332e-06],
			[6.094265079260014e-09,2.894756936624508e-09,1.921878605872314e-09,1.995727878049146e-09,1.783887121279712e-10,8.484952530066798e-11,1.23801190015435e-11],
			[-1.280669664712969e-06,-5.556665161284338e-05,-1.718512823036187e-05,-4.704039233980933e-06,-1.162763482196591e-07,-2.32903263642998e-06,6.544657882480809e-09],
			[5.270512605154304e-09,3.166500246373534e-10,-1.781974235526347e-09,-1.17837661827352e-09,-1.433946569031155e-11,-9.232377679945025e-11,5.59548702129443e-10],
			[1.158794608770378e-07,-1.454161468262447e-07,8.904653782096234e-10,-1.414919632997819e-08,-2.446005561980415e-11,1.338981057191666e-09,1.070375616722012e-11],
			[0.0003226478728482838,0.002742133529547924,-0.01069138398523822,-0.3651578865142993,0.004817431919926156,0.0625421565498169,-0.2771353354445054],
			[-2.420359901777786e-06,-1.972370580076649e-06,-5.131247366978081e-05,0.000134442294508253,-0.0001701060936373902,-0.0002918863782032012,-0.0006351089907894172],
			[1.425209051087663e-08,6.057352378449474e-08,4.321019943139963e-07,2.172665097908218e-07,1.117472312250094e-06,1.919949771955439e-06,2.760808325254148e-06],
			[-3.185762574111195e-11,-2.03017788483543e-10,-7.707480896736549e-10,-1.114633209272408e-09,-2.260023618567241e-09,-4.054667730598648e-09,-5.56547489366435e-09],
			[0.07449968555315389,1.425360140185717,-0.9216382933634198,1.767566587646835,0.01662098462222079,-4.135869034847433,-1509.792784951369],
			[-1.011066174656832e-05,-6.114161207489098e-05,0.0001016741622452388,0.002505581494338626,2.440628054708931e-05,-9.046607810728131e-05,0.0004806163955322766],
			[-3.005134841428794e-08,-1.717223752470882e-07,-1.56432984074533e-07,-8.308276101096411e-07,2.05493768957947e-08,4.396648666252839e-09,2.282162659171281e-07],
			[1.048829822121194e-10,4.050273979792287e-10,-1.053423794031855e-11,1.008159469494524e-09,2.796466308725982e-10,3.992620602039191e-10,3.664268854617188e-10],
			[0.002395656146620812,-0.0005561251088069531,-0.006627403864738634,0.0721932330469174,0.0001284912394219871,-0.0004453496295887569,-0.0008516672211673615],
			[3.558854586147918e-07,3.358268344449987e-07,-2.471479047745098e-07,-5.701451217956049e-06,-1.836187716416158e-08,6.605670634784582e-08,-2.499563285419772e-07],
			[-1.553787289667013e-10,3.695864889801342e-10,5.514231971407083e-10,8.359077460957071e-10,1.0106518997917e-11,4.503099484576332e-12,-5.081234333152521e-11],
			[-1.471537991205965e-05,1.476842360575213e-06,1.354442608785776e-05,-0.0001460779207310133,3.111539498027473e-08,-2.643020029486821e-06,5.187281075577275e-09],
			[-1.910413520620956e-09,-4.807581531478759e-10,1.943947971984487e-10,4.397108736034708e-09,6.329628930529525e-12,-1.434945209846113e-11,4.388826418128258e-11],
			[-1.45864312583604e-07,2.204901296204865e-07,0.7797895274589896,-0.02457277098241258,1.558934284441434e-10,-0.001179966752585747,-0.0001586564024252741],
			[-1.577322281778304e-07,1.868339421536944e-07,8.935009345278557e-08,7.033534120942521e-08,2.5486577809414e-08,3.233194373044489e-08,4.153592883906246e-08],
			[-2.310612308138256e-07,2.039831524052649e-07,4.643214485633956e-08,1.835333637717831e-09,3.398040444808263e-09,2.711464183756722e-08,3.177169585649946e-08],
			[3.910768998373402e-08,3.451070633680417e-08,9.370575623633868e-08,7.717092260711473e-08,2.348389797793538e-08,4.262266605901638e-08,3.790273472127092e-08],
			[1.470466809484108e-10,4.770858975000282e-11,2.954433199415658e-11,9.799433916453968e-11,6.186838183527735e-11,5.808149598487216e-11,4.419782137661421e-11],
			[4.645376891956836e-10,-3.013426118021013e-10,-1.189468038929255e-10,-9.844406174105104e-11,-1.158920788212995e-10,-1.590564095918495e-10,-1.899278755726394e-10],
			[5.884721414372813e-10,-3.679200546589456e-10,-1.373395023695704e-10,-1.280070112336474e-10,-1.089838519718938e-11,-4.64669118853115e-12,-2.919309892005468e-12],
			[2.279419811677805e-10,9.750174891999935e-12,-3.467101000261629e-12,3.00752448026524e-11,8.615005172264185e-13,-4.830457677021463e-11,-8.187448642100958e-11],
			[7.302137314646005e-10,-2.187445712652773e-10,7.214441957458493e-11,1.567875370661303e-10,1.527114681815138e-10,1.227653443841998e-10,9.850398406393361e-11],
			[6.652734391262615e-10,-4.389265883608117e-10,-6.838657340675902e-11,-1.780668668226886e-11,-1.346957557230829e-11,-1.529736605613455e-11,-9.562641634153286e-12],
			[-2.050013999870789e-12,2.926468176112928e-11,-5.931980527242355e-12,1.264608926808017e-11,1.234984647777548e-11,-1.437334601768931e-11,-2.767730021225039e-11],
			[-3.794639944547415e-11,-1.271162679697109e-11,-1.244951212264753e-10,-9.855834745724064e-11,-8.473961177004593e-11,-9.752161708638269e-11,-1.023939789620167e-10],
			[-2.446047116141514e-10,-1.119325457684013e-11,-1.389486724137115e-10,-1.135250706482107e-10,2.255827630833515e-12,-5.642687599397072e-12,-2.473429941388956e-13],
			[-8.762921186031078e-11,-2.869689882634384e-10,-2.950070781892514e-10,-3.391531228687124e-10,-3.184219403809746e-10,-3.204774528569293e-10,-3.247564111342489e-10]
		],
		"blue": [
			[0,2.999124291396455,6.310998654403948,-21.40637510545614,-2.253597162764957,-198.6930817675964,-738.6335120875951],
			[0,0.001043382224997354,0.0078015958395918,0.1317244474863451,0.003275287348887934,0.006507524147458174,-1.161059495308305],
			[0,-8.811329800414743e-06,-1.963317374646249e-05,4.232180901923925e-05,4.007599801581907e-06,-1.960407053853009e-05,-3.315687024828108e-05],
			[0,2.166385963722003e-08,5.286540641995246e-08,-6.891335147729612e-08,-8.012645516291539e-09,5.636415220486176e-08,9.860883806544218e-08],
			[0,-2.810192458999149e-11,2.003802434781669e-12,1.342779320369139e-10,-4.681710215087354e-11,-2.16006407978009e-10,-4.879100383772183e-10],
			[0,0.05471245020778492,0.04785498581011603,-14.80782371002553,0.02004099453341323,-0.1491518106250966,44.5366595422573],
			[0,-1.862885913113049e-05,-8.620726851943832e-05,-0.0009961483876912073,-8.097875944523984e-06,-9.329439991728163e-06,0.001809253637228337],
			[0,3.341326102186621e-08,7.231560778143141e-08,-1.221402426585772e-07,5.673906496054093e-08,7.308417673484707e-08,7.36945672908633e-08],
			[0,-4.658756404053961e-11,-2.107334402977886e-10,-7.900343979735787e-11,1.124694300964553e-11,4.013192293192805e-11,8.872046606367443e-11],
			[0,0.0005233343142037241,0.001789788478523015,2.885715127458291e-05,-1.881848889940945e-05,-0.0003907380199461193,-0.001218879241064417],
			[0,5.733238851981603e-08,2.557496386563911e-07,2.462433700384964e-06,8.861534172089554e-09,5.350202064121302e-09,-9.371444541078298e-07],
			[0,6.016998468383156e-11,1.500344504062776e-10,3.006113768503782e-10,2.147025137801746e-12,-4.912853853898932e-12,-5.939265888804279e-12],
			[-0,-1.449823698890051e-05,-1.414499587057853e-07,7.619979107444044e-05,4.390703326209096e-08,3.175107312388535e-06,1.1612540568579e-06],
			[0,-8.069068784936306e-11,-2.465122413459676e-10,-2.0017941305489e-09,-2.966982329932749e-12,-9.485602072085364e-13,1.615469357529276e-10],
			[0,1.710239458526177e-08,0.05656683491470562,0.002967222280203849,-1.641573547305139e-11,0.001344089861956474,-6.675237519568851e-05],
			[0,0.01567420346103619,0.01158453747346728,-0.01921613207501564,-0.002846740644105619,0.09605435417171473,-1.054309829688519],
			[0,-7.822572937777314e-05,5.293917808759296e-05,0.000212857332372124,0.0001066477651741859,0.0002335594303526782,0.0002059877446038417],
			[0,1.337080026581507e-07,-8.186196108824033e-08,-5.418606962656956e-07,-4.085040765637566e-07,-9.770729299288545e-07,-7.84246264105598e-07],
			[0,-1.108908997630632e-10,8.49662317661232e-11,3.103989306406104e-10,4.794410407230257e-10,8.734863327546463e-10,5.516378315889486e-10],
			[0,0.2366380559414161,0.09258692881642809,-3.81601201367037,-0.002337399247439649,3.03929136610369,7392.61125312155],
			[0,-0.0002313761744830967,-0.0001743775664453867,-4.484318935305441e-05,6.254292402833378e-06,-0.0002070649866929591,0.001613569900047856],
			[0,5.86156324056919e-07,-2.337630840690578e-07,-5.89845830366307e-07,3.671216691023175e-08,-2.757217970892893e-08,-1.217609584338626e-08],
			[0,-3.590613358863417e-10,9.116282684183654e-11,9.649063304202571e-10,4.532689050714879e-10,7.85190577364595e-10,7.61191923329223e-10],
			[-0,2.488481204240076e-05,0.0003914415588992235,-0.04073832778935168,-6.964575259944242e-05,0.0004087307049014378,-0.0007470945418843551],
			[0,8.510425051864308e-07,6.305895964380285e-07,4.295810722334644e-07,2.515264006746708e-09,1.466837135818728e-07,-8.193062385655789e-07],
			[0,-5.447927258441146e-10,8.619553563896683e-10,8.307739089041248e-10,4.943124399034047e-11,3.162605531149712e-11,2.680274266070446e-11],
			[0,1.346197836993138e-05,-3.365708097480338e-06,6.950955587955532e-06,-3.386125617509787e-08,-1.4388848039765e-06,-6.187598815129373e-07],
			[0,-9.987353123483167e-10,-7.081618276683242e-10,-5.144665806220456e-10,-2.993255466318746e-12,-3.312166140712862e-11,1.387138810500569e-10],
			[-0,4.089281502868337e-08,8.121329854450151e-11,-1.872758485077357e-07,1.187577288280564e-11,8.125369284622458e-10,-3.504553461593446e-10],
			[0,0.02033787938464231,0.00526561282391355,-0.8809443404317996,-0.008577105324773132,0.1011779496772824,-1.53353419787725],
			[0,-0.0001403393594175274,4.524722136962841e-05,0.0002348913451422878,2.449068592248082e-05,0.0001717853186196975,-0.0004269188508372486],
			[0,3.250524959029793e-07,8.062265468241926e-08,-7.825229040819206e-08,1.748641572721497e-07,-2.778395425136358e-07,1.243471383601184e-07],
			[0,-4.041789987684518e-10,-3.307240615156745e-10,-4.380479019137922e-10,-6.510817764769031e-10,-6.976038012333425e-10,-1.511606891104759e-09],
			[0,-0.3602039204966996,-0.2232782904742923,18.7090944066926,-0.007220940013036895,-2.356315021475152,-7435.508046754197],
			[0,-0.0002657576633564783,-0.0001052540919729332,0.006087806308369074,3.3731241796353e-05,-0.0002155079165524136,0.002407963821163995],
			[0,9.475724020607828e-07,-3.817754329950309e-07,-1.100352151764291e-06,9.825848090764633e-08,-3.40046624086545e-08,5.372808005716406e-07],
			[0,-5.545826992302567e-10,3.170416721094344e-10,8.807709890510555e-10,5.264369843765008e-10,9.632783428652381e-10,9.791020250702763e-10],
			[0,8.073965101194777e-05,-0.001770078898935124,0.04085307800490464,6.679083327212706e-05,-0.0005528835727374398,0.0006063021760019269],
			[0,8.639506622041027e-07,4.248634335160024e-07,-1.4012612665283e-05,-2.801411117167964e-08,1.566792341739657e-07,-1.248971097581728e-06],
			[0,-1.15712254285879e-09,1.232802456719385e-09,1.742893132267567e-09,5.732931763985593e-11,4.925347392059442e-11,-1.048126365250518e-10],
			[-0,-1.439673428047255e-06,2.587919782138634e-06,-8.413778169788913e-05,8.546994990735922e-09,-1.49993618187933e-06,-4.372012445495075e-08],
			[0,-7.394843577226698e-10,-5.274051633840506e-10,1.075073080597771e-08,7.201505743315686e-12,-3.606440829117272e-11,2.159125759105594e-10],
			[-0,-5.449683795611121e-08,-0.05656683422635193,-0.002967033943432468,-1.176077562578716e-12,-0.001344090713351483,6.675265731994126e-05],
			[0,3.206856354828297e-08,7.116152279189373e-08,2.146220793752369e-08,4.656817681403428e-09,-3.336158976164369e-09,3.180018850422505e-09],
			[0,2.649951917212144e-07,7.202022941347329e-08,-1.419895243880349e-08,-5.64534806040461e-09,8.010933260065273e-09,6.989183831212999e-09],
			[0,6.241938316489766e-08,8.193076897734293e-08,3.427537644178172e-08,1.214803060632076e-08,1.545730635825568e-08,1.581532283762658e-08],
			[0,4.64526557312001e-11,-7.38457231357986e-12,3.239647451307257e-11,2.83537722230684e-11,2.702366337901085e-11,2.288611624853991e-11],
			[0,-7.648888770108574e-11,-9.877200009135777e-11,-8.011530791947166e-11,-7.505097286680149e-11,-7.701937384167032e-11,-8.212215967212867e-11],
			[0,6.669187488939574e-11,-1.036630232613901e-10,-3.400213368238406e-11,-6.575182016608639e-12,9.393326753949874e-13,-1.635466860376801e-12],
			[0,-2.075270406769381e-10,-1.096821916848668e-10,-8.665093906766987e-11,-7.392639993156534e-11,-8.29844814893848e-11,-9.569369427774601e-11],
			[0,-1.745624448576465e-10,-5.502120342222949e-11,-1.558413465791821e-12,2.055636607957474e-11,-1.657585617676875e-12,-2.088962002516426e-11],
			[0,-5.535119468540137e-10,-9.194679978266247e-11,4.554577284613379e-11,-4.273321875064424e-12,-9.322102715915172e-12,-4.590841773198973e-12],
			[0,4.272079972817395e-11,-2.177392138813939e-11,-6.935008537468999e-13,-6.914448061574072e-12,-3.215659739969115e-11,-4.069822517250504e-11],
			[0,-1.076006568295858e-10,-1.669189801960124e-10,-1.505341776149328e-10,-1.356813201342206e-10,-1.211028789755401e-10,-1.277407856556532e-10],
			[0,-7.743245786306861e-11,-1.101479059591244e-10,-3.989304975566922e-11,-1.630930739381904e-12,-2.796793115731886e-12,-1.376493080678796e-12],
			[0,-1.333553278375113e-10,-4.661204035161125e-12,8.253058200296591e-11,1.002581716604859e-10,1.066788160704542e-10,1.12648938638933e-10]
		],
		"ir": [
			[-0.2720176916449589,-2.421857307130589,21.26510304270616,379.5065930811737,-7.833442118213486,-827.9919487288518,-2243.29165593076],
			[0.0003024094222598764,0.002131441175796501,0.08586698397700832,-2.177065779604874,0.0201419121987188,0.04617564907988894,-7.665839230079734],
			[1.172160458374362e-05,2.764137862604343e-05,1.91268165101716e-05,0.0003935201181463931,0.0001630925201803352,-8.664729654752268e-05,-0.001524559049519918],
			[-2.856557929971747e-08,-1.425585079154733e-07,-1.619972540919877e-07,-1.580691114492543e-06,-4.083376098231677e-07,2.081904651672666e-07,2.749695913577486e-06],
			[6.518384837628888e-11,2.31103594696221e-10,6.137481525161288e-10,7.677218036487792e-10,-2.439151873824399e-10,-2.549961963743718e-09,-7.022115406768337e-09],
			[-0.02141903599569203,-1.72327998419657,0.1162563517896889,19.17756693634929,0.02045525563799257,-0.2130563946043061,42.74033146457615],
			[4.420437691881682e-06,-4.560884685987469e-05,-0.000801578049102391,0.01526786202186848,2.904854325556423e-07,-2.573413863609302e-05,0.0120447440815892],
			[2.392776224046075e-07,-7.684469239458717e-08,-1.600434485450553e-07,-9.045878227657342e-07,2.929387364507025e-07,4.862276031234272e-07,1.56213415805072e-06],
			[-4.227612964417559e-10,-4.387853677408574e-11,-5.340556546893833e-10,2.868904040875134e-09,1.346690133183087e-09,1.939849593835582e-09,1.774295093860465e-09],
			[0.001124247112936605,-0.00238769363519785,0.009311660498139512,0.1718157311251525,-0.0001141951880521112,-0.001666795920382097,-0.001854454573358242],
			[-3.271450218502243e-07,3.359266059240468e-07,2.563316261839851e-06,-3.570452035400032e-05,3.394546541565555e-08,1.684035190874512e-08,-6.256974558499111e-06],
			[1.990364898501588e-10,1.893061657109221e-09,2.405578312003079e-09,1.89323583699905e-09,1.35916441935749e-10,1.099773149490633e-11,-2.435968382164469e-10],
			[9.565973267212953e-06,9.211861297992738e-05,2.53101030706217e-07,0.0003753542166544182,1.745864395304565e-07,1.361480843953872e-05,2.627045278761644e-06],
			[8.50269318219677e-10,-4.115714493244982e-10,-2.474173498851864e-09,2.815464114321993e-08,-1.967893098198883e-11,-2.722827494297325e-12,1.080891412775631e-09],
			[-3.906754954994422e-08,-1.300682725858386e-07,-0.08872548323542771,0.05058231388253093,-2.396415247716843e-10,0.01438402067380904,-0.0003083007476471892],
			[-0.002645318432198064,-0.001222610558259376,0.106917640591103,-0.04726551911688184,-0.001893483361658108,0.4503741781371235,-6.01595589202008],
			[9.160815557234763e-05,3.37473953337118e-05,-6.560183646754615e-05,7.75026905864188e-05,0.0003841587679388938,0.0007216505135593987,-4.203338350598784e-05],
			[-4.184942664037688e-07,-1.26247161573398e-07,1.756033687949756e-07,-2.033274795733121e-06,-1.310999046840011e-06,-3.191656391475567e-06,-2.603353326119704e-06],
			[6.258085837902679e-10,2.339942545979017e-10,-3.939192684037458e-10,5.488619373530426e-10,1.103542947613152e-09,1.957077218155007e-09,-5.811925085861634e-10],
			[-0.05531153394527098,-0.594574024190766,0.5501211769743192,-15.39821965406908,-0.008988336896751362,13.00482737691914,14477.91285537559],
			[-3.484289960672432e-06,4.751186836749611e-05,-0.0009564855829629374,-1.324095642194531e-05,6.138672894748673e-05,-0.0008973508673523666,0.009330130001992032],
			[-2.972422443428513e-07,-3.54330999110764e-07,-1.09650727281727e-07,9.021397422149478e-07,9.22552608367926e-08,-1.974232958581849e-08,7.392299780738782e-07],
			[1.150857938754605e-09,1.108467620459073e-10,3.250256638349873e-10,4.749405157560996e-09,2.359071673638177e-09,3.715057081131022e-09,4.090343343507267e-09],
			[-0.002234694230062935,0.002895383733557235,0.000799200907665022,-0.3450173392937584,-0.0002229235580348456,0.0008166569728054616,-0.0008770411941235221],
			[3.617615858268744e-07,-8.9537634802103e-08,3.082478844608131e-06,6.767658682792374e-07,-8.790286935377789e-10,6.343462572073625e-07,-4.779214329347104e-06],
			[4.014861901507779e-10,3.102795838789834e-09,2.590811601393889e-09,-4.412422390892655e-10,2.350650285757394e-10,1.136186105933748e-10,-1.262798279341945e-10],
			[-4.349668212113089e-06,-9.273771996103617e-05,-1.310707517641332e-05,-2.181547972327402e-05,-1.577146376516879e-07,-5.971801914713384e-06,-8.339304423233757e-07],
			[-2.040658542739015e-09,1.200235216860554e-10,-3.074621223789152e-09,-5.72526125189698e-10,-1.285457607372383e-11,-1.424444323301155e-10,8.173655437059086e-10],
			[7.265161792135572e-08,-2.401553802314853e-07,2.890956717316797e-10,9.234231246920752e-08,-4.811672629495958e-11,3.418990351248953e-09,-1.739228584034786e-10],
			[0.001707195076924122,0.001154992541077747,0.03420397096611649,-0.9736377410004968,0.002859585801004105,0.1981891690329797,-3.065289726353726],
			[-1.491589600650255e-05,-3.496397683459793e-05,-9.50208939775573e-05,-1.999209258072106e-05,-0.0003507110510447868,-0.000469911644831151,-0.0008183232018966326],
			[8.863958710948417e-08,2.745569864165444e-07,8.258489980778758e-07,8.631388592120692e-07,2.479036608859013e-06,4.114713137660434e-06,5.98087658788689e-06],
			[-1.413795459055608e-10,-5.628592782821303e-10,-1.840444480668683e-09,-3.152801465381312e-09,-5.237870028383791e-09,-9.735553707493185e-09,-1.346786381481662e-08],
			[0.06904862641289078,2.368912554147314,-0.9821567644534714,-7.858791556340754,0.02929889183680837,-10.53909721200839,-14515.42579724926],
			[-3.198720633465727e-05,1.734142892692386e-05,-0.0002798240291237095,0.006853985524535311,0.0001006502956239903,-0.0003243705949299758,0.004830390067475635],
			[3.077922290356051e-08,-1.85838841038203e-07,-4.229857827812785e-07,-7.702969128300827e-07,9.714604132864109e-08,-1.346523907208953e-07,-4.428746203373186e-08],
			[1.006719843803397e-10,2.661312546020485e-10,7.339405128196325e-10,2.311513966532732e-09,1.033620865361224e-09,1.648852454778155e-09,1.670013230540375e-09],
			[0.001474168234768087,-0.0009672147407935656,-0.008439447171858315,0.1894717898423223,0.0002530630518956606,-0.001432695447329791,-0.001782612570802748],
			[1.781786065689666e-07,4.086884810716173e-09,1.031280996780334e-06,-1.585365488939143e-05,-7.73997694866653e-08,2.490167291363849e-07,-2.466342224343033e-06],
			[2.893156407316268e-10,1.258142850655052e-09,1.365049512196638e-09,1.121877535651188e-09,4.116829198250233e-11,5.404065481960346e-11,2.353486976167836e-11],
			[-1.009402675787083e-05,2.341802328639933e-06,8.999111841186731e-06,-0.0003821339522864413,5.467488171706866e-08,-6.6226156116337e-06,-7.811044060719628e-08],
			[-4.91414560914299e-10,-1.146266019037892e-11,-1.06221651527527e-09,1.238883130997878e-08,2.600419071651661e-11,-5.647029609933507e-11,4.219538470798233e-10],
			[-1.233709513720469e-08,3.679130892363778e-07,0.08872548621020993,-0.05058238754238753,2.659225058830059e-10,-0.01438402426262616,0.0003083006793173286],
			[5.277959224418364e-08,1.195164837733038e-08,1.090064829683227e-08,7.056059243477714e-08,-6.655696465614672e-08,1.722405914970285e-08,4.490210759978096e-08],
			[2.747202380861353e-07,-7.796259950087157e-09,-4.143346318622526e-08,-6.103114079138941e-08,-5.09939704026656e-08,1.056521933609247e-09,2.552357465322553e-08],
			[1.222925626503791e-07,3.018204064894968e-08,7.513773091340385e-08,1.14145070681508e-07,-2.628473669509224e-08,6.604322445010806e-08,1.008171772631076e-07],
			[-2.735771292064445e-10,1.04793423302323e-10,2.588357474916121e-10,3.720022367094202e-10,1.847698957154923e-10,5.776462796110418e-11,1.233029029261529e-12],
			[-1.990499966289351e-10,-3.452721135865404e-11,-9.646812757177101e-11,-1.478002534608547e-10,-2.372219004043881e-10,-3.402971134387152e-10,-4.092056053189955e-10],
			[1.122828677420999e-09,-2.773745476184065e-10,-3.167040244520252e-10,-4.644256136344528e-10,1.056346388777064e-11,-2.862963473677079e-12,1.287079616920287e-12],
			[-1.880323975480718e-10,-9.787998487174762e-12,8.03771347201469e-11,8.422474122751066e-11,5.671723524299999e-11,-2.299678445461818e-11,-8.085391078812729e-11],
			[-2.934623561818615e-10,1.577341688107647e-10,3.236873410239866e-10,3.777142637856345e-10,3.862740233064277e-10,2.93360967409342e-10,2.511778644972161e-10],
			[-6.812194791073904e-10,-3.460093569078473e-11,-8.089864695076076e-11,-2.668929511645512e-11,-2.079910493037297e-11,-2.169176078848909e-11,-1.989103150313605e-11],
			[-7.839075142757491e-11,1.629990843743169e-10,2.56943256812302e-10,3.743396093378328e-10,1.498678822048493e-10,-3.535284855861441e-11,-1.123613009586337e-10],
			[-1.404235825457989e-10,-1.790262202667267e-10,-2.342819994475929e-10,-3.288765600745792e-10,-3.448006321130894e-10,-3.898015515194021e-10,-4.299973486486818e-10],
			[-1.826623484617231e-10,-2.518662246787011e-10,-3.922909200362502e-10,-4.617751059226591e-10,1.326533329730421e-11,-9.105999317230775e-12,-9.933180823334467e-12],
			[-5.86373242061065e-10,-2.117377386332611e-10,-3.638596213028342e-10,-5.009942219721575e-10,-5.821906542171857e-10,-6.288589066979832e-10,-6.499414897032983e-10]
		]
	}
}
