<?xml version="1.0" encoding="UTF-8"?>
<svg width="480px" height="240px" viewBox="0 0 480 240" version="1.1" xmlns="http://www.w3.org/2000/svg" xmlns:xlink="http://www.w3.org/1999/xlink">
    <title>com.android.filemanager_b_s5_2x1_sc</title>
    <defs>
        <path d="M238.628467,54.3947586 L238.916442,54.3984837 C243.990243,54.5298554 248.319391,58.122843 249.383402,63.0855641 L249.440124,63.3679217 L250.520353,69.1301327 L250.575089,69.4015499 C251.546322,73.8987857 255.468106,77.1551574 260.066756,77.2836134 L260.349132,77.2875537 L320.98827,77.2882731 C320.993475,77.019645 320.996953,76.741243 320.998694,76.4524669 L321,76.0114474 L320.999,54.3947586 L359.999,54.3947586 L359.99926,68.5326738 C359.955349,88.3102172 357.95866,96.2450014 354.233056,103.602497 L353.979275,104.097761 C353.851078,104.345084 353.720922,104.592038 353.588815,104.839055 C349.405445,112.661278 343.266519,118.800203 335.444297,122.983574 C327.704414,127.122908 320.026557,129.347641 299.137915,129.394018 L0,129.394 L0,54.3947586 L238.628467,54.3947586 Z" id="path-1"></path>
    </defs>
    <g id="com.android.filemanager" stroke="none" stroke-width="1" fill="none" fill-rule="evenodd">
        <g id="编组" transform="translate(99.000000, 89.605241)">
            <mask id="mask-2" fill="white">
                <use xlink:href="#path-1"></use>
            </mask>
            <use id="形状结合" fill="#FFFFFF" xlink:href="#path-1"></use>
            <path d="M38.9986684,0.000101181512 L38.9999922,54.3947586 L0,54.394 L0.000754817456,52.6027066 C0.0445240922,34.3601514 1.99093384,27.6476655 5.60978678,20.8809988 C9.27023572,14.0365543 14.6417958,8.66499429 21.4862402,5.00454534 C26.1139247,2.52963258 30.7162683,0.836940496 38.9986684,0.000101181512 Z M321.00033,1.58978386e-12 C329.283361,0.83680405 333.885889,2.52953283 338.51376,5.00454534 C345.358204,8.66499429 350.729764,14.0365543 354.390213,20.8809988 C358.009066,27.6476655 359.955476,34.3601514 359.999245,52.6027066 L359.999,54.394 L320.999,54.394 L321.00033,1.58978386e-12 Z" id="形状结合" fill="#FFFFFF" opacity="0.600000024"></path>
        </g>
    </g>
</svg>