<?xml version="1.0" encoding="UTF-8"?>
<svg width="480px" height="480px" viewBox="0 0 480 480" version="1.1" xmlns="http://www.w3.org/2000/svg" xmlns:xlink="http://www.w3.org/1999/xlink">
    <title>com.vivo.vivoconsole_b_s5_2x2_sc</title>
    <defs>
        <path d="M61.5332448,-2.48601674e-15 L376.466755,2.48601674e-15 C397.863205,-1.44444732e-15 405.622075,2.22781467 413.444297,6.41118489 C421.266519,10.5945551 427.405445,16.7334809 431.588815,24.5557031 C435.772185,32.3779253 438,40.136795 438,61.5332448 L438,376.466755 C438,397.863205 435.772185,405.622075 431.588815,413.444297 C427.405445,421.266519 421.266519,427.405445 413.444297,431.588815 C405.622075,435.772185 397.863205,438 376.466755,438 L61.5332448,438 C40.136795,438 32.3779253,435.772185 24.5557031,431.588815 C16.7334809,427.405445 10.5945551,421.266519 6.41118489,413.444297 C2.22781467,405.622075 9.62964878e-16,397.863205 -1.65734449e-15,376.466755 L1.65734449e-15,61.5332448 C-9.62964878e-16,40.136795 2.22781467,32.3779253 6.41118489,24.5557031 C10.5945551,16.7334809 16.7334809,10.5945551 24.5557031,6.41118489 C32.3779253,2.22781467 40.136795,1.44444732e-15 61.5332448,-2.48601674e-15 Z" id="path-1"></path>
        <path d="M183.034486,2.67626816 L336.153958,91.1856119 C342.317566,94.7484303 346.113707,101.327474 346.113707,108.446725 L346.113707,285.506724 C346.113707,292.625976 342.317566,299.205019 336.153958,302.767837 L183.034486,391.277181 C176.861296,394.845539 169.252412,394.845539 163.079221,391.277181 L9.95974893,302.767837 C3.79614116,299.205019 -2.04444253e-14,292.625976 0,285.506724 L0,108.446725 C-1.07477357e-14,101.327474 3.79614116,94.7484303 9.95974893,91.1856119 L163.079221,2.67626816 C169.252412,-0.892089372 176.861296,-0.892089372 183.034486,2.67626816 Z" id="path-3"></path>
        <linearGradient x1="50%" y1="16.1813628%" x2="50%" y2="100%" id="linearGradient-5">
            <stop stop-color="#A9D0EB" stop-opacity="0.94" offset="0%"></stop>
            <stop stop-color="#E8EBED" offset="100%"></stop>
        </linearGradient>
    </defs>
    <g id="com.vivo.vivoconsole" stroke="none" stroke-width="1" fill="none" fill-rule="evenodd">
        <g id="椭圆形" transform="translate(21.000000, 21.000000)">
            <mask id="mask-2" fill="white">
                <use xlink:href="#path-1"></use>
            </mask>
            <use id="蒙版" fill="#FFFFFF" xlink:href="#path-1"></use>
            <g id="均衡备份-7" mask="url(#mask-2)">
                <g transform="translate(136.886293, 95.000000)">
                    <mask id="mask-4" fill="white">
                        <use xlink:href="#path-3"></use>
                    </mask>
                    <use id="形状结合" stroke="none" fill="#FAFAFA" fill-rule="nonzero" opacity="0" xlink:href="#path-3"></use>
                    <g id="编组-4" stroke="none" stroke-width="1" fill="none" fill-rule="evenodd" mask="url(#mask-4)">
                        <g transform="translate(-3.656470, 95.932312)" id="形状结合">
                            <path d="M175.125646,-101.044413 L175.125646,-63.7149854 L32.3308884,18.6750745 L32.3308884,183.413752 L32.348,183.423587 L-1.09139364e-11,202.088826 L-1.09139364e-11,-2.06057393e-12 L175.125646,-101.044413 Z" fill="#D4D4D4" opacity="0.8"></path>
                            <path d="M317.903,183.424617 L350.251291,202.088826 L175.125646,303.133239 L0,202.088826 L32.347,183.424617 L175.125646,265.803811 L317.903,183.424617 Z" fill="#EFEFEF" opacity="0.7"></path>
                        </g>
                    </g>
                    <polygon id="路径-131" stroke="none" fill="url(#linearGradient-5)" fill-rule="evenodd" opacity="0.87" mask="url(#mask-4)" points="171.469176 399.065551 171.469176 196.976725 346.594822 95.9323117 346.594822 298.021138"></polygon>
                    <polygon id="路径-129" stroke="none" fill="#D3D3D3" fill-rule="evenodd" opacity="0.4" mask="url(#mask-4)" points="171.469176 196.976725 -3.65646952 95.9323117 171.469176 -5.11210132 346.594822 95.9323117"></polygon>
                </g>
            </g>
        </g>
    </g>
</svg>