<?xml version="1.0" encoding="UTF-8"?>
<svg width="480px" height="480px" viewBox="0 0 480 480" version="1.1" xmlns="http://www.w3.org/2000/svg" xmlns:xlink="http://www.w3.org/1999/xlink">
    <title>com.vivo.symmetry_b_s5_2x2_mc</title>
    <g id="com.vivo.symmetry" stroke="none" stroke-width="1" fill="none" fill-rule="evenodd" opacity="0.949999988">
        <g id="编组" transform="translate(121.818182, 121.818182)" fill="#07EC56" fill-rule="nonzero">
            <g id="编组-42">
                <path d="M118.181818,0 C183.451834,0 236.363636,52.9118023 236.363636,118.181818 C236.363636,183.451834 183.451834,236.363636 118.181818,236.363636 C52.9118023,236.363636 0,183.451834 0,118.181818 C0,52.9118023 52.9118023,0 118.181818,0 Z M118.181818,36.3636364 C72.9948841,36.3636364 36.3636364,72.9948841 36.3636364,118.181818 C36.3636364,163.368752 72.9948841,200 118.181818,200 C163.368752,200 200,163.368752 200,118.181818 C200,72.9948841 163.368752,36.3636364 118.181818,36.3636364 Z" id="形状结合"></path>
            </g>
        </g>
    </g>
</svg>