<?xml version="1.0" encoding="UTF-8"?>
<svg width="480px" height="480px" viewBox="0 0 480 480" version="1.1" xmlns="http://www.w3.org/2000/svg" xmlns:xlink="http://www.w3.org/1999/xlink">
    <title>com.android.contacts_b_s5_2x2_mc</title>
    <g id="com.android.contacts" stroke="none" stroke-width="1" fill="none" fill-rule="evenodd">
        <g id="linkman" transform="translate(158.634615, 154.000000)" fill="#FFFFFF">
            <path d="M81,0 C102.539105,-3.95666944e-15 120,17.4608948 120,39 L120,51 C120,72.5391052 102.539105,90 81,90 C59.4608948,90 42,72.5391052 42,51 L42,39 C42,17.4608948 59.4608948,3.95666944e-15 81,0 Z" id="矩形"></path>
        </g>
    </g>
</svg>