<?xml version="1.0" encoding="UTF-8"?>
<svg width="240px" height="480px" viewBox="0 0 240 480" version="1.1" xmlns="http://www.w3.org/2000/svg" xmlns:xlink="http://www.w3.org/1999/xlink">
    <title>com.bbk.theme_b_s5_1x2_sc</title>
    <g id="com.bbk.theme" stroke="none" stroke-width="1" fill="none" fill-rule="evenodd" opacity="0.6">
        <g id="编组-17" transform="translate(75.000000, 177.000000)" fill="#FFFFFF">
            <path d="M0,0 L90,0 L90,46.1573349 C90,47.9131775 89.8171803,48.5498884 89.4738832,49.1917982 C89.1305861,49.8337081 88.6268115,50.3374826 87.9849017,50.6807798 C87.3429919,51.0240769 86.7062809,51.2068966 84.9504383,51.2068966 L5.0495617,51.2068966 C3.29371909,51.2068966 2.65700813,51.0240769 2.01509832,50.6807798 C1.3731885,50.3374826 0.869413923,49.8337081 0.526116797,49.1917982 C0.182819672,48.5498884 7.90231457e-17,47.9131775 -1.36005558e-16,46.1573349 L0,0 L0,0 Z" id="矩形" transform="translate(45.000000, 25.603448) scale(1, -1) translate(-45.000000, -25.603448) "></path>
        </g>
    </g>
</svg>