<?xml version="1.0" encoding="UTF-8"?>
<svg width="480px" height="480px" viewBox="0 0 480 480" version="1.1" xmlns="http://www.w3.org/2000/svg" xmlns:xlink="http://www.w3.org/1999/xlink">
    <title>com.android.dialer_b_s5_2x2_0_mc</title>
    <g id="com.android.dialer" stroke="none" stroke-width="1" fill="none" fill-rule="evenodd">
        <g id="编组" transform="translate(137.476411, 148.124165)" fill="#FFFFFF" fill-rule="nonzero">
            <path d="M130.430505,158.455726 C130.430505,158.455726 130.430505,158.455726 130.430505,158.455726 C130.901106,165.533872 131.554667,173.777 132.39119,186.358843 C132.438021,187.063217 132.493016,187.890379 132.556175,188.84033 C132.847653,193.224276 129.530048,197.014453 125.146102,197.305926 C124.707532,197.335085 124.2673,197.327847 123.829926,197.284286 C123.378654,197.239342 122.953643,197.192446 122.554894,197.1436 C76.3763525,191.486752 40.610545,152.037957 40.610545,104.214465 C40.610545,57.1175277 75.2978689,18.1427567 120.457501,11.5664633 C120.67352,11.5350059 121.010631,11.4971832 121.468833,11.4529954 L121.468834,11.4530095 C126.945437,10.9248598 131.81325,14.9363734 132.3414,20.4129759 C132.393944,20.9578291 132.401493,21.5060861 132.363971,22.0521795 C132.363971,22.0521795 132.363971,22.0521795 132.363971,22.0521795 C132.109698,25.7528167 131.453324,35.0964433 130.394851,50.0830594 L130.394869,50.0830607 C130.070552,54.6749698 126.729111,58.4895484 122.219874,59.4156103 C122.219874,59.4156103 122.219874,59.4156103 122.219874,59.4156103 L120.940435,59.6927972 C102.595846,63.8751217 80.9734687,78.6704342 80.9734687,104.214465 C80.9734687,129.710433 102.526457,144.50406 120.836884,148.712429 C121.021649,148.754894 121.335468,148.813411 121.77834,148.887978 C126.530431,149.688098 130.110813,153.647363 130.430505,158.455726 Z" id="路径备份-4" transform="translate(86.882284, 104.212791) rotate(-30.000000) translate(-86.882284, -104.212791) "></path>
        </g>
    </g>
</svg>