<?xml version="1.0" encoding="UTF-8"?>
<svg width="240px" height="240px" viewBox="0 0 240 240" version="1.1" xmlns="http://www.w3.org/2000/svg" xmlns:xlink="http://www.w3.org/1999/xlink">
    <title>com.android.settings_b_s5_1x1_mc</title>
    <g id="com.android.settings" stroke="none" stroke-width="1" fill="none" fill-rule="evenodd">
        <g id="编组" transform="translate(53.000000, 50.000000)" fill="#FFFFFF">
            <path d="M21.4941847,21.0413687 C23.2081265,14.9698574 29.5194832,11.4373493 35.5909946,13.1512911 L35.5909946,13.1512911 L44.1038636,15.5544097 C58.7934775,19.7011768 74.3442154,19.7011768 89.0338292,15.5544097 L89.0338292,15.5544097 L97.5466983,13.1512911 C98.4129149,12.9067647 99.3049963,12.7654729 100.20438,12.7303557 C106.508368,12.484211 111.818299,17.3950629 112.064444,23.6990505 L112.064444,23.6990505 L112.409563,32.5378746 C113.005094,47.789949 117.810536,62.5795796 126.293686,75.2688111 L126.293686,75.2688111 L131.209809,82.6224262 C131.710043,83.3706843 132.120088,84.1754427 132.431411,85.0199556 C134.613548,90.9393411 131.583909,97.5069226 125.664524,99.6890594 L125.664524,99.6890594 L117.36495,102.748634 C103.043394,108.028168 90.4625833,117.168662 81.0158445,129.157806 L81.0158445,129.157806 L75.5413065,136.105708 C74.9842516,136.812684 74.3455917,137.451343 73.6386164,138.008398 C68.6832636,141.912925 61.5009125,141.061061 57.5963864,136.105708 L57.5963864,136.105708 L52.1218483,129.157806 C42.6751096,117.168662 30.0942984,108.028168 15.7727426,102.748634 L15.7727426,102.748634 L7.47316918,99.6890594 C6.62865626,99.3777361 5.82389793,98.9676912 5.07563984,98.4674572 C-0.169073431,94.9612015 -1.57837176,87.8671395 1.92788392,82.6224262 L1.92788392,82.6224262 L6.84400678,75.2688111 C15.3271569,62.5795796 20.1325992,47.789949 20.7281297,32.5378746 L20.7281297,32.5378746 L21.0732493,23.6990505 C21.1083665,22.7996668 21.2496583,21.9075853 21.4941847,21.0413687 Z M66.5688464,47.2896379 C53.9512641,47.2896379 43.7226926,57.5182094 43.7226926,70.1357917 C43.7226926,82.7533741 53.9512641,92.9819456 66.5688464,92.9819456 C79.1864288,92.9819456 89.4150003,82.7533741 89.4150003,70.1357917 C89.4150003,57.5182094 79.1864288,47.2896379 66.5688464,47.2896379 Z M66.5688464,58.7127148 C72.8776376,58.7127148 77.9919234,63.8270005 77.9919234,70.1357917 C77.9919234,76.4445829 72.8776376,81.5588686 66.5688464,81.5588686 C60.2600553,81.5588686 55.1457695,76.4445829 55.1457695,70.1357917 C55.1457695,63.8270005 60.2600553,58.7127148 66.5688464,58.7127148 Z" id="形状结合" opacity="0.699999988"></path>
            <path d="M73.6386164,2.45109274 C74.3455917,3.00814765 74.9842516,3.64680747 75.5413065,4.3537828 L81.0158445,11.3016855 C90.4625833,23.2908289 103.043394,32.4313233 117.36495,37.7108567 L125.664524,40.7704318 C131.583909,42.9525685 134.613548,49.52015 132.431411,55.4395356 C132.120088,56.2840485 131.710043,57.0888068 131.209809,57.8370649 L126.293686,65.19068 C117.810536,77.8799115 113.005094,92.6695421 112.409563,107.921617 L112.064444,116.760441 C111.818299,123.064428 106.508368,127.97528 100.20438,127.729135 C99.3049963,127.694018 98.4129149,127.552726 97.5466983,127.3082 L89.0338292,124.905081 C74.3442154,120.758314 58.7934775,120.758314 44.1038636,124.905081 L35.5909946,127.3082 C29.5194832,129.022142 23.2081265,125.489634 21.4941847,119.418122 C21.2496583,118.551906 21.1083665,117.659824 21.0732493,116.760441 L20.7281297,107.921617 C20.1325992,92.6695421 15.3271569,77.8799115 6.84400678,65.19068 L1.92788392,57.8370649 C-1.57837176,52.5923516 -0.169073431,45.4982897 5.07563984,41.992034 C5.82389793,41.4917999 6.62865626,41.0817551 7.47316918,40.7704318 L15.7727426,37.7108567 C30.0942984,32.4313233 42.6751096,23.2908289 52.1218483,11.3016855 L57.5963864,4.3537828 C61.5009125,-0.601570044 68.6832636,-1.4534334 73.6386164,2.45109274 Z M66.5688464,47.2896379 C53.9512641,47.2896379 43.7226926,57.5182094 43.7226926,70.1357917 C43.7226926,82.7533741 53.9512641,92.9819456 66.5688464,92.9819456 C79.1864288,92.9819456 89.4150003,82.7533741 89.4150003,70.1357917 C89.4150003,57.5182094 79.1864288,47.2896379 66.5688464,47.2896379 Z M66.5688464,58.7127148 C72.8776376,58.7127148 77.9919234,63.8270005 77.9919234,70.1357917 C77.9919234,76.4445829 72.8776376,81.5588686 66.5688464,81.5588686 C60.2600553,81.5588686 55.1457695,76.4445829 55.1457695,70.1357917 C55.1457695,63.8270005 60.2600553,58.7127148 66.5688464,58.7127148 Z" id="形状结合" fill-opacity="0.7"></path>
            <path d="M85.4538015,16.4791439 C93.0942858,24.6841468 102.329907,31.2548614 112.599453,35.7838376 L112.663104,36.5397977 C113.703985,48.4028301 117.294737,59.8946268 123.180261,70.2300712 C117.169825,80.7840865 113.552505,92.5451771 112.600236,104.676058 C102.329898,109.204634 93.0942679,115.775357 85.4529873,123.980651 C73.0329016,121.066559 60.1047913,121.066559 47.6838914,123.980347 C40.0432791,115.7752 30.8074426,109.204383 20.5376515,104.675394 C19.5851874,92.5451771 15.9678679,80.7840865 9.95720974,70.2290291 C15.9679485,59.6751296 19.5851887,47.9141984 20.5374527,35.7834854 C30.8074326,31.2551123 40.0432611,24.6843035 47.6846833,16.4788641 C60.1047913,19.3929321 73.0329016,19.3929321 85.4538015,16.4791439 Z M66.5688464,47.2896379 C53.9512641,47.2896379 43.7226926,57.5182094 43.7226926,70.1357917 C43.7226926,82.7533741 53.9512641,92.9819456 66.5688464,92.9819456 C79.1864288,92.9819456 89.4150003,82.7533741 89.4150003,70.1357917 C89.4150003,57.5182094 79.1864288,47.2896379 66.5688464,47.2896379 Z M66.5688464,58.7127148 C72.8776376,58.7127148 77.9919234,63.8270005 77.9919234,70.1357917 C77.9919234,76.4445829 72.8776376,81.5588686 66.5688464,81.5588686 C60.2600553,81.5588686 55.1457695,76.4445829 55.1457695,70.1357917 C55.1457695,63.8270005 60.2600553,58.7127148 66.5688464,58.7127148 Z" id="形状结合"></path>
        </g>
    </g>
</svg>