{
    "config": [
        {
            "phone": "PD2007F_EX",
            "version": "2000",
            "switch": ["0", "1", "1", "0", "1"],
            "settingGesture": {
                "animationsGesture": ["-1000"]
            },
            "settingUsb": {
                "animationsUsb": ["-1000"]
            },
            "settingLightEffect": {
                "animationsLightEffect": ["-1000"],
                "screenTopCorner": "106",
                "screenBottomCorner": "114"
            },
            "settingMonsterUI": {
                "animationsMonsterUI": ["-1000"]
            },
            "settingFade": {
                "animationsFade": ["-1000"]
            }
        },{
            "phone": "PD2007",
            "version": "2000",
            "switch": ["0", "1", "1", "0", "1"],
            "settingGesture": {
                "animationsGesture": ["-1000"]
            },
            "settingUsb": {
                "animationsUsb": ["-1000"]
            },
            "settingLightEffect": {
                "animationsLightEffect": ["-1000"],
                "screenTopCorner": "110",
                "screenBottomCorner": "105"
            },
            "settingMonsterUI": {
                "animationsMonsterUI": ["-1000"]
            },
            "settingFade": {
                "animationsFade": ["-1000"]
            }
        },{
            "phone": "PD2001",
            "version": "2000",
            "switch": ["0", "1", "1", "0", "1"],
            "settingGesture": {
                "animationsGesture": ["-1000"]
            },
            "settingUsb": {
                "animationsUsb": ["-1000"]
            },
            "settingLightEffect": {
                "animationsLightEffect": ["-1000"],
                "screenTopCorner": "103",
                "screenBottomCorner": "94"
            },
            "settingMonsterUI": {
                "animationsMonsterUI": ["-1000"]
            },
            "settingFade": {
                "animationsFade": ["-1000"]
            }
        },{
            "phone": "PD2001F_EX",
            "version": "2000",
            "switch": ["0", "1", "1", "0", "1"],
            "settingGesture": {
                "animationsGesture": ["-1000"]
            },
            "settingUsb": {
                "animationsUsb": ["-1000"]
            },
            "settingLightEffect": {
                "animationsLightEffect": ["-1000"],
                "screenTopCorner": "103",
                "screenBottomCorner": "94"
            },
            "settingMonsterUI": {
                "animationsMonsterUI": ["-1000"]
            },
            "settingFade": {
                "animationsFade": ["-1000"]
            }
        },{
            "phone": "PD2002",
            "version": "2000",
            "switch": ["0", "1", "1", "0", "1"],
            "settingGesture": {
                "animationsGesture": ["-1000"]
            },
            "settingUsb": {
                "animationsUsb": ["-1000"]
            },
            "settingLightEffect": {
                "animationsLightEffect": ["-1000"],
                "screenTopCorner": "109",
                "screenBottomCorner": "109"
            },
            "settingMonsterUI": {
                "animationsMonsterUI": ["-1000"]
            },
            "settingFade": {
                "animationsFade": ["-1000"]
            }
        },{
            "phone": "PD2007F_EX",
            "version": "2000",
            "switch": ["0", "1", "1", "0", "1"],
            "settingGesture": {
                "animationsGesture": ["-1000"]
            },
            "settingUsb": {
                "animationsUsb": ["-1000"]
            },
            "settingLightEffect": {
                "animationsLightEffect": ["-1000"],
                "screenTopCorner": "106",
                "screenBottomCorner": "114"
            },
            "settingMonsterUI": {
                "animationsMonsterUI": ["-1000"]
            },
            "settingFade": {
                "animationsFade": ["-1000"]
            }
        },{
            "phone": "PD2005F_EX",
            "version": "2000",
            "switch": ["0", "1", "0", "0", "1"],
            "settingGesture": {
                "animationsGesture": ["-1000"]
            },
            "settingUsb": {
                "animationsUsb": ["-1000"]
            },
            "settingLightEffect": {
                "animationsLightEffect": ["-1000"],
                "screenTopCorner": "110",
                "screenBottomCorner": "105"
            },
            "settingMonsterUI": {
                "animationsMonsterUI": ["-1000"]
            },
            "settingFade": {
                "animationsFade": ["-1000"]
            }
        },{
            "phone": "PD2005",
            "version": "2000",
            "switch": ["0", "1", "0", "0", "1"],
            "settingGesture": {
                "animationsGesture": ["-1000"]
            },
            "settingUsb": {
                "animationsUsb": ["-1000"]
            },
            "settingLightEffect": {
                "animationsLightEffect": ["-1000"],
                "screenTopCorner": "110",
                "screenBottomCorner": "105"
            },
            "settingMonsterUI": {
                "animationsMonsterUI": ["-1000"]
            },
            "settingFade": {
                "animationsFade": ["-1000"]
            }
        },{
            "phone": "PD2006F_EX",
            "version": "2000",
            "switch": ["0", "1", "1", "0", "1"],
            "settingGesture": {
                "animationsGesture": ["-1000"]
            },
            "settingUsb": {
                "animationsUsb": ["-1000"]
            },
            "settingLightEffect": {
                "animationsLightEffect": ["-1000"],
                "screenTopCorner": "96",
                "screenBottomCorner": "94"
            },
            "settingMonsterUI": {
                "animationsMonsterUI": ["-1000"]
            },
            "settingFade": {
                "animationsFade": ["-1000"]
            }
        },{
            "phone": "PD2012",
            "version": "2000",
            "switch": ["1", "1", "1", "1", "1"],
            "settingGesture": {
                "animationsGesture": ["-1000"]
            },
            "settingUsb": {
                "animationsUsb": ["-1000"]
            },
            "settingLightEffect": {
                "animationsLightEffect": ["-1000"],
                "screenTopCorner": "104",
                "screenBottomCorner": "104"
            },
            "settingMonsterUI": {
                "animationsMonsterUI": ["-1000"]
            },
            "settingFade": {
                "animationsFade": ["-1000"]
            }
        },{
            "phone": "PD2011",
            "version": "2000",
            "switch": ["0", "1", "0", "0", "1"],
            "settingGesture": {
                "animationsGesture": ["-1000"]
            },
            "settingUsb": {
                "animationsUsb": ["-1000"]
            },
            "settingLightEffect": {
                "animationsLightEffect": ["-1000"],
                "screenTopCorner": "110",
                "screenBottomCorner": "105"
            },
            "settingMonsterUI": {
                "animationsMonsterUI": ["-1000"]
            },
            "settingFade": {
                "animationsFade": ["-1000"]
            }
        },{
            "phone": "PD2019",
            "version": "2000",
            "switch": ["0", "1", "1", "0", "1"],
            "settingGesture": {
                "animationsGesture": ["-1000"]
            },
            "settingUsb": {
                "animationsUsb": ["-1000"]
            },
            "settingLightEffect": {
                "animationsLightEffect": ["-1000"],
                "screenTopCorner": "108",
                "screenBottomCorner": "109"
            },
            "settingMonsterUI": {
                "animationsMonsterUI": ["-1000"]
            },
            "settingFade": {
                "animationsFade": ["-1000"]
            }
        },{
            "phone": "PD2024",
            "version": "2000",
            "switch": ["1", "1", "0", "1", "1"],
            "settingGesture": {
                "animationsGesture": ["-1000"]
            },
            "settingUsb": {
                "animationsUsb": ["-1000"]
            },
            "settingLightEffect": {
                "animationsLightEffect": ["-1000"],
                "screenTopCorner": "97",
                "screenBottomCorner": "97"
            },
            "settingMonsterUI": {
                "animationsMonsterUI": ["-1000"]
            },
            "settingFade": {
                "animationsFade": ["-1000"]
            }
        },{
            "phone": "PD2024F_EX",
            "version": "2000",
            "switch": ["1", "1", "1", "1", "1"],
            "settingGesture": {
                "animationsGesture": ["-1000"]
            },
            "settingUsb": {
                "animationsUsb": ["-1000"]
            },
            "settingLightEffect": {
                "animationsLightEffect": ["-1000"],
                "screenTopCorner": "97",
                "screenBottomCorner": "97"
            },
            "settingMonsterUI": {
                "animationsMonsterUI": ["-1000"]
            },
            "settingFade": {
                "animationsFade": ["-1000"]
            }
        },{
            "phone": "PD2025",
            "version": "2000",
            "switch": ["1", "1", "0", "1", "1"],
            "settingGesture": {
                "animationsGesture": ["-1000"]
            },
            "settingUsb": {
                "animationsUsb": ["-1000"]
            },
            "settingLightEffect": {
                "animationsLightEffect": ["-1000"],
                "screenTopCorner": "110",
                "screenBottomCorner": "105"
            },
            "settingMonsterUI": {
                "animationsMonsterUI": ["-1000"]
            },
            "settingFade": {
                "animationsFade": ["-1000"]
            }
        },{
            "phone": "PD2023",
            "version": "2000",
            "switch": ["1", "1", "1", "1", "1"],
            "settingGesture": {
                "animationsGesture": ["-1000"]
            },
            "settingUsb": {
                "animationsUsb": ["-1000"]
            },
            "settingLightEffect": {
                "animationsLightEffect": ["-1000"],
                "screenTopCorner": "111",
                "screenBottomCorner": "109"
            },
            "settingMonsterUI": {
                "animationsMonsterUI": ["-1000"]
            },
            "settingFade": {
                "animationsFade": ["-1000"]
            }
        },{
            "phone": "PD2030F_EX",
            "version": "2000",
            "switch": ["1", "1", "1", "1", "1"],
            "settingGesture": {
                "animationsGesture": ["-1000"]
            },
            "settingUsb": {
                "animationsUsb": ["-1000"]
            },
            "settingLightEffect": {
                "animationsLightEffect": ["-1000"],
                "screenTopCorner": "110",
                "screenBottomCorner": "105"
            },
            "settingMonsterUI": {
                "animationsMonsterUI": ["-1000"]
            },
            "settingFade": {
                "animationsFade": ["-1000"]
            }
        },{
            "phone": "PD2020",
            "version": "2000",
            "switch": ["0", "1", "1", "0", "1"],
            "settingGesture": {
                "animationsGesture": ["-1000"]
            },
            "settingUsb": {
                "animationsUsb": ["-1000"]
            },
            "settingLightEffect": {
                "animationsLightEffect": ["-1000"],
                "screenTopCorner": "105",
                "screenBottomCorner": "104"
            },
            "settingMonsterUI": {
                "animationsMonsterUI": ["-1000"]
            },
            "settingFade": {
                "animationsFade": ["-1000"]
            }
        },{
            "phone": "PD2020F_EX",
            "version": "2000",
            "switch": ["0", "1", "1", "0", "1"],
            "settingGesture": {
                "animationsGesture": ["-1000"]
            },
            "settingUsb": {
                "animationsUsb": ["-1000"]
            },
            "settingLightEffect": {
                "animationsLightEffect": ["-1000"],
                "screenTopCorner": "105",
                "screenBottomCorner": "104"
            },
            "settingMonsterUI": {
                "animationsMonsterUI": ["-1000"]
            },
            "settingFade": {
                "animationsFade": ["-1000"]
            }
        },{
            "phone": "PD2031",
            "version": "2000",
            "switch": ["0", "1", "1", "0", "1"],
            "settingGesture": {
                "animationsGesture": ["-1000"]
            },
            "settingUsb": {
                "animationsUsb": ["-1000"]
            },
            "settingLightEffect": {
                "animationsLightEffect": ["-1000"],
                "screenTopCorner": "106",
                "screenBottomCorner": "107"
            },
            "settingMonsterUI": {
                "animationsMonsterUI": ["-1000"]
            },
            "settingFade": {
                "animationsFade": ["-1000"]
            }
        },{
            "phone": "PD2038F_EX",
            "version": "2000",
            "switch": ["0", "1", "1", "0", "1"],
            "settingGesture": {
                "animationsGesture": ["-1000"]
            },
            "settingUsb": {
                "animationsUsb": ["-1000"]
            },
            "settingLightEffect": {
                "animationsLightEffect": ["-1000"],
                "screenTopCorner": "109",
                "screenBottomCorner": "107"
            },
            "settingMonsterUI": {
                "animationsMonsterUI": ["-1000"]
            },
            "settingFade": {
                "animationsFade": ["-1000"]
            }
        },{
            "phone": "PD2039F_EX",
            "version": "3000",
            "switch": ["0", "1", "1", "0", "1"],
            "settingGesture": {
                "animationsGesture": ["-1000"]
            },
            "settingUsb": {
                "animationsUsb": ["-1000"]
            },
            "settingLightEffect": {
                "animationsLightEffect": ["-1000"],
                "screenTopCorner": "104",
                "screenBottomCorner": "104"
            },
            "settingMonsterUI": {
                "animationsMonsterUI": ["-1000"]
            },
            "settingFade": {
                "animationsFade": ["-1000"]
            }
        },{
            "phone": "TD2006",
            "version": "3000",
            "switch": ["0", "1", "0", "0", "1"],
            "settingGesture": {
                "animationsGesture": ["-1000"]
            },
            "settingUsb": {
                "animationsUsb": ["-1000"]
            },
            "settingLightEffect": {
                "animationsLightEffect": ["-1000"],
                "screenTopCorner": "110",
                "screenBottomCorner": "105"
            },
            "settingMonsterUI": {
                "animationsMonsterUI": ["-1000"]
            },
            "settingFade": {
                "animationsFade": ["-1000"]
            }
        },{
            "phone": "PD2034",
            "version": "2000",
            "switch": ["0", "1", "1", "0", "1"],
            "settingGesture": {
                "animationsGesture": ["-1000"]
            },
            "settingUsb": {
                "animationsUsb": ["-1000"]
            },
            "settingLightEffect": {
                "animationsLightEffect": ["-1000"],
                "screenTopCorner": "72",
                "screenBottomCorner": "69"
            },
            "settingMonsterUI": {
                "animationsMonsterUI": ["-1000"]
            },
            "settingFade": {
                "animationsFade": ["-1000"]
            }
        },{
            "phone": "PD2046",
            "version": "3000",
            "switch": ["0", "1", "1", "0", "1"],
            "settingGesture": {
                "animationsGesture": ["-1000"]
            },
            "settingUsb": {
                "animationsUsb": ["-1000"]
            },
            "settingLightEffect": {
                "animationsLightEffect": ["-1000"],
                "screenTopCorner": "97",
                "screenBottomCorner": "97"
            },
            "settingMonsterUI": {
                "animationsMonsterUI": ["-1000"]
            },
            "settingFade": {
                "animationsFade": ["-1000"]
            }
        },{
            "phone": "TD2007",
            "version": "3000",
            "switch": ["0", "1", "1", "0", "1"],
            "settingGesture": {
                "animationsGesture": ["-1000"]
            },
            "settingUsb": {
                "animationsUsb": ["-1000"]
            },
            "settingLightEffect": {
                "animationsLightEffect": ["-1000"],
                "screenTopCorner": "110",
                "screenBottomCorner": "105"
            },
            "settingMonsterUI": {
                "animationsMonsterUI": ["-1000"]
            },
            "settingFade": {
                "animationsFade": ["-1000"]
            }
        },{
            "phone": "PD2031F_EX",
            "version": "2000",
            "switch": ["0", "1", "1", "0", "1"],
            "settingGesture": {
                "animationsGesture": ["-1000"]
            },
            "settingUsb": {
                "animationsUsb": ["-1000"]
            },
            "settingLightEffect": {
                "animationsLightEffect": ["-1000"],
                "screenTopCorner": "110",
                "screenBottomCorner": "105"
            },
            "settingMonsterUI": {
                "animationsMonsterUI": ["-1000"]
            },
            "settingFade": {
                "animationsFade": ["-1000"]
            }
        },{
            "phone": "PD2047",
            "version": "3000",
            "switch": ["0", "1", "0", "0", "1"],
            "settingGesture": {
                "animationsGesture": ["-1000"]
            },
            "settingUsb": {
                "animationsUsb": ["-1000"]
            },
            "settingLightEffect": {
                "animationsLightEffect": ["-1000"],
                "screenTopCorner": "110",
                "screenBottomCorner": "105"
            },
            "settingMonsterUI": {
                "animationsMonsterUI": ["-1000"]
            },
            "settingFade": {
                "animationsFade": ["-1000"]
            }
        },{
            "phone": "PD2044F_EX",
            "version": "3000",
            "switch": ["0", "1", "1", "0", "1"],
            "settingGesture": {
                "animationsGesture": ["-1000"]
            },
            "settingUsb": {
                "animationsUsb": ["-1000"]
            },
            "settingLightEffect": {
                "animationsLightEffect": ["-1000"],
                "screenTopCorner": "111",
                "screenBottomCorner": "111"
            },
            "settingMonsterUI": {
                "animationsMonsterUI": ["-1000"]
            },
            "settingFade": {
                "animationsFade": ["-1000"]
            }
        },{
            "phone": "PD2057",
            "version": "2000",
            "switch": ["0", "1", "1", "0", "1"],
            "settingGesture": {
                "animationsGesture": ["-1000"]
            },
            "settingUsb": {
                "animationsUsb": ["-1000"]
            },
            "settingLightEffect": {
                "animationsLightEffect": ["-1000"],
                "screenTopCorner": "110",
                "screenBottomCorner": "110"
            },
            "settingMonsterUI": {
                "animationsMonsterUI": ["-1000"]
            },
            "settingFade": {
                "animationsFade": ["-1000"]
            }
        },{
            "phone": "PD2061",
            "version": "2000",
            "switch": ["1", "1", "1", "1", "1"],
            "settingGesture": {
                "animationsGesture": ["-1000"]
            },
            "settingUsb": {
                "animationsUsb": ["-1000"]
            },
            "settingLightEffect": {
                "animationsLightEffect": ["-1000"],
                "screenTopCorner": "110",
                "screenBottomCorner": "105"
            },
            "settingMonsterUI": {
                "animationsMonsterUI": ["-1000"]
            },
            "settingFade": {
                "animationsFade": ["-1000"]
            }
        },{
            "phone": "PD2050F_EX",
            "version": "3000",
            "switch": ["0", "1", "1", "0", "1"],
            "settingGesture": {
                "animationsGesture": ["-1000"]
            },
            "settingUsb": {
                "animationsUsb": ["-1000"]
            },
            "settingLightEffect": {
                "animationsLightEffect": ["-1000"],
                "screenTopCorner": "110",
                "screenBottomCorner": "110"
            },
            "settingMonsterUI": {
                "animationsMonsterUI": ["-1000"]
            },
            "settingFade": {
                "animationsFade": ["-1000"]
            }
        },{
            "phone": "PD2049",
            "version": "3000",
            "switch": ["1", "1", "1", "0", "1"],
            "settingGesture": {
                "animationsGesture": ["-1000"]
            },
            "settingUsb": {
                "animationsUsb": ["-1000"]
            },
            "settingLightEffect": {
                "animationsLightEffect": ["-1000"],
                "screenTopCorner": "110",
                "screenBottomCorner": "110"
            },
            "settingMonsterUI": {
                "animationsMonsterUI": ["-1000"]
            },
            "settingFade": {
                "animationsFade": ["-1000"]
            }
        },{
            "phone": "PD2036",
            "version": "2000",
            "switch": ["0", "1", "1", "0", "1"],
            "settingGesture": {
                "animationsGesture": ["-1000"]
            },
            "settingUsb": {
                "animationsUsb": ["-1000"]
            },
            "settingLightEffect": {
                "animationsLightEffect": ["-1000"],
                "screenTopCorner": "72",
                "screenBottomCorner": "72"
            },
            "settingMonsterUI": {
                "animationsMonsterUI": ["-1000"]
            },
            "settingFade": {
                "animationsFade": ["-1000"]
            }
        },{
            "phone": "PD2048",
            "version": "3000",
            "switch": ["1", "1", "1", "0", "1"],
            "settingGesture": {
                "animationsGesture": ["-1000"]
            },
            "settingUsb": {
                "animationsUsb": ["-1000"]
            },
            "settingLightEffect": {
                "animationsLightEffect": ["-1000"],
                "screenTopCorner": "110",
                "screenBottomCorner": "105"
            },
            "settingMonsterUI": {
                "animationsMonsterUI": ["-1000"]
            },
            "settingFade": {
                "animationsFade": ["-1000"]
            }
        },{
            "phone": "PD2056",
            "version": "3000",
            "switch": ["0", "1", "2", "0", "1"],
            "settingGesture": {
                "animationsGesture": ["-1000"]
            },
            "settingUsb": {
                "animationsUsb": ["-1000"]
            },
            "settingLightEffect": {
                "animationsLightEffect": ["-1000"],
                "screenTopCorner": "110",
                "screenBottomCorner": "105"
            },
            "settingMonsterUI": {
                "animationsMonsterUI": ["-1000"]
            },
            "settingFade": {
                "animationsFade": ["-1000"]
            }
        },{
            "phone": "TD2010",
            "version": "3000",
            "switch": ["0", "1", "0", "0", "1"],
            "settingGesture": {
                "animationsGesture": ["-1000"]
            },
            "settingUsb": {
                "animationsUsb": ["-1000"]
            },
            "settingLightEffect": {
                "animationsLightEffect": ["-1000"],
                "screenTopCorner": "110",
                "screenBottomCorner": "105"
            },
            "settingMonsterUI": {
                "animationsMonsterUI": ["-1000"]
            },
            "settingFade": {
                "animationsFade": ["-1000"]
            }
        },{
            "phone": "PD2067F_EX",
            "version": "3000",
            "switch": ["0", "1", "1", "0", "1"],
            "settingGesture": {
                "animationsGesture": ["-1000"]
            },
            "settingUsb": {
                "animationsUsb": ["-1000"]
            },
            "settingLightEffect": {
                "animationsLightEffect": ["-1000"],
                "screenTopCorner": "110",
                "screenBottomCorner": "105"
            },
            "settingMonsterUI": {
                "animationsMonsterUI": ["-1000"]
            },
            "settingFade": {
                "animationsFade": ["-1000"]
            }
        },{
            "phone": "PD2059F_EX",
            "version": "3000",
            "switch": ["0", "1", "0", "0", "1"],
            "settingGesture": {
                "animationsGesture": ["-1000"]
            },
            "settingUsb": {
                "animationsUsb": ["-1000"]
            },
            "settingLightEffect": {
                "animationsLightEffect": ["-1000"],
                "screenTopCorner": "110",
                "screenBottomCorner": "105"
            },
            "settingMonsterUI": {
                "animationsMonsterUI": ["-1000"]
            },
            "settingFade": {
                "animationsFade": ["-1000"]
            }
        },{
            "phone": "PD2080",
            "version": "3000",
            "switch": ["0", "1", "1", "0", "1"],
            "settingGesture": {
                "animationsGesture": ["-1000"]
            },
            "settingUsb": {
                "animationsUsb": ["-1000"]
            },
            "settingLightEffect": {
                "animationsLightEffect": ["-1000"],
                "screenTopCorner": "110",
                "screenBottomCorner": "105"
            },
            "settingMonsterUI": {
                "animationsMonsterUI": ["-1000"]
            },
            "settingFade": {
                "animationsFade": ["-1000"]
            }
        },{
            "phone": "PD2072",
            "version": "3000",
            "switch": ["0", "1", "1", "0", "1"],
            "settingGesture": {
                "animationsGesture": ["-1000"]
            },
            "settingUsb": {
                "animationsUsb": ["-1000"]
            },
            "settingLightEffect": {
                "animationsLightEffect": ["-1000"],
                "screenTopCorner": "110",
                "screenBottomCorner": "105"
            },
            "settingMonsterUI": {
                "animationsMonsterUI": ["-1000"]
            },
            "settingFade": {
                "animationsFade": ["-1000"]
            }
        },{
            "phone": "PD2069",
            "version": "3000",
            "switch": ["1", "1", "1", "0", "1"],
            "settingGesture": {
                "animationsGesture": ["-1000"]
            },
            "settingUsb": {
                "animationsUsb": ["-1000"]
            },
            "settingLightEffect": {
                "animationsLightEffect": ["-1000"],
                "screenTopCorner": "110",
                "screenBottomCorner": "105"
            },
            "settingMonsterUI": {
                "animationsMonsterUI": ["-1000"]
            },
            "settingFade": {
                "animationsFade": ["-1000"]
            }
        },{
            "phone": "PD2069F_EX",
            "version": "3000",
            "switch": ["0", "1", "1", "0", "1"],
            "settingGesture": {
                "animationsGesture": ["-1000"]
            },
            "settingUsb": {
                "animationsUsb": ["-1000"]
            },
            "settingLightEffect": {
                "animationsLightEffect": ["-1000"],
                "screenTopCorner": "110",
                "screenBottomCorner": "105"
            },
            "settingMonsterUI": {
                "animationsMonsterUI": ["-1000"]
            },
            "settingFade": {
                "animationsFade": ["-1000"]
            }
        },{
            "phone": "PD2055",
            "version": "3000",
            "switch": ["1", "1", "1", "0", "1"],
            "settingGesture": {
                "animationsGesture": ["-1000"]
            },
            "settingUsb": {
                "animationsUsb": ["-1000"]
            },
            "settingLightEffect": {
                "animationsLightEffect": ["-1000"],
                "screenTopCorner": "110",
                "screenBottomCorner": "105"
            },
            "settingMonsterUI": {
                "animationsMonsterUI": ["-1000"]
            },
            "settingFade": {
                "animationsFade": ["-1000"]
            }
        },{
            "phone": "PD2073",
            "version": "3000",
            "switch": ["1", "1", "1", "0", "1"],
            "settingGesture": {
                "animationsGesture": ["-1000"]
            },
            "settingUsb": {
                "animationsUsb": ["-1000"]
            },
            "settingLightEffect": {
                "animationsLightEffect": ["-1000"],
                "screenTopCorner": "110",
                "screenBottomCorner": "105"
            },
            "settingMonsterUI": {
                "animationsMonsterUI": ["-1000"]
            },
            "settingFade": {
                "animationsFade": ["-1000"]
            }
        },{
            "phone": "PD2046F_EX",
            "version": "3000",
            "switch": ["0", "1", "1", "0", "1"],
            "settingGesture": {
                "animationsGesture": ["-1000"]
            },
            "settingUsb": {
                "animationsUsb": ["-1000"]
            },
            "settingLightEffect": {
                "animationsLightEffect": ["-1000"],
                "screenTopCorner": "110",
                "screenBottomCorner": "105"
            },
            "settingMonsterUI": {
                "animationsMonsterUI": ["-1000"]
            },
            "settingFade": {
                "animationsFade": ["-1000"]
            }
        },{
            "phone": "PD2084",
            "version": "3000",
            "switch": ["0", "1", "0", "0", "1"],
            "settingGesture": {
                "animationsGesture": ["-1000"]
            },
            "settingUsb": {
                "animationsUsb": ["-1000"]
            },
            "settingLightEffect": {
                "animationsLightEffect": ["-1000"],
                "screenTopCorner": "110",
                "screenBottomCorner": "105"
            },
            "settingMonsterUI": {
                "animationsMonsterUI": ["-1000"]
            },
            "settingFade": {
                "animationsFade": ["-1000"]
            }
        }
    ]
}