<?xml version="1.0" encoding="UTF-8"?>
<svg width="480px" height="240px" viewBox="0 0 480 240" version="1.1" xmlns="http://www.w3.org/2000/svg" xmlns:xlink="http://www.w3.org/1999/xlink">
    <title>com.vivo.childrenmode_b_s5_2x1_sc</title>
    <g id="com.vivo.childrenmode" stroke="none" stroke-width="1" fill="none" fill-rule="evenodd">
        <g id="编组-7" transform="translate(221.423077, 57.807692)" fill="#FFFFFF">
            <circle id="椭圆形" cx="19" cy="19" r="19"></circle>
        </g>
    </g>
</svg>