<?xml version="1.0" encoding="UTF-8"?>
<svg width="240px" height="240px" viewBox="0 0 240 240" version="1.1" xmlns="http://www.w3.org/2000/svg" xmlns:xlink="http://www.w3.org/1999/xlink">
    <title>com.android.contacts_b_s5_1x1_mc</title>
    <g id="com.android.contacts" stroke="none" stroke-width="1" fill="none" fill-rule="evenodd">
        <g id="linkman" transform="translate(65.423077, 62.000000)" fill="#FFFFFF">
            <path d="M54.5769231,0 C68.9363266,-2.63777963e-15 80.5769231,11.6405965 80.5769231,26 L80.5769231,34 C80.5769231,48.3594035 68.9363266,60 54.5769231,60 C40.2175196,60 28.5769231,48.3594035 28.5769231,34 L28.5769231,26 C28.5769231,11.6405965 40.2175196,2.63777963e-15 54.5769231,0 Z" id="矩形"></path>
        </g>
    </g>
</svg>