<?xml version="1.0" encoding="UTF-8"?>
<svg width="480px" height="240px" viewBox="0 0 480 240" version="1.1" xmlns="http://www.w3.org/2000/svg" xmlns:xlink="http://www.w3.org/1999/xlink">
    <title>com.android.notes_b_s5_2x1_1_mc</title>
    <g id="com.android.notes" stroke="none" stroke-width="1" fill="none" fill-rule="evenodd">
        <path d="M298.775186,57 C300.666783,57 301.503429,57.1790954 302.212495,57.518135 L302.511272,57.6731744 C303.301603,58.1124283 303.92186,58.7570155 304.344533,59.5783488 C304.74079,60.3483488 304.96339,61.1125023 304.989667,63.0561775 L304.992298,159.385573 C304.992298,159.754674 304.989965,160.104182 304.985296,160.435776 L304.964269,161.3785 L304.92919,162.223829 L304.880028,162.981847 L304.816755,163.662638 C304.793308,163.877817 304.767505,164.081806 304.739341,164.276285 L304.647757,164.832872 L304.541974,165.342482 C304.523159,165.424063 304.503751,165.504106 304.483749,165.582823 L304.356613,166.040876 C304.334236,166.115124 304.311263,166.188465 304.287695,166.26111 L304.139141,166.690294 L303.976271,167.112837 C303.29612,168.803172 302.271695,170.214557 300.894599,171.358562 L300.548393,171.63739 L300.19211,171.903738 C300.131372,171.947245 300.069826,171.990349 300.007277,172.033107 L299.618399,172.285983 C298.945041,172.702098 298.132591,173.095372 296.986846,173.524124 L296.257851,173.786099 L295.439542,174.059389 L294.5226,174.346792 L260.809029,184.358926 C260.445267,184.466955 260.065383,184.441838 259.730084,184.303651 L260,108.64 L259.726522,108.266 L259.727887,63.4609907 C259.727887,61.6356061 259.876482,60.7555295 260.158918,60.0491302 L260.298722,59.7326221 C260.323589,59.6809895 260.349235,59.6296822 260.375652,59.5783488 C260.798325,58.7570155 261.418582,58.1124283 262.208913,57.6731744 L262.50769,57.518135 C263.166108,57.2033125 263.934532,57.0264011 265.555466,57.0027343 L298.775186,57 Z M220.929821,55.32 L220.929821,132.935286 L220.927332,174.842733 L220.907518,175.669021 C220.848238,177.210325 220.671552,178.11085 220.3867,178.853834 L220.235303,179.214435 C220.181861,179.33175 220.125457,179.446927 220.066135,179.562202 C219.50257,180.657313 218.675561,181.516762 217.621787,182.102434 C217.510863,182.164084 217.400034,182.2227 217.287147,182.278238 L216.940158,182.435574 C216.225219,182.7316 215.358685,182.915217 213.87556,182.976823 L213.080461,182.997414 L212.640338,183 L183.954892,183 L183.51477,182.997414 L182.719671,182.976823 C181.236546,182.915217 180.370012,182.7316 179.655073,182.435574 L179.308084,182.278238 C179.195197,182.2227 179.084368,182.164084 178.973444,182.102434 C177.919669,181.516762 177.092661,180.657313 176.529096,179.562202 L176.359928,179.214435 L176.208531,178.853834 C175.923679,178.11085 175.746993,177.210325 175.687712,175.669021 L175.667522,174.842733 L175.667522,73.6145723 L175.684426,72.8298574 C175.735143,71.377875 175.887346,70.5975549 176.141447,69.8945034 L176.276991,69.5466649 C176.685104,68.5637728 177.297858,67.7481855 178.116429,67.0983412 L178.261295,66.985831 L178.55928,66.7723139 L178.881112,66.5707876 C178.994076,66.5051644 179.113582,66.4408704 179.2422,66.3772361 L179.657956,66.1876435 C179.956773,66.0616755 180.30231,65.9356694 180.715112,65.8042704 L181.387333,65.6024579 L181.766097,65.4972631 L220.929821,55.32 Z" id="形状结合" fill="#FFD062"></path>
    </g>
</svg>