<?xml version="1.0" encoding="UTF-8"?>
<svg width="480px" height="240px" viewBox="0 0 480 240" version="1.1" xmlns="http://www.w3.org/2000/svg" xmlns:xlink="http://www.w3.org/1999/xlink">
    <title>com.android.settings_b_s5_2x1_mc</title>
    <g id="com.android.settings" stroke="none" stroke-width="1" fill="none" fill-rule="evenodd">
        <path d="M324.451598,32.9945811 C325.892199,34.1296895 327.193593,35.4310839 328.328702,36.8716845 L337.774807,48.8600241 C355.906669,71.8717207 380.053999,89.4157835 407.542477,99.5492031 L421.863072,104.828383 C433.924979,109.274913 440.098461,122.657646 435.65193,134.719552 C435.017548,136.440413 434.182001,138.080265 433.162676,139.604988 L424.680095,152.293368 C411.197975,172.460138 402.55556,195.390942 399.332757,219.301002 C398.899858,219.304282 398.460392,219.306262 398.014917,219.307251 L220.759169,219.307005 C217.537004,195.39478 208.89427,172.461826 195.411022,152.293368 L186.928441,139.604988 C179.783759,128.917858 182.65548,114.462318 193.342609,107.317636 C194.867332,106.298311 196.507184,105.462765 198.228045,104.828383 L212.54864,99.5492031 C240.037118,89.4157835 264.184448,71.8717207 282.31631,48.8600241 L291.762415,36.8716845 C299.718651,26.7741833 314.354097,25.038345 324.451598,32.9945811 Z M310.168556,118.190379 C284.605208,118.190379 263.88202,138.913567 263.88202,164.476915 C263.88202,190.040263 284.605208,210.763451 310.168556,210.763451 C335.731904,210.763451 356.455092,190.040263 356.455092,164.476915 C356.455092,138.913567 335.731904,118.190379 310.168556,118.190379 Z M310.168556,142.190379 C322.47707,142.190379 332.455092,152.168401 332.455092,164.476915 C332.455092,176.785429 322.47707,186.763451 310.168556,186.763451 C297.860042,186.763451 287.88202,176.785429 287.88202,164.476915 C287.88202,152.168401 297.860042,142.190379 310.168556,142.190379 Z" id="形状结合" fill-opacity="0.7" fill="#FFFFFF"></path>
        <path d="M251.989843,52.4665553 L252.361136,52.5681284 L267.049765,56.7146174 C294.920606,64.5823451 324.406491,64.6727788 352.314459,56.9859184 L353.287347,56.7146174 L367.975976,52.5681284 C369.741062,52.069858 371.558853,51.7819483 373.391523,51.7103901 C386.108675,51.2138378 396.840553,61.0165584 397.540589,73.6767433 L397.558724,74.0612523 L398.154214,89.3123042 C399.284419,118.257872 408.314473,146.335669 424.256924,170.506627 L424.803093,171.329119 L433.285674,184.0175 C434.304999,185.542222 435.140545,187.182074 435.774928,188.902935 C439.399764,198.735867 435.966965,209.446567 428.039882,215.478261 C421.600108,217.789559 413.238293,219 397.466755,219 L198.909998,218.999711 L198.351043,218.794105 C196.821389,218.230209 195.355741,217.507369 193.978065,216.637795 L193.465607,216.304851 C182.885349,209.231616 179.964972,194.993009 186.840101,184.339233 L187.051439,184.0175 L195.53402,171.329119 C211.633443,147.247345 220.83169,119.224197 222.14131,90.2987443 L222.182898,89.3123042 L222.778389,74.0612523 C222.849947,72.228582 223.137857,70.4107914 223.636127,68.6457056 C227.093694,56.397532 239.732968,49.2201175 251.989843,52.4665553 Z M310.168556,118.190379 C284.605208,118.190379 263.88202,138.913567 263.88202,164.476915 C263.88202,190.040263 284.605208,210.763451 310.168556,210.763451 C335.731904,210.763451 356.455092,190.040263 356.455092,164.476915 C356.455092,138.913567 335.731904,118.190379 310.168556,118.190379 Z M310.168556,142.190379 C322.47707,142.190379 332.455092,152.168401 332.455092,164.476915 C332.455092,176.785429 322.47707,186.763451 310.168556,186.763451 C297.860042,186.763451 287.88202,176.785429 287.88202,164.476915 C287.88202,152.168401 297.860042,142.190379 310.168556,142.190379 Z" id="形状结合" fill="#FFFFFF" opacity="0.699999988"></path>
        <path d="M346.41631,58.4894405 C361.082244,74.2391901 378.809321,86.8508602 398.520908,95.5435144 L398.573384,96.2017672 C400.479566,119.251525 407.399702,141.590013 418.826954,161.657348 C408.746914,179.358539 402.17382,198.827509 399.455743,218.993099 C398.806563,218.997771 398.14348,219 397.466755,219 L220.881251,218.999704 C218.164821,198.832035 211.59134,179.360519 201.509898,161.656689 C213.046249,141.398882 219.988959,118.825794 221.81683,95.542965 C241.527192,86.8512873 259.25462,74.2394568 273.921725,58.4900533 C297.76212,64.0822226 322.575982,64.0821473 346.41631,58.4894405 Z M310.168556,118.190379 C284.605208,118.190379 263.88202,138.913567 263.88202,164.476915 C263.88202,190.040263 284.605208,210.763451 310.168556,210.763451 C335.731904,210.763451 356.455092,190.040263 356.455092,164.476915 C356.455092,138.913567 335.731904,118.190379 310.168556,118.190379 Z M310.168556,142.190379 C322.47707,142.190379 332.455092,152.168401 332.455092,164.476915 C332.455092,176.785429 322.47707,186.763451 310.168556,186.763451 C297.860042,186.763451 287.88202,176.785429 287.88202,164.476915 C287.88202,152.168401 297.860042,142.190379 310.168556,142.190379 Z" id="形状结合" fill="#FFFFFF"></path>
    </g>
</svg>