<?xml version="1.0" encoding="UTF-8"?>
<svg width="480px" height="240px" viewBox="0 0 480 240" version="1.1" xmlns="http://www.w3.org/2000/svg" xmlns:xlink="http://www.w3.org/1999/xlink">
    <title>com.android.dialer_b_s5_2x1_0_mc</title>
    <g id="com.android.dialer" stroke="none" stroke-width="1" fill="none" fill-rule="evenodd">
        <g id="编组-40备份-4" transform="translate(182.000000, 51.000000)" fill="#FFFFFF" fill-rule="nonzero">
            <path d="M86.9536697,105.63715 C86.9536697,105.63715 86.9536697,105.63715 86.9536697,105.63715 C87.2674037,110.355914 87.7031116,115.851333 88.2607932,124.239228 C88.2920142,124.708814 88.3286779,125.260259 88.3707841,125.893564 C88.5650926,128.816189 86.3533601,131.342969 83.4307346,131.537284 C83.1383553,131.556723 82.8448678,131.551898 82.5532855,131.522858 C82.2524369,131.492895 81.9690958,131.461631 81.7032623,131.429066 C50.9175683,127.657834 27.0736967,101.358638 27.0736967,69.4763099 C27.0736967,38.0783518 50.1985793,12.0951711 80.3050004,7.71097554 C80.449017,7.69000337 80.6737654,7.66478751 80.9792456,7.63532796 L80.9792487,7.63536073 C84.6303062,7.28326417 87.8755037,9.95760038 88.2276003,13.6086578 C88.2626293,13.9718909 88.267662,14.3373932 88.2426472,14.701453 C88.2426472,14.701453 88.2426472,14.701453 88.2426472,14.701453 C88.0731319,17.1685425 87.6355502,23.397619 86.9299021,33.3886826 L86.9299323,33.3886848 C86.7137201,36.4499685 84.486085,38.99303 81.4799161,39.6104069 C81.4799161,39.6104069 81.4799161,39.6104069 81.4799161,39.6104069 L80.6269564,39.7951981 C68.3972307,42.5834145 53.9823125,52.4469561 53.9823125,69.4763099 C53.9823125,86.473622 68.3509713,96.3360397 80.5579229,99.1416192 C80.6811013,99.1699299 80.8903183,99.2089417 81.185574,99.2586545 C84.3536254,99.7920783 86.7405428,102.431582 86.9536697,105.63715 Z" id="路径备份-4" transform="translate(57.921523, 69.475194) rotate(-30.000000) translate(-57.921523, -69.475194) "></path>
        </g>
    </g>
</svg>