<?xml version="1.0" encoding="UTF-8"?>
<svg width="240px" height="240px" viewBox="0 0 240 240" version="1.1" xmlns="http://www.w3.org/2000/svg" xmlns:xlink="http://www.w3.org/1999/xlink">
    <title>com.android.filemanager_b_s6_1x1_sc</title>
    <g id="com.android.filemanager" stroke="none" stroke-width="1" fill="none" fill-rule="evenodd">
        <g id="编组" transform="translate(64.242424, 48.311515)" fill="#F0EDE6" fill-rule="nonzero">
            <path d="M109.090909,19.5672727 C110.429781,19.5672727 111.515152,20.652643 111.515152,21.9915152 C111.515152,23.3303873 110.429781,24.4157576 109.090909,24.4157576 L2.42424242,24.4157576 C1.0853703,24.4157576 -2.0564815e-15,23.3303873 0,21.9915152 C-1.63964546e-16,20.652643 1.0853703,19.5672727 2.42424242,19.5672727 L109.090909,19.5672727 Z M21.7961586,2.92363636 C22.6979767,2.92363636 23.4543404,3.11272727 24.0652495,3.49090909 C24.6761586,3.86909091 25.1294919,4.38060606 25.4252495,5.02545455 C25.6840373,5.58969697 25.8296055,6.20776515 25.861954,6.87965909 L25.8688858,7.17090909 L25.8688858,8.07272727 L19.8761586,8.07272727 L19.8785828,8.23555556 C19.8947444,8.50356902 19.9715121,8.75474747 20.1088858,8.98909091 C20.2737343,9.27030303 20.5113101,9.49333333 20.8216131,9.65818182 C21.1319161,9.8230303 21.4955525,9.90545455 21.9125222,9.90545455 C22.3876737,9.90545455 22.7779767,9.82787879 23.0834313,9.67272727 C23.3379767,9.54343434 23.5335996,9.36700337 23.6703,9.14343434 L23.7452495,9.00363636 L25.7670676,9.00363636 L25.6808768,9.25860255 C25.3795495,10.0856499 24.9379767,10.6842975 24.3561586,11.0545455 C23.7161586,11.4618182 22.9016131,11.6654545 21.9125222,11.6654545 C21.001007,11.6654545 20.2252495,11.4739394 19.5852495,11.0909091 C18.9452495,10.7078788 18.4652495,10.1842424 18.1452495,9.52 C17.8252495,8.85575758 17.6652495,8.10181818 17.6652495,7.25818182 C17.6652495,6.44363636 17.820401,5.70909091 18.130704,5.05454545 C18.441007,4.4 18.9064616,3.88121212 19.5270676,3.49818182 C20.1476737,3.11515152 20.9040373,2.92363636 21.7961586,2.92363636 Z M8.31302113,0.189090909 L8.31302113,2.16727273 L2.32029386,2.16727273 L2.32029386,5.04727273 L7.64393022,5.04727273 L7.64393022,7.01090909 L2.32029386,7.01090909 L2.32029386,11.4181818 L0.0948393111,11.4181818 L0.0948393111,0.189090909 L8.31302113,0.189090909 Z M12.1673482,3.25818182 L12.1673482,11.4181818 L9.98553001,11.4181818 L9.98553001,3.25818182 L12.1673482,3.25818182 Z M16.152698,0.189090909 L16.152698,11.4181818 L13.9708798,11.4181818 L13.9708798,0.189090909 L16.152698,0.189090909 Z M32.3911846,8.65818182 L32.3911846,11.0824242 L29.9669421,11.0824242 L29.9669421,8.65818182 L32.3911846,8.65818182 Z M21.7961586,4.68363636 C21.3694919,4.68363636 21.0131283,4.77333333 20.7270676,4.95272727 C20.441007,5.13212121 20.2276737,5.35515152 20.0870676,5.62181818 C19.9745828,5.83515152 19.9070919,6.05003636 19.8845949,6.26647273 L19.8761586,6.42909091 L23.6725222,6.42909091 C23.6725222,6.15757576 23.6046434,5.88848485 23.4688858,5.62181818 C23.3331283,5.35515152 23.1222192,5.13212121 22.8361586,4.95272727 C22.550098,4.77333333 22.2034313,4.68363636 21.7961586,4.68363636 Z M11.0764391,0 C11.415833,0 11.6994694,0.109090909 11.9273482,0.327272727 C12.155227,0.545454545 12.2691664,0.829090909 12.2691664,1.17818182 C12.2691664,1.50787879 12.1528027,1.78666667 11.9200755,2.01454545 C11.6873482,2.24242424 11.4061361,2.35636364 11.0764391,2.35636364 C10.7273482,2.35636364 10.4388633,2.24242424 10.2109846,2.01454545 C9.98310576,1.78666667 9.86916637,1.50787879 9.86916637,1.17818182 C9.86916637,0.819393939 9.98068152,0.533333333 10.2037118,0.32 C10.4267421,0.106666667 10.7176512,0 11.0764391,0 Z" id="形状结合"></path>
        </g>
    </g>
</svg>