<?xml version="1.0" encoding="UTF-8"?>
<svg width="240px" height="480px" viewBox="0 0 240 480" version="1.1" xmlns="http://www.w3.org/2000/svg" xmlns:xlink="http://www.w3.org/1999/xlink">
    <title>com.android.bbk.lockscreen3_b_s5_1x2_sc</title>
    <g id="com.android.bbk.lockscreen3" stroke="none" stroke-width="1" fill="none" fill-rule="evenodd">
        <g id="编组-20" transform="translate(105.000000, 215.000000)" fill="#FFFFFF">
            <path d="M15,0 C23.2842712,0 30,6.71572875 30,15 C30,21.1506138 26.2981276,26.436609 21.000887,28.7514814 L21,43 C21,46.3137085 18.3137085,49 15,49 C11.6862915,49 9,46.3137085 9,43 L9.00011284,28.7519182 C3.70233822,26.4372741 0,21.1510008 0,15 C0,6.71572875 6.71572875,0 15,0 Z" id="形状结合"></path>
        </g>
    </g>
</svg>