<?xml version="1.0" encoding="UTF-8"?>
<svg width="480px" height="480px" viewBox="0 0 480 480" version="1.1" xmlns="http://www.w3.org/2000/svg" xmlns:xlink="http://www.w3.org/1999/xlink">
    <title>com.android.mms_b_s5_2x2_0_mc</title>
    <defs>
        <path d="M72,0 L72,58.5 C72,70.9264069 82.0735931,81 94.5,81 L153,81 L153,97.1562915 C153,107.185877 151.955712,110.822847 149.994757,114.489514 C148.033802,118.156181 145.156181,121.033802 141.489514,122.994757 C137.822847,124.955712 134.185877,126 124.156292,126 L37.6447306,125.999973 C31.1227069,127.146858 25.1506012,129.889798 20.1460732,133.811132 L8.06789161,143.607173 C7.18610635,144.322275 6.08530467,144.712533 4.95,144.712533 C2.28813284,144.712533 0.117000067,142.61145 0.00457331871,139.977254 L0,139.762533 L7.76880231e-16,28.8437085 C-4.51389787e-16,18.8141227 1.04428813,15.1771525 3.00524292,11.5104858 C4.96619771,7.84381917 7.84381917,4.96619771 11.5104858,3.00524292 C15.112825,1.07869084 18.6865005,0.0369238267 28.3217036,0.000963565839 L72,0 Z" id="path-1"></path>
    </defs>
    <g id="com.android.mms" stroke="none" stroke-width="1" fill="none" fill-rule="evenodd">
        <g id="矩形备份" transform="translate(127.000000, 190.000000)">
            <mask id="mask-2" fill="white">
                <use xlink:href="#path-1"></use>
            </mask>
            <use id="形状结合" fill="#4194FD" xlink:href="#path-1"></use>
        </g>
        <path d="M221.5,190 L280,190 L280,190 L280,248.5 C280,260.926407 269.926407,271 257.5,271 L199,271 L199,271 L199,212.5 C199,200.073593 209.073593,190 221.5,190 Z" id="矩形备份-19" fill="#053777" opacity="0.5" transform="translate(239.500000, 230.500000) scale(1, -1) translate(-239.500000, -230.500000) "></path>
    </g>
</svg>