<?xml version="1.0" encoding="UTF-8"?>
<svg width="240px" height="240px" viewBox="0 0 240 240" version="1.1" xmlns="http://www.w3.org/2000/svg" xmlns:xlink="http://www.w3.org/1999/xlink">
    <title>com.android.VideoPlayer_b_s6_1x1_bg</title>
    <g id="com.android.VideoPlayer" stroke="none" stroke-width="1" fill="none" fill-rule="evenodd">
        <g id="编组-24" transform="translate(45.000000, 23.250000)" fill="#FF6565">
            <path d="M99.3788451,35.7800519 L168.784893,158.451205 C173.121711,166.11628 170.423626,175.845737 162.758552,180.182555 C160.363306,181.53776 157.658098,182.25 154.906047,182.25 L16.0939526,182.25 C7.28705977,182.25 0.147662489,175.110603 0.147662489,166.30371 C0.147662489,163.551659 0.859902671,160.846451 2.21510749,158.451205 L71.6211549,35.7800519 C75.9579733,28.1149774 85.68743,25.4168927 93.3525045,29.7537112 C95.8708225,31.1785491 97.9540073,33.2617338 99.3788451,35.7800519 Z" id="三角形" transform="translate(85.500000, 96.750000) rotate(-270.000000) translate(-85.500000, -96.750000) "></path>
        </g>
    </g>
</svg>