<?xml version="1.0" encoding="UTF-8"?>
<svg width="480px" height="480px" viewBox="0 0 480 480" version="1.1" xmlns="http://www.w3.org/2000/svg" xmlns:xlink="http://www.w3.org/1999/xlink">
    <title>com.android.mms_b_s5_2x2_0_sc</title>
    <defs>
        <path d="M124.156292,126 L37.6447306,125.999973 C31.1227069,127.146858 25.1506012,129.889798 20.1460732,133.811132 L8.06789161,143.607173 C7.18610635,144.322275 6.08530467,144.712533 4.95,144.712533 C2.28813284,144.712533 0.117000067,142.61145 0.00457331871,139.977254 L0,139.762533 L7.76880231e-16,28.8437085 C-4.51389787e-16,18.8141227 1.04428813,15.1771525 3.00524292,11.5104858 C4.96619771,7.84381917 7.84381917,4.96619771 11.5104858,3.00524292 C15.112825,1.07869084 18.6865005,0.0369238267 28.3217036,0.000963565837 L124.156292,1.16532035e-15 C134.185877,-6.7708468e-16 137.822847,1.04428813 141.489514,3.00524292 C145.156181,4.96619771 148.033802,7.84381917 149.994757,11.5104858 C151.955712,15.1771525 153,18.8141227 153,28.8437085 L153,45 L94.5,45 C82.0735931,45 72,55.0735931 72,67.5 L72,67.5 L72,126 L124.678296,125.999036 C124.506239,125.999679 124.332249,126 124.156292,126 Z" id="path-1"></path>
    </defs>
    <g id="com.android.mms" stroke="none" stroke-width="1" fill="none" fill-rule="evenodd">
        <g id="矩形备份-2" transform="translate(275.500000, 217.356267) scale(-1, 1) translate(-275.500000, -217.356267) translate(199.000000, 145.000000)">
            <mask id="mask-2" fill="white">
                <use xlink:href="#path-1"></use>
            </mask>
            <use id="形状结合" fill="#4BDCE2" xlink:href="#path-1"></use>
        </g>
    </g>
</svg>