<?xml version="1.0" encoding="UTF-8"?>
<svg width="240px" height="240px" viewBox="0 0 240 240" version="1.1" xmlns="http://www.w3.org/2000/svg" xmlns:xlink="http://www.w3.org/1999/xlink">
    <title>com.vivo.moodcube_b_s6_1x1_mc</title>
    <defs>
        <filter color-interpolation-filters="auto" id="filter-1">
            <feColorMatrix in="SourceGraphic" type="matrix" values="0 0 0 0 1.000000 0 0 0 0 1.000000 0 0 0 0 1.000000 0 0 0 1.000000 0"></feColorMatrix>
        </filter>
    </defs>
    <g id="com.vivo.moodcube" stroke="none" stroke-width="1" fill="none" fill-rule="evenodd">
        <g filter="url(#filter-1)" id="编组-10">
            <g transform="translate(75.149167, 19.000000)">
                <polygon id="路径-17" fill-opacity="0.7" fill="#FFFFFF" points="88.9153855 75.9216985 88.9153855 153.909925 132.727829 128.932432 132.727829 50.75"></polygon>
                <polygon id="路径-10" fill-opacity="0.8" fill="#FFFFFF" points="88.882784 76.6967833 132.850833 50.75 44.789331 0 -0.000879181468 25.7867397"></polygon>
                <polygon id="路径" fill-opacity="0.700313115" fill="#FFFFFF" fill-rule="nonzero" opacity="0.699999988" points="15.9803127 35.525 88.8501826 76.6967833 117.659201 59.7325889 44.7751103 19.4946155"></polygon>
            </g>
        </g>
    </g>
</svg>