<?xml version="1.0" encoding="UTF-8"?>
<svg width="240px" height="240px" viewBox="0 0 240 240" version="1.1" xmlns="http://www.w3.org/2000/svg" xmlns:xlink="http://www.w3.org/1999/xlink">
    <title>com.android.calendar_b_s6_1x1_1_bg</title>
    <defs>
        <path d="M91.5332448,30 L148.466755,30 C169.863205,30 177.622075,32.2278147 185.444297,36.4111849 C193.266519,40.5945551 199.405445,46.7334809 203.588815,54.5557031 C207.772185,62.3779253 210,70.136795 210,91.5332448 L210,148.466755 C210,169.863205 207.772185,177.622075 203.588815,185.444297 C199.405445,193.266519 193.266519,199.405445 185.444297,203.588815 C177.622075,207.772185 169.863205,210 148.466755,210 L91.5332448,210 C70.136795,210 62.3779253,207.772185 54.5557031,203.588815 C46.7334809,199.405445 40.5945551,193.266519 36.4111849,185.444297 C32.2278147,177.622075 30,169.863205 30,148.466755 L30,91.5332448 C30,70.136795 32.2278147,62.3779253 36.4111849,54.5557031 C40.5945551,46.7334809 46.7334809,40.5945551 54.5557031,36.4111849 C62.3779253,32.2278147 70.136795,30 91.5332448,30 Z" id="path-1"></path>
    </defs>
    <g id="com.android.calendar" stroke="none" stroke-width="1" fill="none" fill-rule="evenodd">
        <mask id="mask-2" fill="white">
            <use xlink:href="#path-1"></use>
        </mask>
        <use id="mask" fill="#FFFFFF" xlink:href="#path-1"></use>
    </g>
</svg>