<?xml version="1.0" encoding="UTF-8"?>
<svg width="240px" height="240px" viewBox="0 0 240 240" version="1.1" xmlns="http://www.w3.org/2000/svg" xmlns:xlink="http://www.w3.org/1999/xlink">
    <title>com.android.mms_b_s5_1x1_mc</title>
    <g id="com.android.mms" stroke="none" stroke-width="1" fill="none" fill-rule="evenodd">
        <path d="M96.375,87.375 L96.375,123.375 C96.375,130.830844 102.419156,136.875 109.875,136.875 L143.624,136.875 L143.625,151.068775 C143.625,157.086526 142.998427,159.268708 141.821854,161.468708 C140.645281,163.668708 138.918708,165.395281 136.718708,166.571854 C134.518708,167.748427 132.336526,168.375 126.318775,168.375 L64.311,168.375 L64.3114698,168.377099 L64.229,168.375 L63.968,168.375 L63.7240135,168.38013 C61.6228571,168.458397 59.7058578,169.25696 58.2127291,170.536107 L48.4659903,180.28401 C48.0440334,180.705967 47.4717371,180.943019 46.875,180.943019 C45.684136,180.943019 44.7093551,180.017858 44.6301908,178.847068 L44.625,178.693019 L44.625,104.681225 C44.625,98.6634736 45.2515729,96.4812915 46.4281458,94.2812915 C47.6047186,92.0812915 49.3312915,90.3547186 51.5312915,89.1781458 C53.7312915,88.0015729 55.9134736,87.375 61.9312251,87.375 L96.375,87.375 Z" id="形状结合" fill="#4194FD"></path>
        <g id="编组-19备份-3" opacity="0.5" transform="translate(96.375000, 87.375000)" fill="#053777">
            <path d="M13.5,0 L47.25,0 L47.25,0 L47.25,36 C47.25,43.4558441 41.2058441,49.5 33.75,49.5 L0,49.5 L0,49.5 L0,13.5 C-9.13077564e-16,6.04415588 6.04415588,1.36961635e-15 13.5,0 Z" id="矩形备份-19" transform="translate(23.625000, 24.750000) scale(1, -1) translate(-23.625000, -24.750000) "></path>
        </g>
    </g>
</svg>