<?xml version="1.0" encoding="UTF-8"?>
<svg width="240px" height="480px" viewBox="0 0 240 480" version="1.1" xmlns="http://www.w3.org/2000/svg" xmlns:xlink="http://www.w3.org/1999/xlink">
    <title>com.bbk.iqoo.feedback_b_s5_1x2_mc</title>
    <g id="com.bbk.iqoo.feedback" stroke="none" stroke-width="1" fill="none" fill-rule="evenodd">
        <g id="编组" transform="translate(57.000000, 184.000000)" fill="#FFFFFF" fill-rule="nonzero">
            <g id="编组-6">
                <path d="M63,0 C87.9454232,0 109.042825,16.4931678 116.004568,39.1807319 C121.633227,39.8455897 126,44.6339739 126,50.4422727 L126,60.5577273 C126,66.7227784 121.080329,71.7387787 114.95269,71.8940235 L114.66,71.8977273 L106.183636,71.8977273 C104.602094,71.8977273 103.32,70.6156336 103.32,69.0340909 L103.32,55.5 C103.32,33.2077792 85.2681211,15.1363636 63,15.1363636 C40.7318789,15.1363636 22.68,33.2077792 22.68,55.5 C22.68,77.5692986 40.3726465,95.501786 62.3332351,95.8582288 L63,95.8636364 L69.2918182,95.8636364 C73.3896529,95.8636364 76.7268177,99.1204515 76.8561114,103.18688 L76.86,103.431818 L76.86,108.136364 C76.86,109.661423 75.6678491,110.90804 74.164624,110.995139 L73.9963636,111 L63,111 C38.0545768,111 16.9571749,94.5068322 9.99543166,71.8192681 C4.36677311,71.1544103 -1.35939223e-13,66.3660261 -1.3500312e-13,60.5577273 L-1.3500312e-13,50.4422727 C-1.35714431e-13,44.6339739 4.36677311,39.8455897 9.99640156,39.1810377 C16.9571749,16.4931678 38.0545768,0 63,0 Z" id="形状结合"></path>
            </g>
        </g>
    </g>
</svg>