<?xml version="1.0" encoding="UTF-8"?>
<svg width="480px" height="240px" viewBox="0 0 480 240" version="1.1" xmlns="http://www.w3.org/2000/svg" xmlns:xlink="http://www.w3.org/1999/xlink">
    <title>com.iqoo.secure_b_s5_2x1_sc</title>
    <g id="com.iqoo.secure" stroke="none" stroke-width="1" fill="none" fill-rule="evenodd">
        <g id="编组-41" transform="translate(180.346154, 75.103139)" fill="#FFFFFF">
            <path d="M0.03,0 L59.6538462,36.316861 L59.6538462,112.166092 L35.4351268,98.4650556 C13.5376776,86.0772105 1.72918991e-14,62.8648191 0,37.7061826 L0,0.0176542352 L0.03,0 Z" id="形状结合" opacity="0.449999988"></path>
            <path d="M119.276846,0.000320000003 L119.307692,0.0176542352 L119.307692,37.7061826 C119.307692,62.8648191 105.770015,86.0772105 83.8725655,98.4650556 L59.6538462,112.166092 L59.6538462,36.316861 L119.276846,0.000320000003 Z" id="形状结合" opacity="0.800000012"></path>
        </g>
    </g>
</svg>