<?xml version="1.0" encoding="UTF-8"?>
<svg width="480px" height="480px" viewBox="0 0 480 480" version="1.1" xmlns="http://www.w3.org/2000/svg" xmlns:xlink="http://www.w3.org/1999/xlink">
    <title>com.android.bbksoundrecorder_b_s5_2x2_mc</title>
    <g id="com.android.bbksoundrecorder" stroke="none" stroke-width="1" fill="none" fill-rule="evenodd">
        <path d="M277,160 C284.731986,160 291,166.268014 291,174 L291,306 C291,313.731986 284.731986,320 277,320 C269.268014,320 263,313.731986 263,306 L263,174 C263,166.268014 269.268014,160 277,160 Z M219,195 C226.731986,195 233,201.268014 233,209 L233,271 C233,278.731986 226.731986,285 219,285 C211.268014,285 205,278.731986 205,271 L205,209 C205,201.268014 211.268014,195 219,195 Z M335,195 C342.731986,195 349,201.268014 349,209 L349,271 C349,278.731986 342.731986,285 335,285 C327.268014,285 321,278.731986 321,271 L321,209 C321,201.268014 327.268014,195 335,195 Z" id="形状结合" fill="#FFFFFF"></path>
    </g>
</svg>