<?xml version="1.0" encoding="UTF-8"?>
<svg width="480px" height="480px" viewBox="0 0 480 480" version="1.1" xmlns="http://www.w3.org/2000/svg" xmlns:xlink="http://www.w3.org/1999/xlink">
    <title>com.vivo.weather.cloudy_b_s5_2x2_bg</title>
    <defs>
        <path d="M61.5332448,-2.48601674e-15 L376.466755,2.48601674e-15 C397.863205,-1.44444732e-15 405.622075,2.22781467 413.444297,6.41118489 C421.266519,10.5945551 427.405445,16.7334809 431.588815,24.5557031 C435.772185,32.3779253 438,40.136795 438,61.5332448 L438,376.466755 C438,397.863205 435.772185,405.622075 431.588815,413.444297 C427.405445,421.266519 421.266519,427.405445 413.444297,431.588815 C405.622075,435.772185 397.863205,438 376.466755,438 L61.5332448,438 C40.136795,438 32.3779253,435.772185 24.5557031,431.588815 C16.7334809,427.405445 10.5945551,421.266519 6.41118489,413.444297 C2.22781467,405.622075 9.62964878e-16,397.863205 -1.65734449e-15,376.466755 L1.65734449e-15,61.5332448 C-9.62964878e-16,40.136795 2.22781467,32.3779253 6.41118489,24.5557031 C10.5945551,16.7334809 16.7334809,10.5945551 24.5557031,6.41118489 C32.3779253,2.22781467 40.136795,1.44444732e-15 61.5332448,-2.48601674e-15 Z" id="path-1"></path>
    </defs>
    <g id="com.vivo.weather.cloudy" stroke="none" stroke-width="1" fill="none" fill-rule="evenodd">
        <g id="编组-7备份-24" transform="translate(240.000000, 240.000000) rotate(-270.000000) translate(-240.000000, -240.000000) translate(21.000000, 21.000000)">
            <mask id="mask-2" fill="white">
                <use xlink:href="#path-1"></use>
            </mask>
            <use id="mask" fill="#59ADF5" xlink:href="#path-1"></use>
        </g>
    </g>
</svg>