<?xml version="1.0" encoding="UTF-8"?>
<svg width="480px" height="240px" viewBox="0 0 480 240" version="1.1" xmlns="http://www.w3.org/2000/svg" xmlns:xlink="http://www.w3.org/1999/xlink">
    <title>com.android.filemanager_b_s5_2x1_0_sc</title>
    <defs>
        <path d="M337.628467,144 L337.916442,144.003725 C342.990243,144.135097 347.319391,147.728084 348.383402,152.690806 L348.440124,152.973163 L349.520353,158.735374 L349.575089,159.006791 C350.546322,163.504027 354.468106,166.760399 359.066756,166.888855 L359.349132,166.892795 L419.98827,166.893515 C419.993475,166.624886 419.996953,166.346484 419.998694,166.057708 L420,165.616689 L419.999,144 L458.999,144 L458.99926,158.137915 C458.955349,177.915459 456.95866,185.850243 453.233056,193.207738 L452.979275,193.703002 C452.851078,193.950325 452.720922,194.197279 452.588815,194.444297 C448.405445,202.266519 442.266519,208.405445 434.444297,212.588815 C426.704414,216.72815 419.026557,218.952882 398.137915,218.99926 L99,218.999241 L99,144 L337.628467,144 Z" id="path-1"></path>
    </defs>
    <g id="com.android.filemanager" stroke="none" stroke-width="1" fill="none" fill-rule="evenodd">
        <mask id="mask-2" fill="white">
            <use xlink:href="#path-1"></use>
        </mask>
        <use id="形状结合" fill="#FFFFFF" xlink:href="#path-1"></use>
        <path d="M137.998668,89.6053426 L137.999992,144 L99,143.999241 L99.0007548,142.207948 C99.0445241,123.965393 100.990934,117.252907 104.609787,110.48624 C108.270236,103.641796 113.641796,98.2702357 120.48624,94.6097868 C125.113925,92.134874 129.716268,90.4421819 137.998668,89.6053426 Z M420.00033,89.6052414 C428.283361,90.4420455 432.885889,92.1347743 437.51376,94.6097868 C444.358204,98.2702357 449.729764,103.641796 453.390213,110.48624 C457.009066,117.252907 458.955476,123.965393 458.999245,142.207948 L458.999,143.999241 L419.999,143.999241 L420.00033,89.6052414 Z" id="形状结合" fill="#FFFFFF" opacity="0.600000024"></path>
    </g>
</svg>