<?xml version="1.0" encoding="UTF-8"?>
<svg width="240px" height="240px" viewBox="0 0 240 240" version="1.1" xmlns="http://www.w3.org/2000/svg" xmlns:xlink="http://www.w3.org/1999/xlink">
    <title>com.iqoo.secure_b_s5_1x1_mc</title>
    <g id="com.iqoo.secure" stroke="none" stroke-width="1" fill="none" fill-rule="evenodd">
        <g id="编组-43" transform="translate(60.346154, 59.389910)" fill="#00F052" fill-rule="nonzero">
            <g id="编组-41">
                <path d="M118.195109,15.1079405 L119.307692,15.7308835 L119.307692,53.4194118 C119.307692,78.5780483 105.770015,101.79044 83.8725655,114.178285 L59.6538462,127.879321 L35.4351268,114.178285 C13.5376776,101.79044 0,78.5780483 0,53.4194118 L0,15.7308835 C36.6336755,-5.03388271 81.398804,-5.24153037 118.195109,15.1079405 Z M97.7258853,28.6611542 C73.3402125,18.5996934 45.9298581,18.6101061 21.5624536,28.669391 L21.1190862,28.8535302 L21.12,53.4194118 C21.12,70.7550075 30.3357693,86.7656975 45.2849185,95.4803994 L45.8343903,95.795964 L59.6525262,103.61305 L73.473302,95.795964 C88.5617718,87.260101 97.9593299,71.3554319 98.1835869,54.053039 L98.1876923,53.4194118 L98.1876923,28.8548502 L97.7258853,28.6611542 Z" id="多边形"></path>
            </g>
        </g>
    </g>
</svg>