{
    "Image_Build_IDs": {
        "adsp": "ADSP.HT.5.3-00580-SM8250-2.340129.1", 
        "aop": "AOP.HO.2.0-00187-SM8250_E-1", 
        "aop_sdx55m": "AOP.HO.2.0.2-00093-SDX55AAAAANAZO-1", 
        "apps": "LA.UM.9.12.r1-06900-SMxx50.0-1.325933.1", 
        "apps_sdx55m": "TN.HF.1.1.c1-00010-SDX55ACTMAAAZA-1", 
        "boot": "BOOT.XF.3.2-00295-SM8250-1", 
        "boot_sdx55m": "BOOT.SBL.4.1-00168-SDX55MAAAAANAZB-1", 
        "btfm": "BTFM.HST.2.0.0.c3-00328-QCACHROMZ-1", 
        "btfm_hsp": "BTFM.HSP.1.0.0.c1-00279-QCAHSPROMZ-1", 
        "cdsp": "CDSP.HT.2.3-00575-SM8250-1", 
        "common": "SM8250_SDX55.LA_TN.2-0_2-0.c2-00007-STD.PROD-1.418912.1.432109.1", 
        "cvp": "CVP.VPU.1.0-00050-PROD-1", 
        "glue": "GLUE.SM8250_LA_SDX55_TN.1.01-00339-NOOP_TEST-1", 
        "modem_sdx55m": "MPSS.HI.2.0.c4-00028-SDX55_RMTEFS_PACK-1.418912.1.432109.1", 
        "npu": "NPU.FW.2.0-00158-SM8250_NPU_PACK-1", 
        "slpi": "SLPI.HY.3.0-00251-SM8250AZL-1.334657.1", 
        "spss": "SPSS.A1.1.3.10-00015-SM8250AAAAANAZS-1", 
        "tz": "TZ.XF.5.8-00147-SM8250AAAAANAZT-1.324133.1.334219.1", 
        "tz_sdx55m": "TZ.FU.5.9-00080-SDX55AAAAANAZT-1", 
        "tzapps": "TZ.APPS.2.0-00067-SM8250AAAAANAZT-1", 
        "video": "VIDEO.VPU.1.0-00082-PROD-1", 
        "wigig": "WIGIG.TLN.7.8-00008-WIGIGTLNZ-1", 
        "wlan_hsp": "WLAN.HSP.1.0.c1-00114-QCAHSPSWPL_V1_SILICONZ-1", 
        "wlan_hst": "WLAN.HST.1.0.1.r1-00805-QCAHSTSWPL_SILICONZ-1.342121.1.394054.1"
    }, 
    "Metabuild_Info": {
        "Meta_Build_ID": "SM8250_SDX55.LA_TN.2-0_2-0.c2-00007-STD.PROD-1.418912.1.432109.1", 
        "Product_Flavor": "asic", 
        "Time_Stamp": "2022-02-14 22:46:48"
    }, 
    "Version": "1.0"
}