{
  "target_device": "QKS",
  "version": "11.1001.01",
  "release_date": "2022/08/29",
  "payload": {
    "selfie_night_screen_brightness": 0.8,
    "selfie_night_screen_flash_max_alpha": 0.8,
    "selfie_night_screen_flash_color": "#FCF5EF",
    "lens_hood_enable": true,
    "lens_hood_color": "#000000",
    "lens_hood_position_x": 540,
    "lens_hood_position_y": 65,
    "lens_hood_radius": 45,
    "lens_hood_debug_view_enable": false,
    "payload": [
      {
        "camera_id": "0",
        "payload": [
          {
            "sensor_type": "1",
            "quick_thumb_lux_range": [0.0, 320.0]
          }
        ]
      },
      {
        "camera_id": "1",
        "payload": [
          {
            "sensor_type": "1",
            "quick_thumb_lux_range": [0.0, 208.0]
          }
        ]
      },
      {
        "camera_id": "2",
        "payload": [
          {
            "sensor_type": "1",
            "quick_thumb_lux_range": [0.0, 226.0]            
          }
        ]
      },
      {
        "camera_id": "3",
        "payload": [
          {
            "sensor_type": "1",
            "quick_thumb_lux_range": [0.0, 206.0]            
          }
        ]
      },
      {
        "camera_id": "4",
        "payload": [
          {
            "sensor_type": "1",
            "quick_thumb_lux_range": [0.0, 195.0]            
          }
        ]
      },
      {
        "camera_id": "5",
        "payload": [
          {
            "sensor_type": "1",
            "quick_thumb_lux_range": [0.0, 320.0]
          }
        ]
      }      
    ]
  }
}
