{
  "version": 0.1,
  "defaultRate": "240",
  "tpList": [{
    "rate": "360",
    "packages": ["com.mobile.legends",
        "com.tencent.ig", "com.tencent.iglite", "com.dts.freefireth", "com.dts.freefiremax",
        "com.pubg.imobile", "com.kiloo.subwaysurf", "com.rioo.runnersubway",
        "com.igoldtech.streetchaser", "jp.konami.pesam", "com.firsttouchgames.dls7"]
  }]
}
