{
	"displayname":"Advanced low",
	"configurations": [
		{
			"category":"Temperature",
			"items": [
				{
					"name":"Temperature",
					"code":"0x48000000",
					"value":"2",
					"valueset": [
					  "0","1","2","3"
					]
				}
			]
		},
		{
			"category":"CPU",
			"items": [
				{
					"name":"/proc/sys/walt/sched_upmigrate & sched_downmigrate (Silver-Gold)",
					"code":"0x40CE0000",
					"value":"5242950",
					"valueset": [
						"0x00500046"
					]
				},
				{
					"name":"/proc/sys/walt/sched_upmigrate & sched_downmigrate (Gold-Prime)",
					"code":"0x40CE0200",
					"value":"5242950",
					"valueset": [
						"0x00500046"
					]
				},
				{
					"name":"/proc/sys/walt/sched_group_upmigrate & downmigrate",
					"code":"0x40CF4000",
					"value":"5242950",
					"valueset": [
						"0x00500046"
					]
				},
				{
					"name":"/sys/devices/system/cpu/cpufreq/policy0/walt/hispeed_load",
					"code":"0x41440100",
					"value":"75",
					"valueset": [
						"90", "80", "70", "60", "50", "40", "30"
					]
				},
				{
					"name":"/sys/devices/system/cpu/cpufreq/policy0/walt/hispeed_freq",
					"code":"0x4143C100",
					"value":"1228",
					"valueset": [
						"1363", "1574", "1785"
					]
				},
				{
					"name":"/sys/devices/system/cpu/cpufreq/policy4/walt/hispeed_load",
					"code":"0x41440000",
					"value":"75",
					"valueset": [
						"90", "80", "70", "60", "50", "40", "30"
					]
				},
				{
					"name":"/sys/devices/system/cpu/cpufreq/policy4/walt/hispeed_freq",
					"code":"0x4143C000",
					"value":"1555",
					"valueset": [
						"1881", "2112", "2496"
					]
				},
				{
					"name":"/sys/devices/system/cpu/cpufreq/policy7/walt/hispeed_load",
					"code":"0x41440200",
					"value":"75",
					"valueset": [
						"90", "80", "70", "60", "50", "40", "30"
					]
				},
				{
					"name":"/sys/devices/system/cpu/cpufreq/policy7/walt/hispeed_freq",
					"code":"0x4143C200",
					"value":"1651",
					"valueset": [
						"2284", "2630", "2995"
					]
				}
			]
		},
		{
			"category":"GPU",
			"items": [
				{
					"name":"/sys/class/kgsl/kgsl-3d0/max_pwrlevel",
					"code":"0X42808000",
					"value":"0",
					"valueset": [
						"12", "11", "9", "8", "6", "5", "4", "2", "1", "0"
					]
				},
				{
					"name":"/sys/class/kgsl/kgsl-3d0/max_clock_mhz",
					"code":"0X42834000",
					"value":"900",
					"valueset": [
						"900", "220"
					]
				}
			]
		}
	]
}
