{
"PinLibs": [
"/vendor/lib64/libVDPostureDetection.so",
"/vendor/lib64/libFaceBeautyCap.so",
"/vendor/lib64/libFaceBeautyPre.so",
"/vendor/lib64/libcamdrv_tuning_mgr.so",
"/vendor/lib64/yogurt_truly_main_s5k3l6_parker_tuning.so",
"/vendor/lib64/yogurt_sunny_front_s5k3p9sp_tuning.so",
"/vendor/lib64/yogurt_hlt_micro_gc02m1_tuning.so",
"/vendor/lib64/yogurt_hlt_micro_ov02b10_tuning.so",
"/vendor/lib64/yogurt_truly_main_s5k3l6_IdxMgr.so",
"/vendor/lib64/yogurt_hlt_depth_gc02m1b_IdxMgr.so",
"/vendor/lib64/yogurt_hlt_micro_ov02b10_IdxMgr.so",
"/vendor/lib64/yogurt_truly_main_s5k3l6_parker_IdxMgr.so",
"/vendor/lib64/hw/android.hardware.graphics.mapper@4.0-impl-mediatek.so",
"/system/lib64/libperfctl.so",
"/vendor/lib64/hw/gralloc.rogue.so",
"/system/lib64/libnetd_client.so",
"/system/lib64/libEGL.so",
"/vendor/lib64/liboppo_aisd.so",
]

}
