<svg width="35" height="35" viewBox="0 0 35 35" fill="none" xmlns="http://www.w3.org/2000/svg">
<path d="M30.8369 15.7838L28.8198 14.9373L29.2429 13.9288L28.2343 13.5056L27.8112 14.5142L9.16118 6.6889L9.58433 5.68032L8.57575 5.25718L8.15261 6.26568L7.1441 5.84254C7.07788 5.81474 7.00683 5.80026 6.93501 5.79993C6.86319 5.79959 6.79201 5.81341 6.72553 5.84058C6.65904 5.86776 6.59857 5.90776 6.54755 5.95831C6.49653 6.00886 6.45596 6.06896 6.42817 6.13519L4.73539 10.1695C4.62425 10.4344 4.56637 10.7186 4.56506 11.0058C4.56375 11.2931 4.61903 11.5778 4.72776 11.8437C4.83648 12.1096 4.99652 12.3515 5.19872 12.5556C5.40093 12.7596 5.64135 12.9219 5.90625 13.033L6.97491 13.4814L6.63503 15.8594H4.375C4.22996 15.8594 4.09086 15.917 3.9883 16.0196C3.88574 16.1221 3.82812 16.2612 3.82812 16.4063V22.9687C3.82812 23.1138 3.88574 23.2529 3.9883 23.3554C4.09086 23.458 4.22996 23.5156 4.375 23.5156H9.84375C9.98879 23.5156 10.1279 23.458 10.2304 23.3554C10.333 23.2529 10.3906 23.1138 10.3906 22.9687V16.4063C10.3906 16.2612 10.333 16.1221 10.2304 16.0196C10.1279 15.917 9.98879 15.8594 9.84375 15.8594H7.73992L8.01719 13.9188L12.8994 15.9673L12.3851 16.8623C12.1743 17.2287 12.0439 17.6357 12.0025 18.0563C11.9611 18.477 12.0096 18.9016 12.1449 19.302C12.2802 19.7025 12.4991 20.0695 12.7871 20.3789C13.0751 20.6882 13.4257 20.9327 13.8154 21.0962L16.3688 22.1676L15.4641 27.6769C15.3832 28.1623 15.4688 28.6608 15.707 29.0913C15.9452 29.5219 16.3221 29.8592 16.7763 30.0485L21.1824 31.8972C21.4912 32.0268 21.8256 32.0837 22.1598 32.0637C22.4941 32.0436 22.8193 31.9471 23.1103 31.7815C23.4014 31.6159 23.6506 31.3857 23.8387 31.1087C24.0267 30.8316 24.1487 30.5151 24.1951 30.1835L25.2098 22.9361C25.302 22.2776 25.6183 21.6708 26.1053 21.218C26.5923 20.7652 27.2204 20.4939 27.8839 20.4498L29.1798 20.3637C29.2812 20.357 29.3786 20.3222 29.4613 20.2632C29.544 20.2042 29.6086 20.1233 29.6479 20.0296L31.129 16.4996C31.1852 16.366 31.1859 16.2155 31.1312 16.0812C31.0764 15.947 30.9705 15.84 30.8369 15.7838ZM9.29688 22.4219H4.92188V16.9531H9.29688V22.4219ZM6.32939 12.0244C6.06211 11.9119 5.85036 11.698 5.74061 11.4296C5.63085 11.1612 5.63206 10.8602 5.74396 10.5927L7.29449 11.2433L7.1346 12.3623L6.32939 12.0244ZM8.3369 11.6806L9.76951 12.2818L9.3463 13.2903L8.17735 12.7997L8.3369 11.6806ZM14.2388 20.0876C13.992 19.9842 13.7701 19.8294 13.5877 19.6336C13.4054 19.4378 13.2668 19.2054 13.1811 18.9519C13.0955 18.6984 13.0648 18.4296 13.091 18.1633C13.1172 17.897 13.1998 17.6394 13.3333 17.4074L13.9158 16.3938L16.3293 17.4064C15.9644 17.7602 15.4811 18.0896 14.8861 18.1977L15.0817 19.2739C15.777 19.1475 16.4318 18.8037 17.0094 18.2686L16.5514 21.058L14.2388 20.0876ZM25.4771 20.3132C24.7411 20.9453 24.261 21.824 24.1268 22.7848L23.1123 30.0318C23.0891 30.1976 23.0281 30.3559 22.9341 30.4944C22.84 30.6329 22.7155 30.748 22.5699 30.8308C22.4244 30.9136 22.2618 30.9618 22.0947 30.9719C21.9275 30.9819 21.7603 30.9534 21.6059 30.8887L17.1998 29.0399C16.9726 28.9453 16.7841 28.7767 16.665 28.5614C16.5458 28.3461 16.503 28.0968 16.5435 27.8541L18.247 17.4803C18.2669 17.359 18.2454 17.2345 18.1859 17.1269C18.1263 17.0194 18.0323 16.935 17.9189 16.8874L10.3546 13.7135L10.7778 12.7049L19.8548 16.5136L19.4317 17.5221L20.4403 17.9454L20.8635 16.9368L26.9824 19.5042C26.4285 19.6626 25.9153 19.9384 25.4775 20.3129L25.4771 20.3132ZM28.8511 19.1024L8.49707 10.5615L8.7448 8.82732L7.66199 8.67255L7.45438 10.124L6.16718 9.58399L7.22511 7.06255L23.3535 13.8301L22.7187 15.3429L23.7273 15.7662L24.362 14.2533L25.3706 14.6765L24.7358 16.1893L25.7444 16.6126L26.3791 15.0997L27.3877 15.5228L26.7529 17.0357L27.7615 17.4589L28.3963 15.9461L29.9091 16.5808L28.8511 19.1024Z" fill="white"/>
<path d="M20.5684 29.0716L20.9917 28.0631L22.0002 28.4864L21.5769 29.4949L20.5684 29.0716Z" fill="white"/>
<path d="M33.3594 0.546875H1.64062C1.49558 0.546875 1.35648 0.604492 1.25393 0.707051C1.15137 0.80961 1.09375 0.94871 1.09375 1.09375V32.2656C1.0944 32.8456 1.32508 33.4016 1.73517 33.8117C2.14527 34.2218 2.70129 34.4525 3.28125 34.4531H31.7188C32.2987 34.4525 32.8547 34.2218 33.2648 33.8117C33.6749 33.4016 33.9056 32.8456 33.9062 32.2656V1.09375C33.9062 0.94871 33.8486 0.80961 33.7461 0.707051C33.6435 0.604492 33.5044 0.546875 33.3594 0.546875ZM32.8125 1.64062V2.73438H2.1875V1.64062H32.8125ZM28.4375 3.82812H29.5312V5.46875H28.4375V3.82812ZM31.7188 33.3594H3.28125C2.99127 33.359 2.71328 33.2437 2.50823 33.0386C2.30319 32.8336 2.18784 32.5556 2.1875 32.2656V3.82812H27.3438V6.01562C27.3438 6.16067 27.4014 6.29976 27.5039 6.40232C27.6065 6.50488 27.7456 6.5625 27.8906 6.5625H30.0781C30.2232 6.5625 30.3623 6.50488 30.4648 6.40232C30.5674 6.29976 30.625 6.16067 30.625 6.01562V3.82812H32.8125V32.2656C32.8122 32.5556 32.6968 32.8336 32.4918 33.0386C32.2867 33.2437 32.0087 33.359 31.7188 33.3594V33.3594Z" fill="white"/>
<path d="M6.01562 18.0469H8.20312V19.1406H6.01562V18.0469Z" fill="white"/>
<path d="M6.01562 20.2344H8.20312V21.3281H6.01562V20.2344Z" fill="white"/>
</svg>
