<?xml version='1.0' encoding='UTF-8' standalone='no'?>
<!-- Created with Inkscape (http://www.inkscape.org/) -->

<svg xmlns:cc='http://creativecommons.org/ns#' xmlns:dc='http://purl.org/dc/elements/1.1/'
     sodipodi:docname='tab-new-symbolic.svg' height='16' id='svg7384'
     xmlns:inkscape='http://www.inkscape.org/namespaces/inkscape'
     xmlns:rdf='http://www.w3.org/1999/02/22-rdf-syntax-ns#'
     xmlns:sodipodi='http://sodipodi.sourceforge.net/DTD/sodipodi-0.dtd'
     inkscape:version='0.48.4 r9939' version='1.1' width='16.000004' xmlns='http://www.w3.org/2000/svg'>
    <metadata id='metadata90'>
        <rdf:RDF>
            <cc:Work rdf:about=''>
                <dc:format>image/svg+xml</dc:format>
                <dc:type rdf:resource='http://purl.org/dc/dcmitype/StillImage'/>
                <dc:title>Gnome Symbolic Icon Theme</dc:title>
            </cc:Work>
        </rdf:RDF>
    </metadata>
    <sodipodi:namedview inkscape:bbox-nodes='false' inkscape:bbox-paths='true' bordercolor='#666666' borderopacity='1'
                        inkscape:current-layer='layer12' inkscape:cx='61.6001' inkscape:cy='484.11648'
                        gridtolerance='10' inkscape:guide-bbox='true' guidetolerance='10' id='namedview88'
                        inkscape:object-nodes='false' inkscape:object-paths='false' objecttolerance='10'
                        pagecolor='#3a3b39' inkscape:pageopacity='1' inkscape:pageshadow='2' showborder='false'
                        showgrid='false' showguides='true' inkscape:snap-bbox='true'
                        inkscape:snap-bbox-midpoints='false' inkscape:snap-global='true' inkscape:snap-grids='true'
                        inkscape:snap-nodes='true' inkscape:snap-others='false' inkscape:snap-to-guides='true'
                        inkscape:window-height='702' inkscape:window-maximized='1' inkscape:window-width='1366'
                        inkscape:window-x='0' inkscape:window-y='27' inkscape:zoom='1'>
        <inkscape:grid empspacing='2' enabled='true' id='grid4866' originx='121px' originy='589px'
                       snapvisiblegridlinesonly='true' spacingx='1px' spacingy='1px' type='xygrid' visible='true'/>
        <inkscape:grid color='#000000' empcolor='#000000' empopacity='0' empspacing='4' enabled='true' id='grid5968'
                       opacity='0.1254902' originx='121px' originy='589px' snapvisiblegridlinesonly='true'
                       spacingx='0.5px' spacingy='0.5px' type='xygrid' visible='true'/>
    </sodipodi:namedview>
    <title id='title9167'>Gnome Symbolic Icon Theme</title>
    <defs id='defs7386'/>
    <g inkscape:groupmode='layer' id='layer9' inkscape:label='status' style='display:inline'
       transform='translate(-120.0002,-806)'/>
    <g inkscape:groupmode='layer' id='layer10' inkscape:label='devices' transform='translate(-120.0002,-806)'/>
    <g inkscape:groupmode='layer' id='layer11' inkscape:label='apps' transform='translate(-120.0002,-806)'/>
    <g inkscape:groupmode='layer' id='layer13' inkscape:label='places' transform='translate(-120.0002,-806)'/>
    <g inkscape:groupmode='layer' id='layer14' inkscape:label='mimetypes' transform='translate(-120.0002,-806)'/>
    <g inkscape:groupmode='layer' id='layer15' inkscape:label='emblems' style='display:inline'
       transform='translate(-120.0002,-806)'/>
    <g inkscape:groupmode='layer' id='g71291' inkscape:label='emotes' style='display:inline'
       transform='translate(-120.0002,-806)'/>
    <g inkscape:groupmode='layer' id='g4953' inkscape:label='categories' style='display:inline'
       transform='translate(-120.0002,-806)'/>
    <g inkscape:groupmode='layer' id='layer12' inkscape:label='actions' style='display:inline'
       transform='translate(-120.0002,-806)'>
        <path inkscape:connector-curvature='0'
              d='m 123.0002,808 c 0,0 -2,0 -2,2 l 0,8 -1,0 0,2 3,0 0,-10 10,0 0,10 3,0 0,-2 -1,0 0,-8 c 0,0 0,-2 -2,-2 z'
              id='rect11749-5-0-1-3' sodipodi:nodetypes='cscccccccccccsc'
              style='color:#bebebe;fill:#bebebe;fill-opacity:1;stroke:none;stroke-width:2;marker:none;visibility:visible;display:inline;overflow:visible'/>

        <rect height='2' id='rect3764' style='fill:#bebebe;fill-opacity:1;fill-rule:nonzero;stroke:none' width='5.99998'
              x='125.00022' y='814'/>
        <rect height='2' id='rect3766' style='fill:#bebebe;fill-opacity:1;fill-rule:nonzero;stroke:none'
              transform='matrix(0,1,-1,0,0,0)' width='6' x='812' y='-129.00021'/>
    </g>
</svg>
