<?xml version='1.0' encoding='UTF-8'?>
<!-- Created with Inkscape (http://www.inkscape.org/) -->

<svg xmlns:cc='http://creativecommons.org/ns#' xmlns:inkscape='http://www.inkscape.org/namespaces/inkscape'
     id='svg7384'
     xmlns:sodipodi='http://sodipodi.sourceforge.net/DTD/sodipodi-0.dtd' sodipodi:docname='object-select-symbolic.svg'
     version='1.1' inkscape:version='0.48.1 r9760' height='15.993952' xmlns:dc='http://purl.org/dc/elements/1.1/'
     xmlns:rdf='http://www.w3.org/1999/02/22-rdf-syntax-ns#' xmlns='http://www.w3.org/2000/svg' width='15.999536'>
    <metadata id='metadata90'>
        <rdf:RDF>
            <cc:Work rdf:about=''>
                <dc:format>image/svg+xml</dc:format>
                <dc:type rdf:resource='http://purl.org/dc/dcmitype/StillImage'/>
                <dc:title>Gnome Symbolic Icon Theme</dc:title>
            </cc:Work>
        </rdf:RDF>
    </metadata>
    <sodipodi:namedview inkscape:cy='216.52697' pagecolor='#555753' borderopacity='1' showborder='false'
                        inkscape:bbox-paths='false' guidetolerance='10' inkscape:object-paths='true'
                        inkscape:window-width='1598' showguides='true' inkscape:object-nodes='true'
                        inkscape:snap-bbox='true' inkscape:pageshadow='2' inkscape:guide-bbox='true'
                        inkscape:snap-nodes='true' bordercolor='#666666' objecttolerance='10' id='namedview88'
                        showgrid='false' inkscape:window-maximized='0' inkscape:window-x='2124'
                        inkscape:snap-global='true' inkscape:window-y='31' gridtolerance='10'
                        inkscape:window-height='1162' inkscape:snap-others='false' inkscape:snap-to-guides='true'
                        inkscape:current-layer='layer12' inkscape:snap-bbox-midpoints='false' inkscape:zoom='2.5381589'
                        inkscape:cx='210.67214' inkscape:snap-grids='true' inkscape:pageopacity='1'>
        <inkscape:grid spacingx='1px' spacingy='1px' id='grid4866' empspacing='2' enabled='true' type='xygrid'
                       snapvisiblegridlinesonly='true' visible='true'/>
    </sodipodi:namedview>
    <title id='title9167'>Gnome Symbolic Icon Theme</title>
    <defs id='defs7386'/>
    <g inkscape:label='status' transform='translate(-61.000665,-787)' inkscape:groupmode='layer' id='layer9'
       style='display:inline'/>
    <g inkscape:label='devices' transform='translate(-61.000665,-787)' inkscape:groupmode='layer' id='layer10'/>
    <g inkscape:label='apps' transform='translate(-61.000665,-787)' inkscape:groupmode='layer' id='layer11'/>
    <g inkscape:label='places' transform='translate(-61.000665,-787)' inkscape:groupmode='layer' id='layer13'/>
    <g inkscape:label='mimetypes' transform='translate(-61.000665,-787)' inkscape:groupmode='layer' id='layer14'/>
    <g inkscape:label='emblems' transform='translate(-61.000665,-787)' inkscape:groupmode='layer' id='layer15'
       style='display:inline'/>
    <g inkscape:label='emotes' transform='translate(-61.000665,-787)' inkscape:groupmode='layer' id='g71291'
       style='display:inline'/>
    <g inkscape:label='categories' transform='translate(-61.000665,-787)' inkscape:groupmode='layer' id='g4953'
       style='display:inline'/>
    <g inkscape:label='actions' transform='translate(-61.000665,-787)' inkscape:groupmode='layer' id='layer12'
       style='display:inline'>
        <path inkscape:connector-curvature='0'
              d='M 72.9375,790.9375 68,795.875 l -1.9375,-1.9375 -2.125,2.125 3,3 1.0625,1.0625 1.0625,-1.0625 6,-6 -2.125,-2.125 z'
              id='path8913-6-7-1-5'
              style='font-size:medium;font-style:normal;font-variant:normal;font-weight:normal;font-stretch:normal;text-indent:0;text-align:start;text-decoration:none;line-height:normal;letter-spacing:normal;word-spacing:normal;text-transform:none;direction:ltr;block-progression:tb;writing-mode:lr-tb;text-anchor:start;baseline-shift:baseline;color:#000000;fill:#bebebe;fill-opacity:1;stroke:none;stroke-width:3;marker:none;visibility:visible;display:inline;overflow:visible;enable-background:accumulate;font-family:Sans;-inkscape-font-specification:Sans'/>
    </g>
</svg>
