[
  {
    "imageId": 1,
    "tagName": "Programming"
  },
  {
    "imageId": 2,
    "tagName": "Relations"
  },
  {
    "imageId": 3,
    "tagName": "Programming"
  },
  {
    "imageId": 4,
    "tagName": "Films"
  },
  {
    "imageId": 5,
    "tagName": "Films"
  }
]
