{
  "type": "service_account",
  "project_id": "lab1-e7222",
  "private_key_id": "85503d5194235c1c14ec2ff72684358f58814532",
  "private_key": "-----BEGIN PRIVATE KEY-----\nMIIEvQIBADANBgkqhkiG9w0BAQEFAASCBKcwggSjAgEAAoIBAQC9YDbGYbmOTcRa\nUpxXby9RA7f8+sdvelDNAW/kj7gAmSQYNc8liGF/4zn0NjJS+3yQXLZUPuecsTeU\nFvkYW3FXWqUH1kjzO2ydFYoEkSW/c4hdseoZyp90jJoFEtMRZoG0RaWJ02N1OhxY\nyisWAOqvaQJXdrpayaEP5WiyhrSLuHP6smDrHGc6eIQ1Mg5FTCD8nZ7mVXFbIVO5\nMssTQ1WWY5WXRl2gaWFChRbiWLLgQralXOZQOa6lLmwll7c9esO6UMr+CeZ3Rcbz\n6pqvIpWZBlxnRCJIoCWih0+nfB/UBtwz5WccIUdGmY9Jv0WowSW3LdX2C1CVh07K\nOhRtC+OnAgMBAAECggEAJdf6yjUQOCRJR0V38a8J1RY5p8fTn+7hA760RggEXLY9\ntMrX/OeemEhnteo4r0WLVGv6kaZKcZEmiqT2nUv0v+Cg1wqW5GhtIY0C2jvJP9OO\nHi8mGYZYzBkm1Dm5TSJfbA9476x7FRuKO6IW7xw6ydfhvGnA/tCJK5yMChUKMltP\naEPG0W/W3JBguqxEnz1aZOpoXsizG8NBylq9nGD45N/Zaas0U2I/JnoFEx0i+sDP\nzxU30XxpH77HewUtZVJQULfzMchBpNdDkFXe5CdvaBH1dxSUXf6UsptyPuPFvf/M\nETv6p9cgvT/mPOBXfNpNISMDnsW2oZUrPkNfwS71XQKBgQDhFaq1PgGbkwQ7OZkI\nbDhn8B6SbEhuMNEVrz4jrIpXDAwey618lX/vrs3bPVZMuBej4C9qm4joHKHU3Rjq\nbxId5ZJZwRphG39u3N7TBN29sscOkxI8eQEKsEtjkpzHNfN//2auWHZYKIYxzq+l\nrMVmhCZsUDzKgwII3ThwDEbcfQKBgQDXYvgSAGvrnZ4IPdBf8N3RnUlMUG73LH7f\nBIpd3MG/AVSdQ4vcWX2A2UpsJfpLfyXLW0e3rrRhPJmz5Po2hIGn34JdniyWfV5T\nVA3bd0iOX1rJZVKA4yjyyub7kO2udCfnKmDgE8lCjqAxeXxl5V8Ti/dH/ddA4RRw\nt0nUYANN8wKBgQCsC9G2Q7Ua459CXd5Zj871s5bKuTYL9Ah9mLvYrNP5gV3qVClB\np0xpOqZjRFkovzZirsPPqx9UvD3+5RlcaJXigE4DiRTO0SPw66buiTOtAnAg9c3k\np2FieCrH65MmulhrqB8meLvM2vzoKWIdMxiYKb7s38/3w3fUqrOvAdNQSQKBgBZv\n1d2yM4vQ2ISNQ+aqpcDPPLJ5coXHGdRLmcpbU8d88P6M6cXjgKJqgEkxz5gLv7km\nYhstVNcIRA6sXLBPL154dxEfiA+JMclGaUcibul932w5ZNXOVBausk8kcs4IhZuc\nG4lcJkwLpX5h5GaM9VGI9BKIy+KTT9jKDyPTeKSnAoGAcW9VSSj8mxmrqnYt1oGI\nI9lNN0OQd+CAlZwmWkBkG7aU3DOWv5iv3l5ZEAGOpTj3zbeLfBCJZ8KGSUFSQt0/\nvRqBjS3ht4btAuVaOCnhjxGSr4Eibhr5VhCqS9kCz8Ed2FDO/m2uJPIIcf2AjBDu\nNHfPMWZUyqg65PdDLerC934=\n-----END PRIVATE KEY-----\n",
  "client_email": "firebase-adminsdk-whd6b@lab1-e7222.iam.gserviceaccount.com",
  "client_id": "113616137950751880472",
  "auth_uri": "https://accounts.google.com/o/oauth2/auth",
  "token_uri": "https://oauth2.googleapis.com/token",
  "auth_provider_x509_cert_url": "https://www.googleapis.com/oauth2/v1/certs",
  "client_x509_cert_url": "https://www.googleapis.com/robot/v1/metadata/x509/firebase-adminsdk-whd6b%40lab1-e7222.iam.gserviceaccount.com"
}
