<svg width="80" height="80" viewBox="0 0 24 24" fill="none" xmlns="http://www.w3.org/2000/svg">
<path d="M12 1.71429C12.8796 1.71429 13.7256 2.05238 14.363 2.65863C15.0003 3.26488 15.3803 4.0929 15.4243 4.97144L15.4286 5.14287H19.7143C19.9328 5.14311 20.1429 5.22676 20.3017 5.37674C20.4606 5.52671 20.5562 5.73168 20.569 5.94978C20.5818 6.16787 20.5109 6.38262 20.3706 6.55015C20.2304 6.71768 20.0315 6.82535 19.8146 6.85115L19.7143 6.85715H18.9866L17.9751 19.3311C17.9099 20.1361 17.544 20.8869 16.9504 21.4344C16.3567 21.9818 15.5787 22.2858 14.7711 22.2857H9.22886C8.4213 22.2858 7.6433 21.9818 7.04963 21.4344C6.45596 20.8869 6.09011 20.1361 6.02486 19.3311L5.01257 6.85715H4.28571C4.07577 6.85712 3.87314 6.78005 3.71625 6.64054C3.55937 6.50103 3.45913 6.30879 3.43457 6.10029L3.42857 6.00001C3.4286 5.79007 3.50568 5.58743 3.64518 5.43055C3.78469 5.27366 3.97693 5.17343 4.18543 5.14887L4.28571 5.14287H8.57143C8.57143 4.23355 8.93265 3.36148 9.57563 2.7185C10.2186 2.07552 11.0907 1.71429 12 1.71429ZM10.0714 9.64286C9.91608 9.64287 9.76599 9.69913 9.64892 9.80124C9.53184 9.90334 9.4557 10.0444 9.43457 10.1983L9.42857 10.2857V17.1429L9.43457 17.2303C9.45574 17.3842 9.5319 17.5252 9.64897 17.6272C9.76605 17.7293 9.91611 17.7855 10.0714 17.7855C10.2267 17.7855 10.3768 17.7293 10.4939 17.6272C10.611 17.5252 10.6871 17.3842 10.7083 17.2303L10.7143 17.1429V10.2857L10.7083 10.1983C10.6872 10.0444 10.611 9.90334 10.4939 9.80124C10.3769 9.69913 10.2268 9.64287 10.0714 9.64286ZM13.9286 9.64286C13.7732 9.64287 13.6231 9.69913 13.5061 9.80124C13.389 9.90334 13.3128 10.0444 13.2917 10.1983L13.2857 10.2857V17.1429L13.2917 17.2303C13.3129 17.3842 13.389 17.5252 13.5061 17.6272C13.6232 17.7293 13.7733 17.7855 13.9286 17.7855C14.0839 17.7855 14.234 17.7293 14.351 17.6272C14.4681 17.5252 14.5443 17.3842 14.5654 17.2303L14.5714 17.1429V10.2857L14.5654 10.1983C14.5443 10.0444 14.4682 9.90334 14.3511 9.80124C14.234 9.69913 14.0839 9.64287 13.9286 9.64286ZM12 3.42858C11.5675 3.42844 11.1509 3.59179 10.8338 3.88586C10.5167 4.17994 10.3224 4.58302 10.29 5.01429L10.2857 5.14287H13.7143L13.71 5.01429C13.6776 4.58302 13.4833 4.17994 13.1662 3.88586C12.8491 3.59179 12.4325 3.42844 12 3.42858Z" fill="#828282"/>
</svg>
