,constituency_name,county_name,region_name,country_name,constituency_type,declaration_time,mp_firstname,mp_surname,mp_gender,result,first_party,second_party,electorate,valid_votes,invalid_votes,majority,con,lab,ld,brexit,green,snp,other,hb_name,covidcases_norm,CON_share,SNP_share,LAB_share
308,Kilmarnock and Loudoun,Scotland,Scotland,Scotland,County,2019-12-13 01:55:00,Alan,Brown,Male,SNP hold,SNP,Con,74517,47631,138,12659,11557,9009,2444,0.0,0.0,24216,405.0,NHS Ayrshire & Arran,9388,0.24263609833931682,0.508408389494237,0.18914152547710525
18,"Ayr, Carrick and Cumnock",Scotland,Scotland,Scotland,County,2019-12-13 03:52:00,Allan,Dorans,Male,SNP gain from Con,SNP,Con,71970,46592,138,2329,17943,6219,2158,0.0,0.0,20272,0.0,NHS Ayrshire & Arran,9388,0.3851090315934066,0.43509615384615385,0.13347785027472528
120,Central Ayrshire,Scotland,Scotland,Scotland,County,2019-12-13 04:36:00,Philippa,Whitford,Female,SNP hold,SNP,Con,69742,46534,105,5304,16182,6583,2283,0.0,0.0,21486,0.0,NHS Ayrshire & Arran,9388,0.34774573430180084,0.4617269093565995,0.1414664546353204
397,North Ayrshire and Arran,Scotland,Scotland,Scotland,County,2019-12-13 02:56:00,Patricia,Gibson,Female,SNP hold,SNP,Con,73534,48154,115,8521,14855,6702,2107,0.0,1114.0,23376,0.0,NHS Ayrshire & Arran,9388,0.30848942974623084,0.4854425385222411,0.13917846907837356
246,Gordon,Scotland,Scotland,Scotland,County,2019-12-13 05:14:00,Richard,Thomson,Male,SNP gain from Con,SNP,Con,79629,55916,148,819,23066,3052,5913,0.0,0.0,23885,0.0,NHS Borders,1586,0.41251162457972673,0.42715859503541026,0.05458187280921382
39,"Berwickshire, Roxburgh and Selkirk",Scotland,Scotland,Scotland,County,2019-12-13 03:40:00,John,Lamont,Male,Con hold,Con,SNP,74518,53146,170,5148,25747,2513,4287,0.0,0.0,20599,0.0,NHS Borders,1586,0.48445790840326647,0.38759266925074326,0.047284837993452
180,"Dumfriesshire, Clydesdale and Tweeddale",Scotland,Scotland,Scotland,County,2019-12-13 04:38:00,David,Mundell,Male,Con hold,Con,SNP,68330,49153,142,3781,22611,4172,3540,0.0,0.0,18830,0.0,NHS Dumfries & Galloway,1705,0.46001261367566576,0.38308953675258883,0.08487783044778549
179,Dumfries and Galloway,Scotland,Scotland,Scotland,County,2019-12-13 04:07:00,Alister,Jack,Male,Con hold,Con,SNP,74580,51429,123,1805,22678,4745,3133,0.0,0.0,20873,0.0,NHS Dumfries & Galloway,1705,0.4409574364658072,0.40586050671799956,0.0922631200295553
244,Glenrothes,Scotland,Scotland,Scotland,County,2019-12-13 03:44:00,Peter,Grant,Male,SNP hold,SNP,Lab,65672,41546,70,11757,6920,9477,2639,1276.0,0.0,21234,0.0,NHS Fife,6278,0.1665623646079045,0.5110961344052376,0.2281086025128773
314,Kirkcaldy and Cowdenbeath,Scotland,Scotland,Scotland,County,2019-12-13 04:00:00,Neale,Hanvey,Male,SNP gain from Lab,SNP,Lab,72853,47005,108,1243,9449,15325,2903,1132.0,1628.0,16568,0.0,NHS Fife,6278,0.20102116796085523,0.35247314115519623,0.3260291458355494
406,North East Fife,Scotland,Scotland,Scotland,County,2019-12-13 03:29:00,Wendy,Chamberlain,Female,LD gain from SNP,LD,SNP,60905,45878,140,1316,5961,1707,19763,0.0,0.0,18447,0.0,NHS Fife,6278,0.12993155760931166,0.40208814682418587,0.03720737608439775
221,Falkirk,Scotland,Scotland,Scotland,County,2019-12-13 03:56:00,John,McNally,Male,SNP hold,SNP,Con,84472,55872,217,14948,14403,6243,3990,0.0,1885.0,29351,0.0,NHS Forth Valley,5622,0.25778565292096217,0.525325744558992,0.11173754295532647
542,Stirling,Scotland,Scotland,Scotland,County,2019-12-13 03:19:00,Alyn,Smith,Male,SNP gain from Con,SNP,Con,68473,52620,105,9254,17641,4275,2867,0.0,942.0,26895,0.0,NHS Forth Valley,5622,0.33525275560623335,0.5111174458380844,0.08124287343215507
20,Banff and Buchan,Scotland,Scotland,Scotland,County,2019-12-13 05:03:00,David,Duguid,Male,Con hold,Con,SNP,66655,42260,96,4118,21182,1734,2280,0.0,0.0,17064,0.0,NHS Grampian,7870,0.5012304779933744,0.4037860861334595,0.04103170847136772
3,Aberdeen South,Scotland,Scotland,Scotland,Borough,2019-12-13 03:34:00,Stephen,Flynn,Male,SNP gain from Con,SNP,Con,65719,45638,131,3990,16398,3834,5018,0.0,0.0,20388,0.0,NHS Grampian,7870,0.3593058416232087,0.44673298566983655,0.08400893991848898
611,West Aberdeenshire and Kincardine,Scotland,Scotland,Scotland,County,2019-12-13 04:51:00,Andrew,Bowie,Male,Con hold,Con,SNP,72640,53345,114,843,22752,2431,6253,0.0,0.0,21909,0.0,NHS Grampian,7870,0.4265067016590121,0.41070390852001126,0.04557128128221952
375,Moray,Scotland,Scotland,Scotland,County,2019-12-13 03:16:00,Douglas,Ross,Male,Con hold,Con,SNP,71035,48825,92,513,22112,2432,2269,0.0,0.0,21599,413.0,NHS Grampian,7870,0.45288274449564775,0.4423758320532514,0.049810547875064004
2,Aberdeen North,Scotland,Scotland,Scotland,Borough,2019-12-13 03:13:00,Kirsty,Blackman,Female,SNP hold,SNP,Con,62489,37413,72,12670,7535,4939,2846,1008.0,880.0,20205,0.0,NHS Grampian,7870,0.20140058268516292,0.5400529227808516,0.13201293667976371
238,Glasgow East,Scotland,Scotland,Scotland,Borough,2019-12-13 03:40:00,David,Linden,Male,SNP hold,SNP,Lab,67381,38483,102,5566,5709,12791,1626,0.0,0.0,18357,0.0,NHS Greater Glasgow & Clyde,41341,0.14835122001922926,0.4770158251695554,0.33238053166333187
439,Paisley and Renfrewshire North,Scotland,Scotland,Scotland,County,2019-12-13 02:39:00,Gavin,Newlands,Male,SNP hold,SNP,Lab,72007,49682,153,11902,11217,11451,3661,0.0,0.0,23353,0.0,NHS Greater Glasgow & Clyde,41341,0.2257759349462582,0.4700495149148585,0.23048589026206676
440,Paisley and Renfrewshire South,Scotland,Scotland,Scotland,County,2019-12-13 02:12:00,Mhairi,Black,Female,SNP hold,SNP,Lab,64385,43084,133,10679,7571,10958,2918,0.0,0.0,21637,0.0,NHS Greater Glasgow & Clyde,41341,0.17572648779129144,0.5022049948936961,0.25434035836969643
296,Inverclyde,Scotland,Scotland,Scotland,County,2019-12-13 02:32:00,Ronnie,Cowan,Male,SNP hold,SNP,Lab,60622,39903,125,7512,6265,11783,2560,0.0,0.0,19295,0.0,NHS Greater Glasgow & Clyde,41341,0.15700573891687342,0.4835476029371225,0.29529108087111244
243,Glasgow South West,Scotland,Scotland,Scotland,Borough,2019-12-13 04:03:00,Chris,Stephens,Male,SNP hold,SNP,Lab,64575,36847,76,4900,4224,12743,1435,802.0,0.0,17643,0.0,NHS Greater Glasgow & Clyde,41341,0.11463619833364996,0.4788178142046842,0.34583548185741037
242,Glasgow South,Scotland,Scotland,Scotland,Borough,2019-12-13 04:15:00,Stewart Malcolm,McDonald,Male,SNP hold,SNP,Lab,70891,47443,80,9005,6237,13824,2786,516.0,1251.0,22829,0.0,NHS Greater Glasgow & Clyde,41341,0.13146301878043126,0.4811879518580191,0.2913812364310857
241,Glasgow North West,Scotland,Scotland,Scotland,Borough,2019-12-13 03:48:00,Carol,Monaghan,Female,SNP hold,SNP,Lab,63402,39735,180,8359,6022,11319,2716,0.0,0.0,19678,0.0,NHS Greater Glasgow & Clyde,41341,0.15155404555178054,0.4952309047439285,0.28486221215553037
240,Glasgow North East,Scotland,Scotland,Scotland,Borough,2019-12-13 03:57:00,Anne,McLaughlin,Female,SNP gain from Lab Coop,SNP,Lab,61075,33925,116,2548,3558,13363,1093,0.0,0.0,15911,0.0,NHS Greater Glasgow & Clyde,41341,0.10487840825350037,0.4690051584377303,0.39389830508474577
239,Glasgow North,Scotland,Scotland,Scotland,Borough,2019-12-13 03:25:00,Patrick,Grady,Male,SNP hold,SNP,Lab,57130,36191,84,5601,3806,11381,2394,320.0,1308.0,16982,0.0,NHS Greater Glasgow & Clyde,41341,0.10516426735928822,0.4692326821585477,0.31447044845403554
615,West Dunbartonshire,Scotland,Scotland,Scotland,County,2019-12-13 02:13:00,Martin,Docherty-Hughes,Male,SNP hold,SNP,Lab,66517,45140,104,9553,6436,12843,1890,0.0,867.0,22396,708.0,NHS Greater Glasgow & Clyde,41341,0.1425786442179885,0.4961453256535224,0.284514842711564
199,East Renfrewshire,Scotland,Scotland,Scotland,County,2019-12-13 03:04:00,Kirsten,Oswald,Female,SNP gain from Con,SNP,Con,72232,55357,176,5426,19451,6855,4174,0.0,0.0,24877,0.0,NHS Greater Glasgow & Clyde,41341,0.351373809996929,0.4493921274635547,0.1238325776324584
192,East Dunbartonshire,Scotland,Scotland,Scotland,County,2019-12-13 03:44:00,Amy,Callaghan,Female,SNP gain from LD,SNP,LD,66075,53031,80,149,7455,4839,19523,0.0,916.0,19672,626.0,NHS Greater Glasgow & Clyde,41341,0.14057815240142557,0.3709528389055458,0.09124851501951689
237,Glasgow Central,Scotland,Scotland,Scotland,Borough,2019-12-13 04:09:00,Alison,Thewliss,Female,SNP hold,SNP,Lab,69230,40105,153,6474,3698,13276,1952,0.0,1429.0,19750,0.0,NHS Greater Glasgow & Clyde,41341,0.09220795412043387,0.49245729958858,0.3310310435107842
473,"Ross, Skye and Lochaber",Scotland,Scotland,Scotland,County,2019-12-13 05:45:00,Ian,Blackford,Male,SNP hold,SNP,LD,54230,39869,80,9443,6900,2448,9820,710.0,0.0,19263,728.0,NHS Highland,2172,0.1730667937495297,0.48315734028944796,0.06140108856505054
12,Argyll and Bute,Scotland,Scotland,Scotland,County,2019-12-13 05:43:00,Brendan,O'Hara,Male,SNP hold,SNP,Con,66525,48050,142,4110,16930,3248,6832,0.0,0.0,21040,0.0,NHS Highland,2172,0.35234131113423517,0.43787721123829343,0.06759625390218522
104,"Caithness, Sutherland and Easter Ross",Scotland,Scotland,Scotland,County,2019-12-13 05:25:00,Jamie,Stone,Male,LD hold,LD,SNP,46930,31457,61,204,5176,1936,11705,1139.0,0.0,11501,0.0,NHS Highland,2172,0.1645420733064183,0.36561019804812916,0.06154433035572369
297,"Inverness, Nairn, Badenoch and Strathspey",Scotland,Scotland,Scotland,County,2019-12-13 05:00:00,Drew,Hendry,Male,SNP hold,SNP,Con,78059,54810,112,10440,15807,4123,5846,1078.0,1709.0,26247,0.0,NHS Highland,2172,0.28839627805145046,0.4788724685276409,0.0752234993614304
4,Airdrie and Shotts,Scotland,Scotland,Scotland,County,2019-12-13 02:59:00,Neil,Gray,Male,SNP hold,SNP,Lab,64011,39772,91,5201,7011,12728,1419,0.0,685.0,17929,0.0,NHS Lanarkshire,24351,0.17627979483053405,0.4507945288142412,0.3200241375842301
480,Rutherglen and Hamilton West,Scotland,Scotland,Scotland,Borough,2019-12-13 01:25:00,Margaret,Ferrier,Female,SNP gain from Lab Coop,SNP,Lab,80918,53794,125,5230,8054,18545,2791,0.0,0.0,23775,629.0,NHS Lanarkshire,24351,0.14971929955013571,0.44196378778302414,0.34474104918764176
195,"East Kilbride, Strathaven and Lesmahagow",Scotland,Scotland,Scotland,County,2019-12-13 02:34:00,Lisa,Cameron,Female,SNP hold,SNP,Lab,81224,56337,137,13322,11961,12791,3760,0.0,1153.0,26113,559.0,NHS Lanarkshire,24351,0.21231162468715054,0.4635142091343167,0.22704439356018247
145,"Coatbridge, Chryston and Bellshill",Scotland,Scotland,Scotland,Borough,2019-12-13 03:34:00,Steven,Bonnar,Male,SNP gain from Lab,SNP,Lab,72943,48221,121,5624,6113,17056,1564,0.0,808.0,22680,0.0,NHS Lanarkshire,24351,0.1267704941830323,0.4703345015657079,0.3537048174032061
378,Motherwell and Wishaw,Scotland,Scotland,Scotland,Borough,2019-12-13 03:43:00,Marion,Fellows,Female,SNP hold,SNP,Lab,68856,44420,93,6268,7150,14354,1675,0.0,0.0,20622,619.0,NHS Lanarkshire,24351,0.16096352994146781,0.46425033768572715,0.3231427285006754
317,Lanark and Hamilton East,Scotland,Scotland,Scotland,County,2019-12-13 02:23:00,Angela,Crawley,Female,SNP hold,SNP,Con,77659,53072,129,5187,17056,10736,3037,0.0,0.0,22243,0.0,NHS Lanarkshire,24351,0.32137473620741636,0.4191098884534218,0.20229122701236057
159,"Cumbernauld, Kilsyth and Kirkintilloch East",Scotland,Scotland,Scotland,County,2019-12-13 03:21:00,Stuart C.,McDonald,Male,SNP hold,SNP,Lab,66079,45686,143,12976,7380,11182,2966,0.0,0.0,24158,0.0,NHS Lanarkshire,24351,0.16153745129799063,0.5287834347502517,0.244757693823053
208,Edinburgh West,Scotland,Scotland,Scotland,Borough,2019-12-13 04:52:00,Christine,Jardine,Female,LD hold,LD,SNP,72507,54533,124,3769,9283,4460,21766,0.0,1027.0,17997,0.0,NHS Lothian,18577,0.17022720187776208,0.33002035464764456,0.08178534098619185
335,Linlithgow and East Falkirk,Scotland,Scotland,Scotland,County,2019-12-13 04:09:00,Martyn,Day,Male,SNP hold,SNP,Con,87044,57775,105,11266,14285,10517,4393,1257.0,1184.0,25551,588.0,NHS Lothian,18577,0.24725227174383385,0.4422501081782778,0.18203375162267416
198,East Lothian,Scotland,Scotland,Scotland,County,2019-12-13 02:57:00,Kenny,MacAskill,Male,SNP gain from Lab,SNP,Lab,81600,58513,114,3886,15523,17270,4071,0.0,0.0,21156,493.0,NHS Lothian,18577,0.2652914736896074,0.3615606788235093,0.295148086749953
204,Edinburgh East,Scotland,Scotland,Scotland,Borough,2019-12-13 04:34:00,Tommy,Sheppard,Male,SNP hold,SNP,Lab,69424,47815,142,10417,6549,12748,3289,0.0,2064.0,23165,0.0,NHS Lothian,18577,0.13696538743072256,0.48447140018822543,0.26661089616229217
205,Edinburgh North and Leith,Scotland,Scotland,Scotland,Borough,2019-12-13 04:43:00,Deidre,Brock,Female,SNP hold,SNP,Lab,81336,59344,105,12808,11000,13117,6635,558.0,1971.0,25925,138.0,NHS Lothian,18577,0.18535993529253167,0.4368596656780803,0.2210332973847398
206,Edinburgh South,Scotland,Scotland,Scotland,Borough,2019-12-13 04:22:00,Ian,Murray,Male,Lab hold,Lab,SNP,66188,49732,122,11095,8161,23745,3819,0.0,1357.0,12650,0.0,NHS Lothian,18577,0.164099573715113,0.25436338775838496,0.47745918121129255
207,Edinburgh South West,Scotland,Scotland,Scotland,Borough,2019-12-13 04:11:00,Joanna,Cherry,Female,SNP hold,SNP,Con,73501,52131,91,11982,12848,7478,4971,625.0,1265.0,24830,114.0,NHS Lothian,18577,0.24645604342905372,0.47630009015748787,0.14344631792983062
340,Livingston,Scotland,Scotland,Scotland,County,2019-12-13 03:57:00,Hannah,Bardell,Female,SNP hold,SNP,Con,82285,54592,146,13435,12182,11915,3457,0.0,1421.0,25617,0.0,NHS Lothian,18577,0.2231462485345838,0.4692445779601407,0.21825542203985931
364,Midlothian,Scotland,Scotland,Scotland,County,2019-12-13 02:41:00,Owen,Thompson,Male,SNP gain from Lab,SNP,Lab,70544,48221,140,5705,10467,14328,3393,0.0,0.0,20033,0.0,NHS Lothian,18577,0.21706310528607867,0.4154414051969059,0.2971319549573837
435,Orkney and Shetland,Scotland,Scotland,Scotland,County,2019-12-13 06:01:00,Alistair,Carmichael,Male,LD hold,LD,SNP,34211,23160,80,2507,2287,1550,10381,900.0,0.0,7874,168.0,NHS Orkney,39,0.09874784110535406,0.3399827288428325,0.06692573402417962
181,Dundee East,Scotland,Scotland,Scotland,Borough,2019-12-13 03:37:00,Stewart,Hosie,Male,SNP hold,SNP,Con,66210,45277,134,13375,10986,6045,3573,0.0,0.0,24361,312.0,NHS Tayside,8300,0.24263975086688605,0.5380435982949401,0.1335114959029971
182,Dundee West,Scotland,Scotland,Scotland,Borough,2019-12-13 03:31:00,Chris,Law,Male,SNP hold,SNP,Lab,64431,41579,92,12259,5149,10096,2468,1271.0,0.0,22355,240.0,NHS Tayside,8300,0.12383655210563024,0.537651218163015,0.24281488251280695
430,Ochil and South Perthshire,Scotland,Scotland,Scotland,County,2019-12-13 02:45:00,John,Nicolson,Male,SNP gain from Con,SNP,Con,78776,57813,131,4498,22384,4961,3204,0.0,0.0,26882,382.0,NHS Tayside,8300,0.3871793541245049,0.4649819244806531,0.08581114974140765
10,Angus,Scotland,Scotland,Scotland,County,2019-12-13 01:55:00,Dave,Doogan,Male,SNP gain from Con,SNP,Con,63952,43170,92,3795,17421,2051,2482,0.0,0.0,21216,0.0,NHS Tayside,8300,0.403544127866574,0.4914523974982627,0.04750984479962937
444,Perth and North Perthshire,Scotland,Scotland,Scotland,County,2019-12-13 02:39:00,Pete,Wishart,Male,SNP hold,SNP,Con,72600,54076,111,7550,19812,2471,3780,651.0,0.0,27362,0.0,NHS Tayside,8300,0.3663732524595014,0.505991567423626,0.045694947851172424
