,hb_name,Total_SNP,Total_CON,Total_LAB,Covid_Cases
0,NHS Greater Glasgow & Clyde,0.469436025520373,0.16397340613963207,0.2637665809069537,537433.0
1,NHS Ayrshire & Arran,0.4729740459793236,0.32045248820873323,0.15093350837166708,37552.0
2,NHS Dumfries & Galloway,0.39473265594241513,0.4502694319063053,0.08865403352488517,3410.0
3,NHS Lanarkshire,0.46152674171261815,0.18964143192832156,0.2853543196348102,170457.0
4,NHS Lothian,0.40800072929788506,0.20780431611748326,0.2394624743088245,167193.0
5,NHS Tayside,0.5050368931236178,0.3131347787446004,0.10592150135378128,41500.0
6,NHS Fife,0.4184290592059749,0.1661099911477434,0.1971970333782145,18834.0
7,NHS Forth Valley,0.5184345389521808,0.29535818309184086,0.09694724034951886,11244.0
8,NHS Grampian,0.44471846000325305,0.395545122449787,0.0675660824420501,39350.0
9,NHS Highland,0.4480899727877097,0.2572709632232211,0.06748533177178419,8688.0
10,NHS Borders,0.4078780876932387,0.4475711063431809,0.05102602189580239,3172.0
11,NHS Orkney,0.3399827288428325,0.09874784110535406,0.06692573402417962,39.0
