%YAML 1.1
%TAG !u! tag:unity3d.com,2011:
--- !u!114 &11400000
MonoBehaviour:
  m_ObjectHideFlags: 0
  m_CorrespondingSourceObject: {fileID: 0}
  m_PrefabInstance: {fileID: 0}
  m_PrefabAsset: {fileID: 0}
  m_GameObject: {fileID: 0}
  m_Enabled: 1
  m_EditorHideFlags: 0
  m_Script: {fileID: 11500000, guid: 752896e1cc7fe3841bf9b48ed6c4a517, type: 3}
  m_Name: Pez Trigger Clow
  m_EditorClassIdentifier: 
  Name: Pez Trigger Clow
  Descripcion: "El pez trigger clow, o pez gatillo payaso, es conocido por su apariencia
    distintiva y su comportamiento activo. Se encuentra en arrecifes de coral del
    Indo-Pac\xEDfico, donde se alimenta de una variedad de invertebrados y algas. "
  Habitat: {fileID: 21300000, guid: 4088d45253606444296caff65fbd8926, type: 3}
  Pez: {fileID: 21300000, guid: 113eba15e88a2ef4d939f5ed193608de, type: 3}
  PH: 8.1 - 8.4
  Temperature: "24-28\xB0C"
