%YAML 1.1
%TAG !u! tag:unity3d.com,2011:
--- !u!114 &11400000
MonoBehaviour:
  m_ObjectHideFlags: 0
  m_CorrespondingSourceObject: {fileID: 0}
  m_PrefabInstance: {fileID: 0}
  m_PrefabAsset: {fileID: 0}
  m_GameObject: {fileID: 0}
  m_Enabled: 1
  m_EditorHideFlags: 0
  m_Script: {fileID: 11500000, guid: b9c378e907cba92498a46373b6731b1f, type: 3}
  m_Name: Database
  m_EditorClassIdentifier: 
  objectsData:
  - <Name>k__BackingField: Tronco grande
    <ID>k__BackingField: 0
    <Size>k__BackingField: {x: 5, y: 7}
    <Prefab>k__BackingField: {fileID: 3964164815656787461, guid: e589e0529d177264ea3ea87bce415545, type: 3}
  - <Name>k__BackingField: Arquitectura Japonesa
    <ID>k__BackingField: 1
    <Size>k__BackingField: {x: 6, y: 6}
    <Prefab>k__BackingField: {fileID: 2729157208901808696, guid: 356339ba863ba6045adb87cde10d8531, type: 3}
  - <Name>k__BackingField: Piedra Grande 1
    <ID>k__BackingField: 2
    <Size>k__BackingField: {x: 3, y: 4}
    <Prefab>k__BackingField: {fileID: 537673131565469493, guid: 954f34ed85171224a8bea657f74baf1d, type: 3}
  - <Name>k__BackingField: Roca Mediana 1
    <ID>k__BackingField: 3
    <Size>k__BackingField: {x: 1, y: 2}
    <Prefab>k__BackingField: {fileID: 5147382982507551644, guid: 704fa4543e2f5c04ca52ca8854bc3e68, type: 3}
  - <Name>k__BackingField: "\xC1rbol Grande"
    <ID>k__BackingField: 4
    <Size>k__BackingField: {x: 1, y: 1}
    <Prefab>k__BackingField: {fileID: 6781710869556763405, guid: 771fae41d072a98449de08f5ec4ad758, type: 3}
  - <Name>k__BackingField: Flores
    <ID>k__BackingField: 5
    <Size>k__BackingField: {x: 1, y: 1}
    <Prefab>k__BackingField: {fileID: 2876663998655635831, guid: 9d0b2a60af87e044b9916216414845d1, type: 3}
  - <Name>k__BackingField: Planta 1
    <ID>k__BackingField: 6
    <Size>k__BackingField: {x: 3, y: 4}
    <Prefab>k__BackingField: {fileID: 5022244123563243468, guid: 049037e9b6bfbfa4b8551d8b20458d35, type: 3}
  - <Name>k__BackingField: Planta 2
    <ID>k__BackingField: 7
    <Size>k__BackingField: {x: 1, y: 1}
    <Prefab>k__BackingField: {fileID: 6861157307281220873, guid: eb5763e6ace3b42479d9030bd7c4ccf0, type: 3}
  - <Name>k__BackingField: Phormium Tenax 2 Grande
    <ID>k__BackingField: 8
    <Size>k__BackingField: {x: 1, y: 2}
    <Prefab>k__BackingField: {fileID: 2715724711214537799, guid: b1cbac68715bf1841afc964373925a61, type: 3}
  - <Name>k__BackingField: Helecho 2
    <ID>k__BackingField: 9
    <Size>k__BackingField: {x: 1, y: 1}
    <Prefab>k__BackingField: {fileID: 5586466127636432851, guid: 5677e8eabe4424e459b0eca285fad6cc, type: 3}
  - <Name>k__BackingField: Roca Gigante
    <ID>k__BackingField: 10
    <Size>k__BackingField: {x: 5, y: 7}
    <Prefab>k__BackingField: {fileID: 1550906608195685321, guid: ea2d82d76963fd0489e67108773868c5, type: 3}
