%YAML 1.1
%TAG !u! tag:unity3d.com,2011:
--- !u!114 &11400000
MonoBehaviour:
  m_ObjectHideFlags: 0
  m_CorrespondingSourceObject: {fileID: 0}
  m_PrefabInstance: {fileID: 0}
  m_PrefabAsset: {fileID: 0}
  m_GameObject: {fileID: 0}
  m_Enabled: 1
  m_EditorHideFlags: 0
  m_Script: {fileID: 11500000, guid: 752896e1cc7fe3841bf9b48ed6c4a517, type: 3}
  m_Name: PezSillaDoble
  m_EditorClassIdentifier: 
  Name: Pez Silla Doble
  Descripcion: "Tambi\xE9n llamado pez \xE1ngel de la silla, es reconocido por su
    distintivo patr\xF3n de coloraci\xF3n y su forma elegante. Se encuentra en arrecifes
    de coral en el Indo-Pac\xEDfico, donde se alimenta de algas y detritus. "
  Habitat: {fileID: 21300000, guid: 539791fc7c65cfb4ca2a0dae8a22a9f3, type: 3}
  Pez: {fileID: 21300000, guid: bb47ee55efb395d49844c5d1e7ca952b, type: 3}
  PH: 8.1 - 8.4
  Temperature: "24-28\xB0C"
