%YAML 1.1
%TAG !u! tag:unity3d.com,2011:
--- !u!114 &11400000
MonoBehaviour:
  m_ObjectHideFlags: 0
  m_CorrespondingSourceObject: {fileID: 0}
  m_PrefabInstance: {fileID: 0}
  m_PrefabAsset: {fileID: 0}
  m_GameObject: {fileID: 0}
  m_Enabled: 1
  m_EditorHideFlags: 0
  m_Script: {fileID: 11500000, guid: 752896e1cc7fe3841bf9b48ed6c4a517, type: 3}
  m_Name: Bandeja de Cobre
  m_EditorClassIdentifier: 
  Name: ' Bandeja de Cobre '
  Descripcion: "La bandeja de cobre, tambi\xE9n conocida como mariposa cobre, es
    apreciada por su coloraci\xF3n cobriza y su forma elegante. Se encuentra en arrecifes
    de coral del Indo-Pac\xEDfico, donde se alimenta de peque\xF1os invertebrados. "
  Habitat: {fileID: 21300000, guid: 93c9863c02295d449866d97a9a00a922, type: 3}
  Pez: {fileID: 21300000, guid: ed611e72b7de9384ba15a5b18f475aad, type: 3}
  PH: 8.0 - 8.4
  Temperature: "24-28\xB0C"
