%YAML 1.1
%TAG !u! tag:unity3d.com,2011:
--- !u!114 &11400000
MonoBehaviour:
  m_ObjectHideFlags: 0
  m_CorrespondingSourceObject: {fileID: 0}
  m_PrefabInstance: {fileID: 0}
  m_PrefabAsset: {fileID: 0}
  m_GameObject: {fileID: 0}
  m_Enabled: 1
  m_EditorHideFlags: 0
  m_Script: {fileID: 11500000, guid: 752896e1cc7fe3841bf9b48ed6c4a517, type: 3}
  m_Name: Pez Caranx
  m_EditorClassIdentifier: 
  Name: Pez Caranx
  Descripcion: "Los peces caranx, tambi\xE9n conocidos como jureles, son peces pel\xE1gicos
    que habitan en aguas tropicales y subtropicales en todo el mundo. Son depredadores
    voraces que se alimentan de una variedad de peces peque\xF1os y crust\xE1ceos. "
  Habitat: {fileID: 21300000, guid: fdfdb3e333c3823488758005c5f6a865, type: 3}
  Pez: {fileID: 21300000, guid: bf6ed988d3e05bc45882fd9f8b89471c, type: 3}
  PH: 7.9 - 8.4
  PH2: 0
  Temperature: "22-28\xB0C"
  Temperature2: 0
