%YAML 1.1
%TAG !u! tag:unity3d.com,2011:
--- !u!114 &11400000
MonoBehaviour:
  m_ObjectHideFlags: 0
  m_CorrespondingSourceObject: {fileID: 0}
  m_PrefabInstance: {fileID: 0}
  m_PrefabAsset: {fileID: 0}
  m_GameObject: {fileID: 0}
  m_Enabled: 1
  m_EditorHideFlags: 0
  m_Script: {fileID: 11500000, guid: 752896e1cc7fe3841bf9b48ed6c4a517, type: 3}
  m_Name: "Cirujano de L\xEDnea"
  m_EditorClassIdentifier: 
  Name: "Cirujano de L\xEDnea"
  Descripcion: "El cirujano de l\xEDnea, tambi\xE9n conocido como cirujano de l\xEDnea
    punteada, es reconocido por su patr\xF3n de l\xEDneas negras y puntos blancos.
    Se encuentra en arrecifes de coral del Indo-Pac\xEDfico, donde se alimenta de
    algas y detritus."
  Habitat: {fileID: 21300000, guid: db1d096e095b8544c93fcbe1d2255ce5, type: 3}
  Pez: {fileID: 21300000, guid: 080345c1a6040fe49b3b778ea8272bb3, type: 3}
  PH: 8.0 - 8.4
  Temperature: "24-28\xB0C"
