%YAML 1.1
%TAG !u! tag:unity3d.com,2011:
--- !u!1001 &5240431931264236676
PrefabInstance:
  m_ObjectHideFlags: 0
  serializedVersion: 2
  m_Modification:
    serializedVersion: 3
    m_TransformParent: {fileID: 0}
    m_Modifications:
    - target: {fileID: 1007697558418042952, guid: 1d123e31fbace1c4f8899e04d171053d, type: 3}
      propertyPath: m_Size.y
      value: 9.177315
      objectReference: {fileID: 0}
    - target: {fileID: 1007697558418042952, guid: 1d123e31fbace1c4f8899e04d171053d, type: 3}
      propertyPath: m_Size.z
      value: 16.677519
      objectReference: {fileID: 0}
    - target: {fileID: 1007697558418042952, guid: 1d123e31fbace1c4f8899e04d171053d, type: 3}
      propertyPath: m_Center.y
      value: 1.9241247
      objectReference: {fileID: 0}
    - target: {fileID: 1007697558418042952, guid: 1d123e31fbace1c4f8899e04d171053d, type: 3}
      propertyPath: m_Center.z
      value: -8.861136
      objectReference: {fileID: 0}
    - target: {fileID: 5729466254066270218, guid: 1d123e31fbace1c4f8899e04d171053d, type: 3}
      propertyPath: m_LocalPosition.y
      value: -2.56
      objectReference: {fileID: 0}
    - target: {fileID: 5729466254066270218, guid: 1d123e31fbace1c4f8899e04d171053d, type: 3}
      propertyPath: m_LocalPosition.z
      value: 8.11
      objectReference: {fileID: 0}
    - target: {fileID: 7359786026640925233, guid: 1d123e31fbace1c4f8899e04d171053d, type: 3}
      propertyPath: m_LocalPosition.x
      value: 0
      objectReference: {fileID: 0}
    - target: {fileID: 7359786026640925233, guid: 1d123e31fbace1c4f8899e04d171053d, type: 3}
      propertyPath: m_LocalPosition.y
      value: 0
      objectReference: {fileID: 0}
    - target: {fileID: 7359786026640925233, guid: 1d123e31fbace1c4f8899e04d171053d, type: 3}
      propertyPath: m_LocalPosition.z
      value: 0
      objectReference: {fileID: 0}
    - target: {fileID: 7359786026640925233, guid: 1d123e31fbace1c4f8899e04d171053d, type: 3}
      propertyPath: m_LocalRotation.w
      value: 1
      objectReference: {fileID: 0}
    - target: {fileID: 7359786026640925233, guid: 1d123e31fbace1c4f8899e04d171053d, type: 3}
      propertyPath: m_LocalRotation.x
      value: 0
      objectReference: {fileID: 0}
    - target: {fileID: 7359786026640925233, guid: 1d123e31fbace1c4f8899e04d171053d, type: 3}
      propertyPath: m_LocalRotation.y
      value: 0
      objectReference: {fileID: 0}
    - target: {fileID: 7359786026640925233, guid: 1d123e31fbace1c4f8899e04d171053d, type: 3}
      propertyPath: m_LocalRotation.z
      value: 0
      objectReference: {fileID: 0}
    - target: {fileID: 7359786026640925233, guid: 1d123e31fbace1c4f8899e04d171053d, type: 3}
      propertyPath: m_LocalEulerAnglesHint.x
      value: 0
      objectReference: {fileID: 0}
    - target: {fileID: 7359786026640925233, guid: 1d123e31fbace1c4f8899e04d171053d, type: 3}
      propertyPath: m_LocalEulerAnglesHint.y
      value: 0
      objectReference: {fileID: 0}
    - target: {fileID: 7359786026640925233, guid: 1d123e31fbace1c4f8899e04d171053d, type: 3}
      propertyPath: m_LocalEulerAnglesHint.z
      value: 0
      objectReference: {fileID: 0}
    - target: {fileID: 7883804899318741131, guid: 1d123e31fbace1c4f8899e04d171053d, type: 3}
      propertyPath: m_Name
      value: Fish - Aleta de Hilo
      objectReference: {fileID: 0}
    m_RemovedComponents: []
    m_RemovedGameObjects:
    - {fileID: 6240652154994055266, guid: 1d123e31fbace1c4f8899e04d171053d, type: 3}
    m_AddedGameObjects:
    - targetCorrespondingSourceObject: {fileID: 7359786026640925233, guid: 1d123e31fbace1c4f8899e04d171053d, type: 3}
      insertIndex: -1
      addedObject: {fileID: 232613546310218859}
    m_AddedComponents: []
  m_SourcePrefab: {fileID: 100100000, guid: 1d123e31fbace1c4f8899e04d171053d, type: 3}
--- !u!4 &3358268559012568757 stripped
Transform:
  m_CorrespondingSourceObject: {fileID: 7359786026640925233, guid: 1d123e31fbace1c4f8899e04d171053d, type: 3}
  m_PrefabInstance: {fileID: 5240431931264236676}
  m_PrefabAsset: {fileID: 0}
--- !u!1001 &7601839810316121768
PrefabInstance:
  m_ObjectHideFlags: 0
  serializedVersion: 2
  m_Modification:
    serializedVersion: 3
    m_TransformParent: {fileID: 3358268559012568757}
    m_Modifications:
    - target: {fileID: 6993687124971313273, guid: d687c496053a5df46a647ab575f62266, type: 3}
      propertyPath: m_Name
      value: Threadfin
      objectReference: {fileID: 0}
    - target: {fileID: 6993687124971313273, guid: d687c496053a5df46a647ab575f62266, type: 3}
      propertyPath: m_IsActive
      value: 1
      objectReference: {fileID: 0}
    - target: {fileID: 7657599095650058947, guid: d687c496053a5df46a647ab575f62266, type: 3}
      propertyPath: m_LocalScale.x
      value: 5.4812994
      objectReference: {fileID: 0}
    - target: {fileID: 7657599095650058947, guid: d687c496053a5df46a647ab575f62266, type: 3}
      propertyPath: m_LocalScale.y
      value: 5.4813
      objectReference: {fileID: 0}
    - target: {fileID: 7657599095650058947, guid: d687c496053a5df46a647ab575f62266, type: 3}
      propertyPath: m_LocalScale.z
      value: 5.4812994
      objectReference: {fileID: 0}
    - target: {fileID: 7657599095650058947, guid: d687c496053a5df46a647ab575f62266, type: 3}
      propertyPath: m_LocalPosition.x
      value: 5.89
      objectReference: {fileID: 0}
    - target: {fileID: 7657599095650058947, guid: d687c496053a5df46a647ab575f62266, type: 3}
      propertyPath: m_LocalPosition.y
      value: 1.33
      objectReference: {fileID: 0}
    - target: {fileID: 7657599095650058947, guid: d687c496053a5df46a647ab575f62266, type: 3}
      propertyPath: m_LocalPosition.z
      value: -0.94
      objectReference: {fileID: 0}
    - target: {fileID: 7657599095650058947, guid: d687c496053a5df46a647ab575f62266, type: 3}
      propertyPath: m_LocalRotation.w
      value: 0.7208747
      objectReference: {fileID: 0}
    - target: {fileID: 7657599095650058947, guid: d687c496053a5df46a647ab575f62266, type: 3}
      propertyPath: m_LocalRotation.x
      value: -0
      objectReference: {fileID: 0}
    - target: {fileID: 7657599095650058947, guid: d687c496053a5df46a647ab575f62266, type: 3}
      propertyPath: m_LocalRotation.y
      value: 0.69306546
      objectReference: {fileID: 0}
    - target: {fileID: 7657599095650058947, guid: d687c496053a5df46a647ab575f62266, type: 3}
      propertyPath: m_LocalRotation.z
      value: -0
      objectReference: {fileID: 0}
    - target: {fileID: 7657599095650058947, guid: d687c496053a5df46a647ab575f62266, type: 3}
      propertyPath: m_LocalEulerAnglesHint.x
      value: 0
      objectReference: {fileID: 0}
    - target: {fileID: 7657599095650058947, guid: d687c496053a5df46a647ab575f62266, type: 3}
      propertyPath: m_LocalEulerAnglesHint.y
      value: 87.747
      objectReference: {fileID: 0}
    - target: {fileID: 7657599095650058947, guid: d687c496053a5df46a647ab575f62266, type: 3}
      propertyPath: m_LocalEulerAnglesHint.z
      value: 0
      objectReference: {fileID: 0}
    m_RemovedComponents: []
    m_RemovedGameObjects: []
    m_AddedGameObjects: []
    m_AddedComponents: []
  m_SourcePrefab: {fileID: 100100000, guid: d687c496053a5df46a647ab575f62266, type: 3}
--- !u!4 &232613546310218859 stripped
Transform:
  m_CorrespondingSourceObject: {fileID: 7657599095650058947, guid: d687c496053a5df46a647ab575f62266, type: 3}
  m_PrefabInstance: {fileID: 7601839810316121768}
  m_PrefabAsset: {fileID: 0}
