%YAML 1.1
%TAG !u! tag:unity3d.com,2011:
--- !u!1001 &1573062286496107108
PrefabInstance:
  m_ObjectHideFlags: 0
  serializedVersion: 2
  m_Modification:
    serializedVersion: 3
    m_TransformParent: {fileID: 0}
    m_Modifications:
    - target: {fileID: 90013618514600958, guid: 85d44c8ea7bb2094093c4202c6c68393, type: 3}
      propertyPath: m_AnchorMax.x
      value: 0
      objectReference: {fileID: 0}
    - target: {fileID: 90013618514600958, guid: 85d44c8ea7bb2094093c4202c6c68393, type: 3}
      propertyPath: m_AnchorMax.y
      value: 0
      objectReference: {fileID: 0}
    - target: {fileID: 90013618514600958, guid: 85d44c8ea7bb2094093c4202c6c68393, type: 3}
      propertyPath: m_AnchorMin.y
      value: 0
      objectReference: {fileID: 0}
    - target: {fileID: 433473066140602274, guid: 85d44c8ea7bb2094093c4202c6c68393, type: 3}
      propertyPath: m_SizeDelta.y
      value: 0
      objectReference: {fileID: 0}
    - target: {fileID: 569438865828466913, guid: 85d44c8ea7bb2094093c4202c6c68393, type: 3}
      propertyPath: m_AnchorMax.y
      value: 0
      objectReference: {fileID: 0}
    - target: {fileID: 569438865828466913, guid: 85d44c8ea7bb2094093c4202c6c68393, type: 3}
      propertyPath: m_AnchorMin.y
      value: 0
      objectReference: {fileID: 0}
    - target: {fileID: 569438865828466913, guid: 85d44c8ea7bb2094093c4202c6c68393, type: 3}
      propertyPath: m_AnchoredPosition.x
      value: 0
      objectReference: {fileID: 0}
    - target: {fileID: 569438865828466913, guid: 85d44c8ea7bb2094093c4202c6c68393, type: 3}
      propertyPath: m_AnchoredPosition.y
      value: 0
      objectReference: {fileID: 0}
    - target: {fileID: 813493409672348070, guid: 85d44c8ea7bb2094093c4202c6c68393, type: 3}
      propertyPath: m_Name
      value: NEWEDUCATIONALMENU
      objectReference: {fileID: 0}
    - target: {fileID: 813493409672348070, guid: 85d44c8ea7bb2094093c4202c6c68393, type: 3}
      propertyPath: m_IsActive
      value: 1
      objectReference: {fileID: 0}
    - target: {fileID: 2279967481940239095, guid: 85d44c8ea7bb2094093c4202c6c68393, type: 3}
      propertyPath: m_SizeDelta.y
      value: -882.9348
      objectReference: {fileID: 0}
    - target: {fileID: 2279967481940239095, guid: 85d44c8ea7bb2094093c4202c6c68393, type: 3}
      propertyPath: m_AnchoredPosition.y
      value: 50.366066
      objectReference: {fileID: 0}
    - target: {fileID: 4904705471012266731, guid: 85d44c8ea7bb2094093c4202c6c68393, type: 3}
      propertyPath: m_Pivot.x
      value: 0.5
      objectReference: {fileID: 0}
    - target: {fileID: 4904705471012266731, guid: 85d44c8ea7bb2094093c4202c6c68393, type: 3}
      propertyPath: m_Pivot.y
      value: 0.5
      objectReference: {fileID: 0}
    - target: {fileID: 4904705471012266731, guid: 85d44c8ea7bb2094093c4202c6c68393, type: 3}
      propertyPath: m_AnchorMax.x
      value: 0
      objectReference: {fileID: 0}
    - target: {fileID: 4904705471012266731, guid: 85d44c8ea7bb2094093c4202c6c68393, type: 3}
      propertyPath: m_AnchorMax.y
      value: 0
      objectReference: {fileID: 0}
    - target: {fileID: 4904705471012266731, guid: 85d44c8ea7bb2094093c4202c6c68393, type: 3}
      propertyPath: m_AnchorMin.x
      value: 0
      objectReference: {fileID: 0}
    - target: {fileID: 4904705471012266731, guid: 85d44c8ea7bb2094093c4202c6c68393, type: 3}
      propertyPath: m_AnchorMin.y
      value: 0
      objectReference: {fileID: 0}
    - target: {fileID: 4904705471012266731, guid: 85d44c8ea7bb2094093c4202c6c68393, type: 3}
      propertyPath: m_SizeDelta.x
      value: 1920
      objectReference: {fileID: 0}
    - target: {fileID: 4904705471012266731, guid: 85d44c8ea7bb2094093c4202c6c68393, type: 3}
      propertyPath: m_SizeDelta.y
      value: 1080
      objectReference: {fileID: 0}
    - target: {fileID: 4904705471012266731, guid: 85d44c8ea7bb2094093c4202c6c68393, type: 3}
      propertyPath: m_LocalScale.x
      value: 1
      objectReference: {fileID: 0}
    - target: {fileID: 4904705471012266731, guid: 85d44c8ea7bb2094093c4202c6c68393, type: 3}
      propertyPath: m_LocalScale.y
      value: 1
      objectReference: {fileID: 0}
    - target: {fileID: 4904705471012266731, guid: 85d44c8ea7bb2094093c4202c6c68393, type: 3}
      propertyPath: m_LocalScale.z
      value: 1
      objectReference: {fileID: 0}
    - target: {fileID: 4904705471012266731, guid: 85d44c8ea7bb2094093c4202c6c68393, type: 3}
      propertyPath: m_LocalPosition.x
      value: 0
      objectReference: {fileID: 0}
    - target: {fileID: 4904705471012266731, guid: 85d44c8ea7bb2094093c4202c6c68393, type: 3}
      propertyPath: m_LocalPosition.y
      value: 0
      objectReference: {fileID: 0}
    - target: {fileID: 4904705471012266731, guid: 85d44c8ea7bb2094093c4202c6c68393, type: 3}
      propertyPath: m_LocalPosition.z
      value: 66.800385
      objectReference: {fileID: 0}
    - target: {fileID: 4904705471012266731, guid: 85d44c8ea7bb2094093c4202c6c68393, type: 3}
      propertyPath: m_LocalRotation.w
      value: 1
      objectReference: {fileID: 0}
    - target: {fileID: 4904705471012266731, guid: 85d44c8ea7bb2094093c4202c6c68393, type: 3}
      propertyPath: m_LocalRotation.x
      value: -0
      objectReference: {fileID: 0}
    - target: {fileID: 4904705471012266731, guid: 85d44c8ea7bb2094093c4202c6c68393, type: 3}
      propertyPath: m_LocalRotation.y
      value: -0
      objectReference: {fileID: 0}
    - target: {fileID: 4904705471012266731, guid: 85d44c8ea7bb2094093c4202c6c68393, type: 3}
      propertyPath: m_LocalRotation.z
      value: -0
      objectReference: {fileID: 0}
    - target: {fileID: 4904705471012266731, guid: 85d44c8ea7bb2094093c4202c6c68393, type: 3}
      propertyPath: m_AnchoredPosition.x
      value: -570.6533
      objectReference: {fileID: 0}
    - target: {fileID: 4904705471012266731, guid: 85d44c8ea7bb2094093c4202c6c68393, type: 3}
      propertyPath: m_AnchoredPosition.y
      value: -6.984314
      objectReference: {fileID: 0}
    - target: {fileID: 4904705471012266731, guid: 85d44c8ea7bb2094093c4202c6c68393, type: 3}
      propertyPath: m_LocalEulerAnglesHint.x
      value: 0
      objectReference: {fileID: 0}
    - target: {fileID: 4904705471012266731, guid: 85d44c8ea7bb2094093c4202c6c68393, type: 3}
      propertyPath: m_LocalEulerAnglesHint.y
      value: 0
      objectReference: {fileID: 0}
    - target: {fileID: 4904705471012266731, guid: 85d44c8ea7bb2094093c4202c6c68393, type: 3}
      propertyPath: m_LocalEulerAnglesHint.z
      value: 0
      objectReference: {fileID: 0}
    - target: {fileID: 8637347937273731060, guid: 85d44c8ea7bb2094093c4202c6c68393, type: 3}
      propertyPath: m_Size
      value: 0.5400888
      objectReference: {fileID: 0}
    - target: {fileID: 8637347937273731060, guid: 85d44c8ea7bb2094093c4202c6c68393, type: 3}
      propertyPath: m_Value
      value: 1
      objectReference: {fileID: 0}
    - target: {fileID: 8771910416338767744, guid: 85d44c8ea7bb2094093c4202c6c68393, type: 3}
      propertyPath: m_AnchorMax.y
      value: 0
      objectReference: {fileID: 0}
    - target: {fileID: 8771910416338767744, guid: 85d44c8ea7bb2094093c4202c6c68393, type: 3}
      propertyPath: m_AnchorMin.y
      value: 0
      objectReference: {fileID: 0}
    - target: {fileID: 8771910416338767744, guid: 85d44c8ea7bb2094093c4202c6c68393, type: 3}
      propertyPath: m_AnchoredPosition.x
      value: 0
      objectReference: {fileID: 0}
    - target: {fileID: 8771910416338767744, guid: 85d44c8ea7bb2094093c4202c6c68393, type: 3}
      propertyPath: m_AnchoredPosition.y
      value: 0
      objectReference: {fileID: 0}
    m_RemovedComponents: []
    m_RemovedGameObjects: []
    m_AddedGameObjects: []
    m_AddedComponents: []
  m_SourcePrefab: {fileID: 100100000, guid: 85d44c8ea7bb2094093c4202c6c68393, type: 3}
