%YAML 1.1
%TAG !u! tag:unity3d.com,2011:
--- !u!114 &11400000
MonoBehaviour:
  m_ObjectHideFlags: 0
  m_CorrespondingSourceObject: {fileID: 0}
  m_PrefabInstance: {fileID: 0}
  m_PrefabAsset: {fileID: 0}
  m_GameObject: {fileID: 0}
  m_Enabled: 1
  m_EditorHideFlags: 0
  m_Script: {fileID: 11500000, guid: 752896e1cc7fe3841bf9b48ed6c4a517, type: 3}
  m_Name: JyKii
  m_EditorClassIdentifier: 
  Name: JyKii
  Descripcion: "Abramites hypselonotus, com\xFAnmente denominado como JyKii. Es un
    pez que vive en peque\xF1os grupos a media profundidad y proximo a la superficie."
  Habitat: {fileID: 21300000, guid: 64ff5a46ceedaa14fa5892ccf932231e, type: 3}
  Pez: {fileID: 21300000, guid: cc33a462cc561fa4faed9067df352919, type: 3}
  PH: 6
  PH2: 8
  Temperature: 23
  Temperature2: 27
