%YAML 1.1
%TAG !u! tag:unity3d.com,2011:
--- !u!1001 &4819406889045155789
PrefabInstance:
  m_ObjectHideFlags: 0
  serializedVersion: 2
  m_Modification:
    serializedVersion: 3
    m_TransformParent: {fileID: 0}
    m_Modifications:
    - target: {fileID: 100000, guid: c292a97ca5b44af428ac393c78fd8b14, type: 3}
      propertyPath: m_Name
      value: WaterPlane 2
      objectReference: {fileID: 0}
    - target: {fileID: 100000, guid: c292a97ca5b44af428ac393c78fd8b14, type: 3}
      propertyPath: m_Layer
      value: 4
      objectReference: {fileID: 0}
    - target: {fileID: 100000, guid: c292a97ca5b44af428ac393c78fd8b14, type: 3}
      propertyPath: m_IsActive
      value: 1
      objectReference: {fileID: 0}
    - target: {fileID: 100000, guid: c292a97ca5b44af428ac393c78fd8b14, type: 3}
      propertyPath: m_StaticEditorFlags
      value: 0
      objectReference: {fileID: 0}
    - target: {fileID: 400000, guid: c292a97ca5b44af428ac393c78fd8b14, type: 3}
      propertyPath: m_RootOrder
      value: 4595
      objectReference: {fileID: 0}
    - target: {fileID: 400000, guid: c292a97ca5b44af428ac393c78fd8b14, type: 3}
      propertyPath: m_LocalPosition.x
      value: 512
      objectReference: {fileID: 0}
    - target: {fileID: 400000, guid: c292a97ca5b44af428ac393c78fd8b14, type: 3}
      propertyPath: m_LocalPosition.y
      value: 16
      objectReference: {fileID: 0}
    - target: {fileID: 400000, guid: c292a97ca5b44af428ac393c78fd8b14, type: 3}
      propertyPath: m_LocalPosition.z
      value: 427.5
      objectReference: {fileID: 0}
    - target: {fileID: 400000, guid: c292a97ca5b44af428ac393c78fd8b14, type: 3}
      propertyPath: m_LocalRotation.w
      value: 1
      objectReference: {fileID: 0}
    - target: {fileID: 400000, guid: c292a97ca5b44af428ac393c78fd8b14, type: 3}
      propertyPath: m_LocalRotation.x
      value: 0.000000021855694
      objectReference: {fileID: 0}
    - target: {fileID: 400000, guid: c292a97ca5b44af428ac393c78fd8b14, type: 3}
      propertyPath: m_LocalRotation.y
      value: 0
      objectReference: {fileID: 0}
    - target: {fileID: 400000, guid: c292a97ca5b44af428ac393c78fd8b14, type: 3}
      propertyPath: m_LocalRotation.z
      value: -0
      objectReference: {fileID: 0}
    - target: {fileID: 2300000, guid: c292a97ca5b44af428ac393c78fd8b14, type: 3}
      propertyPath: m_CastShadows
      value: 0
      objectReference: {fileID: 0}
    - target: {fileID: 2300000, guid: c292a97ca5b44af428ac393c78fd8b14, type: 3}
      propertyPath: m_ReceiveShadows
      value: 0
      objectReference: {fileID: 0}
    - target: {fileID: 2300000, guid: c292a97ca5b44af428ac393c78fd8b14, type: 3}
      propertyPath: m_UseLightProbes
      value: 0
      objectReference: {fileID: 0}
    - target: {fileID: 2300000, guid: c292a97ca5b44af428ac393c78fd8b14, type: 3}
      propertyPath: m_LightProbeUsage
      value: 0
      objectReference: {fileID: 0}
    - target: {fileID: 2300000, guid: c292a97ca5b44af428ac393c78fd8b14, type: 3}
      propertyPath: m_ReflectionProbeUsage
      value: 2
      objectReference: {fileID: 0}
    - target: {fileID: 2300000, guid: c292a97ca5b44af428ac393c78fd8b14, type: 3}
      propertyPath: m_Materials.Array.data[0]
      value: 
      objectReference: {fileID: 2100000, guid: a56782aef2f1bd34285fe34f78a0b957, type: 2}
    m_RemovedComponents: []
    m_RemovedGameObjects: []
    m_AddedGameObjects: []
    m_AddedComponents: []
  m_SourcePrefab: {fileID: 100100000, guid: c292a97ca5b44af428ac393c78fd8b14, type: 3}
