%YAML 1.1
%TAG !u! tag:unity3d.com,2011:
--- !u!1001 &4378535199842261736
PrefabInstance:
  m_ObjectHideFlags: 0
  serializedVersion: 2
  m_Modification:
    serializedVersion: 3
    m_TransformParent: {fileID: 0}
    m_Modifications:
    - target: {fileID: -8679921383154817045, guid: 2d24b6b0d9608a44b99cbfc20601d680, type: 3}
      propertyPath: m_LocalScale.x
      value: 1.7030901
      objectReference: {fileID: 0}
    - target: {fileID: -8679921383154817045, guid: 2d24b6b0d9608a44b99cbfc20601d680, type: 3}
      propertyPath: m_LocalScale.y
      value: 1.7030901
      objectReference: {fileID: 0}
    - target: {fileID: -8679921383154817045, guid: 2d24b6b0d9608a44b99cbfc20601d680, type: 3}
      propertyPath: m_LocalScale.z
      value: 1.7030901
      objectReference: {fileID: 0}
    - target: {fileID: -8679921383154817045, guid: 2d24b6b0d9608a44b99cbfc20601d680, type: 3}
      propertyPath: m_LocalPosition.x
      value: 179.2
      objectReference: {fileID: 0}
    - target: {fileID: -8679921383154817045, guid: 2d24b6b0d9608a44b99cbfc20601d680, type: 3}
      propertyPath: m_LocalPosition.y
      value: 1.092
      objectReference: {fileID: 0}
    - target: {fileID: -8679921383154817045, guid: 2d24b6b0d9608a44b99cbfc20601d680, type: 3}
      propertyPath: m_LocalPosition.z
      value: -98.9
      objectReference: {fileID: 0}
    - target: {fileID: -8679921383154817045, guid: 2d24b6b0d9608a44b99cbfc20601d680, type: 3}
      propertyPath: m_LocalRotation.w
      value: 0.99996287
      objectReference: {fileID: 0}
    - target: {fileID: -8679921383154817045, guid: 2d24b6b0d9608a44b99cbfc20601d680, type: 3}
      propertyPath: m_LocalRotation.x
      value: -0
      objectReference: {fileID: 0}
    - target: {fileID: -8679921383154817045, guid: 2d24b6b0d9608a44b99cbfc20601d680, type: 3}
      propertyPath: m_LocalRotation.y
      value: -0.008621521
      objectReference: {fileID: 0}
    - target: {fileID: -8679921383154817045, guid: 2d24b6b0d9608a44b99cbfc20601d680, type: 3}
      propertyPath: m_LocalRotation.z
      value: -0
      objectReference: {fileID: 0}
    - target: {fileID: -8679921383154817045, guid: 2d24b6b0d9608a44b99cbfc20601d680, type: 3}
      propertyPath: m_LocalEulerAnglesHint.x
      value: 0
      objectReference: {fileID: 0}
    - target: {fileID: -8679921383154817045, guid: 2d24b6b0d9608a44b99cbfc20601d680, type: 3}
      propertyPath: m_LocalEulerAnglesHint.y
      value: -0.988
      objectReference: {fileID: 0}
    - target: {fileID: -8679921383154817045, guid: 2d24b6b0d9608a44b99cbfc20601d680, type: 3}
      propertyPath: m_LocalEulerAnglesHint.z
      value: 0
      objectReference: {fileID: 0}
    - target: {fileID: -8191740002585371210, guid: 2d24b6b0d9608a44b99cbfc20601d680, type: 3}
      propertyPath: m_LocalPosition.x
      value: -0.00031679682
      objectReference: {fileID: 0}
    - target: {fileID: -8191740002585371210, guid: 2d24b6b0d9608a44b99cbfc20601d680, type: 3}
      propertyPath: m_LocalPosition.y
      value: 0.03668725
      objectReference: {fileID: 0}
    - target: {fileID: -8191740002585371210, guid: 2d24b6b0d9608a44b99cbfc20601d680, type: 3}
      propertyPath: m_LocalPosition.z
      value: -0.000000016763806
      objectReference: {fileID: 0}
    - target: {fileID: -8191740002585371210, guid: 2d24b6b0d9608a44b99cbfc20601d680, type: 3}
      propertyPath: m_LocalRotation.w
      value: 0.99464595
      objectReference: {fileID: 0}
    - target: {fileID: -8191740002585371210, guid: 2d24b6b0d9608a44b99cbfc20601d680, type: 3}
      propertyPath: m_LocalRotation.x
      value: -0.009716699
      objectReference: {fileID: 0}
    - target: {fileID: -8191740002585371210, guid: 2d24b6b0d9608a44b99cbfc20601d680, type: 3}
      propertyPath: m_LocalRotation.y
      value: 0.035749048
      objectReference: {fileID: 0}
    - target: {fileID: -8191740002585371210, guid: 2d24b6b0d9608a44b99cbfc20601d680, type: 3}
      propertyPath: m_LocalRotation.z
      value: -0.0964737
      objectReference: {fileID: 0}
    - target: {fileID: -8068027186691560116, guid: 2d24b6b0d9608a44b99cbfc20601d680, type: 3}
      propertyPath: m_LocalPosition.x
      value: 0.0002310535
      objectReference: {fileID: 0}
    - target: {fileID: -8068027186691560116, guid: 2d24b6b0d9608a44b99cbfc20601d680, type: 3}
      propertyPath: m_LocalPosition.y
      value: 0.02502315
      objectReference: {fileID: 0}
    - target: {fileID: -8068027186691560116, guid: 2d24b6b0d9608a44b99cbfc20601d680, type: 3}
      propertyPath: m_LocalPosition.z
      value: -0.000000010360964
      objectReference: {fileID: 0}
    - target: {fileID: -8068027186691560116, guid: 2d24b6b0d9608a44b99cbfc20601d680, type: 3}
      propertyPath: m_LocalRotation.w
      value: 0.9896555
      objectReference: {fileID: 0}
    - target: {fileID: -8068027186691560116, guid: 2d24b6b0d9608a44b99cbfc20601d680, type: 3}
      propertyPath: m_LocalRotation.x
      value: 0.14342499
      objectReference: {fileID: 0}
    - target: {fileID: -8068027186691560116, guid: 2d24b6b0d9608a44b99cbfc20601d680, type: 3}
      propertyPath: m_LocalRotation.y
      value: 0.0010106562
      objectReference: {fileID: 0}
    - target: {fileID: -8068027186691560116, guid: 2d24b6b0d9608a44b99cbfc20601d680, type: 3}
      propertyPath: m_LocalRotation.z
      value: -0.0032264586
      objectReference: {fileID: 0}
    - target: {fileID: -8021001004253913084, guid: 2d24b6b0d9608a44b99cbfc20601d680, type: 3}
      propertyPath: m_LocalPosition.x
      value: -2.0715812e-13
      objectReference: {fileID: 0}
    - target: {fileID: -8021001004253913084, guid: 2d24b6b0d9608a44b99cbfc20601d680, type: 3}
      propertyPath: m_LocalPosition.y
      value: 0.12731634
      objectReference: {fileID: 0}
    - target: {fileID: -8021001004253913084, guid: 2d24b6b0d9608a44b99cbfc20601d680, type: 3}
      propertyPath: m_LocalPosition.z
      value: 0.0000000018626451
      objectReference: {fileID: 0}
    - target: {fileID: -8021001004253913084, guid: 2d24b6b0d9608a44b99cbfc20601d680, type: 3}
      propertyPath: m_LocalRotation.w
      value: 0.99985296
      objectReference: {fileID: 0}
    - target: {fileID: -8021001004253913084, guid: 2d24b6b0d9608a44b99cbfc20601d680, type: 3}
      propertyPath: m_LocalRotation.x
      value: 0.010091289
      objectReference: {fileID: 0}
    - target: {fileID: -8021001004253913084, guid: 2d24b6b0d9608a44b99cbfc20601d680, type: 3}
      propertyPath: m_LocalRotation.y
      value: -0.0016310958
      objectReference: {fileID: 0}
    - target: {fileID: -8021001004253913084, guid: 2d24b6b0d9608a44b99cbfc20601d680, type: 3}
      propertyPath: m_LocalRotation.z
      value: -0.013774021
      objectReference: {fileID: 0}
    - target: {fileID: -7219772299731422950, guid: 2d24b6b0d9608a44b99cbfc20601d680, type: 3}
      propertyPath: m_LocalPosition.x
      value: 0.0021633003
      objectReference: {fileID: 0}
    - target: {fileID: -7219772299731422950, guid: 2d24b6b0d9608a44b99cbfc20601d680, type: 3}
      propertyPath: m_LocalPosition.y
      value: 0.035749752
      objectReference: {fileID: 0}
    - target: {fileID: -7219772299731422950, guid: 2d24b6b0d9608a44b99cbfc20601d680, type: 3}
      propertyPath: m_LocalPosition.z
      value: -0.0000000055879354
      objectReference: {fileID: 0}
    - target: {fileID: -7219772299731422950, guid: 2d24b6b0d9608a44b99cbfc20601d680, type: 3}
      propertyPath: m_LocalRotation.w
      value: -0.9984598
      objectReference: {fileID: 0}
    - target: {fileID: -7219772299731422950, guid: 2d24b6b0d9608a44b99cbfc20601d680, type: 3}
      propertyPath: m_LocalRotation.x
      value: 0.010374506
      objectReference: {fileID: 0}
    - target: {fileID: -7219772299731422950, guid: 2d24b6b0d9608a44b99cbfc20601d680, type: 3}
      propertyPath: m_LocalRotation.y
      value: 0.035867773
      objectReference: {fileID: 0}
    - target: {fileID: -7219772299731422950, guid: 2d24b6b0d9608a44b99cbfc20601d680, type: 3}
      propertyPath: m_LocalRotation.z
      value: -0.041036185
      objectReference: {fileID: 0}
    - target: {fileID: -6874584590210671055, guid: 2d24b6b0d9608a44b99cbfc20601d680, type: 3}
      propertyPath: m_LocalPosition.x
      value: 0.000000004656613
      objectReference: {fileID: 0}
    - target: {fileID: -6874584590210671055, guid: 2d24b6b0d9608a44b99cbfc20601d680, type: 3}
      propertyPath: m_LocalPosition.y
      value: 0.36682835
      objectReference: {fileID: 0}
    - target: {fileID: -6874584590210671055, guid: 2d24b6b0d9608a44b99cbfc20601d680, type: 3}
      propertyPath: m_LocalPosition.z
      value: 0.0000000055879354
      objectReference: {fileID: 0}
    - target: {fileID: -6874584590210671055, guid: 2d24b6b0d9608a44b99cbfc20601d680, type: 3}
      propertyPath: m_LocalRotation.w
      value: 0.8696516
      objectReference: {fileID: 0}
    - target: {fileID: -6874584590210671055, guid: 2d24b6b0d9608a44b99cbfc20601d680, type: 3}
      propertyPath: m_LocalRotation.x
      value: 0.4812341
      objectReference: {fileID: 0}
    - target: {fileID: -6874584590210671055, guid: 2d24b6b0d9608a44b99cbfc20601d680, type: 3}
      propertyPath: m_LocalRotation.y
      value: 0.10980131
      objectReference: {fileID: 0}
    - target: {fileID: -6874584590210671055, guid: 2d24b6b0d9608a44b99cbfc20601d680, type: 3}
      propertyPath: m_LocalRotation.z
      value: 0.00796711
      objectReference: {fileID: 0}
    - target: {fileID: -6857788192064577062, guid: 2d24b6b0d9608a44b99cbfc20601d680, type: 3}
      propertyPath: m_LocalPosition.x
      value: 0.007215564
      objectReference: {fileID: 0}
    - target: {fileID: -6857788192064577062, guid: 2d24b6b0d9608a44b99cbfc20601d680, type: 3}
      propertyPath: m_LocalPosition.y
      value: 0.03605642
      objectReference: {fileID: 0}
    - target: {fileID: -6857788192064577062, guid: 2d24b6b0d9608a44b99cbfc20601d680, type: 3}
      propertyPath: m_LocalPosition.z
      value: 0.00000005029142
      objectReference: {fileID: 0}
    - target: {fileID: -6857788192064577062, guid: 2d24b6b0d9608a44b99cbfc20601d680, type: 3}
      propertyPath: m_LocalRotation.w
      value: 0.986313
      objectReference: {fileID: 0}
    - target: {fileID: -6857788192064577062, guid: 2d24b6b0d9608a44b99cbfc20601d680, type: 3}
      propertyPath: m_LocalRotation.x
      value: -0.015408939
      objectReference: {fileID: 0}
    - target: {fileID: -6857788192064577062, guid: 2d24b6b0d9608a44b99cbfc20601d680, type: 3}
      propertyPath: m_LocalRotation.y
      value: 0.02993925
      objectReference: {fileID: 0}
    - target: {fileID: -6857788192064577062, guid: 2d24b6b0d9608a44b99cbfc20601d680, type: 3}
      propertyPath: m_LocalRotation.z
      value: 0.16140921
      objectReference: {fileID: 0}
    - target: {fileID: -6803169544883306252, guid: 2d24b6b0d9608a44b99cbfc20601d680, type: 3}
      propertyPath: m_LocalPosition.y
      value: 0.1426041
      objectReference: {fileID: 0}
    - target: {fileID: -6803169544883306252, guid: 2d24b6b0d9608a44b99cbfc20601d680, type: 3}
      propertyPath: m_LocalPosition.z
      value: -0.0034369696
      objectReference: {fileID: 0}
    - target: {fileID: -6803169544883306252, guid: 2d24b6b0d9608a44b99cbfc20601d680, type: 3}
      propertyPath: m_LocalRotation.w
      value: 0.4236284
      objectReference: {fileID: 0}
    - target: {fileID: -6803169544883306252, guid: 2d24b6b0d9608a44b99cbfc20601d680, type: 3}
      propertyPath: m_LocalRotation.x
      value: 0.6302266
      objectReference: {fileID: 0}
    - target: {fileID: -6803169544883306252, guid: 2d24b6b0d9608a44b99cbfc20601d680, type: 3}
      propertyPath: m_LocalRotation.y
      value: -0.30267227
      objectReference: {fileID: 0}
    - target: {fileID: -6803169544883306252, guid: 2d24b6b0d9608a44b99cbfc20601d680, type: 3}
      propertyPath: m_LocalRotation.z
      value: 0.57597125
      objectReference: {fileID: 0}
    - target: {fileID: -6768225281626788248, guid: 2d24b6b0d9608a44b99cbfc20601d680, type: 3}
      propertyPath: m_LocalPosition.x
      value: -0.00012066269
      objectReference: {fileID: 0}
    - target: {fileID: -6768225281626788248, guid: 2d24b6b0d9608a44b99cbfc20601d680, type: 3}
      propertyPath: m_LocalPosition.y
      value: 0.025731511
      objectReference: {fileID: 0}
    - target: {fileID: -6768225281626788248, guid: 2d24b6b0d9608a44b99cbfc20601d680, type: 3}
      propertyPath: m_LocalPosition.z
      value: 0.000000040861778
      objectReference: {fileID: 0}
    - target: {fileID: -6768225281626788248, guid: 2d24b6b0d9608a44b99cbfc20601d680, type: 3}
      propertyPath: m_LocalRotation.w
      value: -0.9896178
      objectReference: {fileID: 0}
    - target: {fileID: -6768225281626788248, guid: 2d24b6b0d9608a44b99cbfc20601d680, type: 3}
      propertyPath: m_LocalRotation.x
      value: -0.14371224
      objectReference: {fileID: 0}
    - target: {fileID: -6768225281626788248, guid: 2d24b6b0d9608a44b99cbfc20601d680, type: 3}
      propertyPath: m_LocalRotation.y
      value: 0.0018523035
      objectReference: {fileID: 0}
    - target: {fileID: -6768225281626788248, guid: 2d24b6b0d9608a44b99cbfc20601d680, type: 3}
      propertyPath: m_LocalRotation.z
      value: -0.00011929868
      objectReference: {fileID: 0}
    - target: {fileID: -6024149945523619558, guid: 2d24b6b0d9608a44b99cbfc20601d680, type: 3}
      propertyPath: m_LocalPosition.x
      value: -0.00025180404
      objectReference: {fileID: 0}
    - target: {fileID: -6024149945523619558, guid: 2d24b6b0d9608a44b99cbfc20601d680, type: 3}
      propertyPath: m_LocalPosition.y
      value: 0.03199289
      objectReference: {fileID: 0}
    - target: {fileID: -6024149945523619558, guid: 2d24b6b0d9608a44b99cbfc20601d680, type: 3}
      propertyPath: m_LocalPosition.z
      value: 0.000000023050234
      objectReference: {fileID: 0}
    - target: {fileID: -6024149945523619558, guid: 2d24b6b0d9608a44b99cbfc20601d680, type: 3}
      propertyPath: m_LocalRotation.w
      value: -0.98706174
      objectReference: {fileID: 0}
    - target: {fileID: -6024149945523619558, guid: 2d24b6b0d9608a44b99cbfc20601d680, type: 3}
      propertyPath: m_LocalRotation.x
      value: -0.16021217
      objectReference: {fileID: 0}
    - target: {fileID: -6024149945523619558, guid: 2d24b6b0d9608a44b99cbfc20601d680, type: 3}
      propertyPath: m_LocalRotation.y
      value: 0.0024923978
      objectReference: {fileID: 0}
    - target: {fileID: -6024149945523619558, guid: 2d24b6b0d9608a44b99cbfc20601d680, type: 3}
      propertyPath: m_LocalRotation.z
      value: -0.005920305
      objectReference: {fileID: 0}
    - target: {fileID: -5665043316445423941, guid: 2d24b6b0d9608a44b99cbfc20601d680, type: 3}
      propertyPath: m_LocalPosition.x
      value: 0.00010812201
      objectReference: {fileID: 0}
    - target: {fileID: -5665043316445423941, guid: 2d24b6b0d9608a44b99cbfc20601d680, type: 3}
      propertyPath: m_LocalPosition.y
      value: 0.026703909
      objectReference: {fileID: 0}
    - target: {fileID: -5665043316445423941, guid: 2d24b6b0d9608a44b99cbfc20601d680, type: 3}
      propertyPath: m_LocalPosition.z
      value: 0.000000037252903
      objectReference: {fileID: 0}
    - target: {fileID: -5665043316445423941, guid: 2d24b6b0d9608a44b99cbfc20601d680, type: 3}
      propertyPath: m_LocalRotation.w
      value: 0.9878911
      objectReference: {fileID: 0}
    - target: {fileID: -5665043316445423941, guid: 2d24b6b0d9608a44b99cbfc20601d680, type: 3}
      propertyPath: m_LocalRotation.x
      value: 0.1551411
      objectReference: {fileID: 0}
    - target: {fileID: -5665043316445423941, guid: 2d24b6b0d9608a44b99cbfc20601d680, type: 3}
      propertyPath: m_LocalRotation.y
      value: 0.0014336406
      objectReference: {fileID: 0}
    - target: {fileID: -5665043316445423941, guid: 2d24b6b0d9608a44b99cbfc20601d680, type: 3}
      propertyPath: m_LocalRotation.z
      value: 0.000668317
      objectReference: {fileID: 0}
    - target: {fileID: -5480977901411583989, guid: 2d24b6b0d9608a44b99cbfc20601d680, type: 3}
      propertyPath: m_LocalPosition.x
      value: 0.00024130306
      objectReference: {fileID: 0}
    - target: {fileID: -5480977901411583989, guid: 2d24b6b0d9608a44b99cbfc20601d680, type: 3}
      propertyPath: m_LocalPosition.z
      value: 0.000000057625584
      objectReference: {fileID: 0}
    - target: {fileID: -5480977901411583989, guid: 2d24b6b0d9608a44b99cbfc20601d680, type: 3}
      propertyPath: m_LocalRotation.w
      value: -0.9884575
      objectReference: {fileID: 0}
    - target: {fileID: -5480977901411583989, guid: 2d24b6b0d9608a44b99cbfc20601d680, type: 3}
      propertyPath: m_LocalRotation.x
      value: -0.15125825
      objectReference: {fileID: 0}
    - target: {fileID: -5480977901411583989, guid: 2d24b6b0d9608a44b99cbfc20601d680, type: 3}
      propertyPath: m_LocalRotation.y
      value: 0.0020142493
      objectReference: {fileID: 0}
    - target: {fileID: -5480977901411583989, guid: 2d24b6b0d9608a44b99cbfc20601d680, type: 3}
      propertyPath: m_LocalRotation.z
      value: 0.008290513
      objectReference: {fileID: 0}
    - target: {fileID: -3746190272939815206, guid: 2d24b6b0d9608a44b99cbfc20601d680, type: 3}
      propertyPath: m_LocalPosition.x
      value: 0.000000005122274
      objectReference: {fileID: 0}
    - target: {fileID: -3746190272939815206, guid: 2d24b6b0d9608a44b99cbfc20601d680, type: 3}
      propertyPath: m_LocalPosition.y
      value: 0.41065052
      objectReference: {fileID: 0}
    - target: {fileID: -3746190272939815206, guid: 2d24b6b0d9608a44b99cbfc20601d680, type: 3}
      propertyPath: m_LocalPosition.z
      value: 0
      objectReference: {fileID: 0}
    - target: {fileID: -3746190272939815206, guid: 2d24b6b0d9608a44b99cbfc20601d680, type: 3}
      propertyPath: m_LocalRotation.w
      value: 0.9920199
      objectReference: {fileID: 0}
    - target: {fileID: -3746190272939815206, guid: 2d24b6b0d9608a44b99cbfc20601d680, type: 3}
      propertyPath: m_LocalRotation.x
      value: -0.07859653
      objectReference: {fileID: 0}
    - target: {fileID: -3746190272939815206, guid: 2d24b6b0d9608a44b99cbfc20601d680, type: 3}
      propertyPath: m_LocalRotation.y
      value: -0.095673636
      objectReference: {fileID: 0}
    - target: {fileID: -3746190272939815206, guid: 2d24b6b0d9608a44b99cbfc20601d680, type: 3}
      propertyPath: m_LocalRotation.z
      value: 0.02378632
      objectReference: {fileID: 0}
    - target: {fileID: -3480699329000672020, guid: 2d24b6b0d9608a44b99cbfc20601d680, type: 3}
      propertyPath: m_LocalPosition.x
      value: -6.82121e-13
      objectReference: {fileID: 0}
    - target: {fileID: -3480699329000672020, guid: 2d24b6b0d9608a44b99cbfc20601d680, type: 3}
      propertyPath: m_LocalPosition.y
      value: 0.10871273
      objectReference: {fileID: 0}
    - target: {fileID: -3480699329000672020, guid: 2d24b6b0d9608a44b99cbfc20601d680, type: 3}
      propertyPath: m_LocalRotation.w
      value: 0.9996121
      objectReference: {fileID: 0}
    - target: {fileID: -3480699329000672020, guid: 2d24b6b0d9608a44b99cbfc20601d680, type: 3}
      propertyPath: m_LocalRotation.x
      value: -0.014497202
      objectReference: {fileID: 0}
    - target: {fileID: -3480699329000672020, guid: 2d24b6b0d9608a44b99cbfc20601d680, type: 3}
      propertyPath: m_LocalRotation.y
      value: -0.011872885
      objectReference: {fileID: 0}
    - target: {fileID: -3480699329000672020, guid: 2d24b6b0d9608a44b99cbfc20601d680, type: 3}
      propertyPath: m_LocalRotation.z
      value: -0.02060532
      objectReference: {fileID: 0}
    - target: {fileID: -3432401550182100168, guid: 2d24b6b0d9608a44b99cbfc20601d680, type: 3}
      propertyPath: m_LocalPosition.x
      value: -0.002684089
      objectReference: {fileID: 0}
    - target: {fileID: -3432401550182100168, guid: 2d24b6b0d9608a44b99cbfc20601d680, type: 3}
      propertyPath: m_LocalPosition.y
      value: 0.12583476
      objectReference: {fileID: 0}
    - target: {fileID: -3432401550182100168, guid: 2d24b6b0d9608a44b99cbfc20601d680, type: 3}
      propertyPath: m_LocalPosition.z
      value: 0.01717006
      objectReference: {fileID: 0}
    - target: {fileID: -3432401550182100168, guid: 2d24b6b0d9608a44b99cbfc20601d680, type: 3}
      propertyPath: m_LocalRotation.w
      value: 0.86452675
      objectReference: {fileID: 0}
    - target: {fileID: -3432401550182100168, guid: 2d24b6b0d9608a44b99cbfc20601d680, type: 3}
      propertyPath: m_LocalRotation.x
      value: 0.49195895
      objectReference: {fileID: 0}
    - target: {fileID: -3432401550182100168, guid: 2d24b6b0d9608a44b99cbfc20601d680, type: 3}
      propertyPath: m_LocalRotation.y
      value: -0.0993976
      objectReference: {fileID: 0}
    - target: {fileID: -3432401550182100168, guid: 2d24b6b0d9608a44b99cbfc20601d680, type: 3}
      propertyPath: m_LocalRotation.z
      value: 0.026271043
      objectReference: {fileID: 0}
    - target: {fileID: -3321919801592875672, guid: 2d24b6b0d9608a44b99cbfc20601d680, type: 3}
      propertyPath: m_LocalPosition.x
      value: -8.548328e-14
      objectReference: {fileID: 0}
    - target: {fileID: -3321919801592875672, guid: 2d24b6b0d9608a44b99cbfc20601d680, type: 3}
      propertyPath: m_LocalPosition.y
      value: 0.06116712
      objectReference: {fileID: 0}
    - target: {fileID: -3321919801592875672, guid: 2d24b6b0d9608a44b99cbfc20601d680, type: 3}
      propertyPath: m_LocalRotation.w
      value: 0.9977499
      objectReference: {fileID: 0}
    - target: {fileID: -3321919801592875672, guid: 2d24b6b0d9608a44b99cbfc20601d680, type: 3}
      propertyPath: m_LocalRotation.x
      value: -0.06595837
      objectReference: {fileID: 0}
    - target: {fileID: -3321919801592875672, guid: 2d24b6b0d9608a44b99cbfc20601d680, type: 3}
      propertyPath: m_LocalRotation.y
      value: -0.011932401
      objectReference: {fileID: 0}
    - target: {fileID: -3321919801592875672, guid: 2d24b6b0d9608a44b99cbfc20601d680, type: 3}
      propertyPath: m_LocalRotation.z
      value: 0.0014930663
      objectReference: {fileID: 0}
    - target: {fileID: -2899422035419094908, guid: 2d24b6b0d9608a44b99cbfc20601d680, type: 3}
      propertyPath: m_LocalPosition.x
      value: -0.000031009098
      objectReference: {fileID: 0}
    - target: {fileID: -2899422035419094908, guid: 2d24b6b0d9608a44b99cbfc20601d680, type: 3}
      propertyPath: m_LocalPosition.y
      value: 0.025133988
      objectReference: {fileID: 0}
    - target: {fileID: -2899422035419094908, guid: 2d24b6b0d9608a44b99cbfc20601d680, type: 3}
      propertyPath: m_LocalPosition.z
      value: -0.0000000023283064
      objectReference: {fileID: 0}
    - target: {fileID: -2899422035419094908, guid: 2d24b6b0d9608a44b99cbfc20601d680, type: 3}
      propertyPath: m_LocalRotation.w
      value: -0.9833338
      objectReference: {fileID: 0}
    - target: {fileID: -2899422035419094908, guid: 2d24b6b0d9608a44b99cbfc20601d680, type: 3}
      propertyPath: m_LocalRotation.x
      value: -0.18171485
      objectReference: {fileID: 0}
    - target: {fileID: -2899422035419094908, guid: 2d24b6b0d9608a44b99cbfc20601d680, type: 3}
      propertyPath: m_LocalRotation.y
      value: 0.0014981625
      objectReference: {fileID: 0}
    - target: {fileID: -2899422035419094908, guid: 2d24b6b0d9608a44b99cbfc20601d680, type: 3}
      propertyPath: m_LocalRotation.z
      value: 0.0056689526
      objectReference: {fileID: 0}
    - target: {fileID: -2770666803903516498, guid: 2d24b6b0d9608a44b99cbfc20601d680, type: 3}
      propertyPath: m_LocalPosition.x
      value: 0.000000007450581
      objectReference: {fileID: 0}
    - target: {fileID: -2770666803903516498, guid: 2d24b6b0d9608a44b99cbfc20601d680, type: 3}
      propertyPath: m_LocalPosition.y
      value: 0.17808026
      objectReference: {fileID: 0}
    - target: {fileID: -2770666803903516498, guid: 2d24b6b0d9608a44b99cbfc20601d680, type: 3}
      propertyPath: m_LocalPosition.z
      value: -0.000000014901161
      objectReference: {fileID: 0}
    - target: {fileID: -2770666803903516498, guid: 2d24b6b0d9608a44b99cbfc20601d680, type: 3}
      propertyPath: m_LocalRotation.w
      value: 0.9309154
      objectReference: {fileID: 0}
    - target: {fileID: -2770666803903516498, guid: 2d24b6b0d9608a44b99cbfc20601d680, type: 3}
      propertyPath: m_LocalRotation.x
      value: 0.36486697
      objectReference: {fileID: 0}
    - target: {fileID: -2770666803903516498, guid: 2d24b6b0d9608a44b99cbfc20601d680, type: 3}
      propertyPath: m_LocalRotation.y
      value: 0.015603632
      objectReference: {fileID: 0}
    - target: {fileID: -2770666803903516498, guid: 2d24b6b0d9608a44b99cbfc20601d680, type: 3}
      propertyPath: m_LocalRotation.z
      value: -0.0050201416
      objectReference: {fileID: 0}
    - target: {fileID: -2594260964506120097, guid: 2d24b6b0d9608a44b99cbfc20601d680, type: 3}
      propertyPath: m_LocalPosition.x
      value: -0.012978245
      objectReference: {fileID: 0}
    - target: {fileID: -2594260964506120097, guid: 2d24b6b0d9608a44b99cbfc20601d680, type: 3}
      propertyPath: m_LocalPosition.y
      value: 0.11329348
      objectReference: {fileID: 0}
    - target: {fileID: -2594260964506120097, guid: 2d24b6b0d9608a44b99cbfc20601d680, type: 3}
      propertyPath: m_LocalPosition.z
      value: -0.0013837833
      objectReference: {fileID: 0}
    - target: {fileID: -2594260964506120097, guid: 2d24b6b0d9608a44b99cbfc20601d680, type: 3}
      propertyPath: m_LocalRotation.w
      value: 0.98379964
      objectReference: {fileID: 0}
    - target: {fileID: -2594260964506120097, guid: 2d24b6b0d9608a44b99cbfc20601d680, type: 3}
      propertyPath: m_LocalRotation.x
      value: 0.1790257
      objectReference: {fileID: 0}
    - target: {fileID: -2594260964506120097, guid: 2d24b6b0d9608a44b99cbfc20601d680, type: 3}
      propertyPath: m_LocalRotation.y
      value: -0.005780487
      objectReference: {fileID: 0}
    - target: {fileID: -2594260964506120097, guid: 2d24b6b0d9608a44b99cbfc20601d680, type: 3}
      propertyPath: m_LocalRotation.z
      value: -0.007395832
      objectReference: {fileID: 0}
    - target: {fileID: -2389525917609993686, guid: 2d24b6b0d9608a44b99cbfc20601d680, type: 3}
      propertyPath: m_LocalPosition.x
      value: -0.00022778004
      objectReference: {fileID: 0}
    - target: {fileID: -2389525917609993686, guid: 2d24b6b0d9608a44b99cbfc20601d680, type: 3}
      propertyPath: m_LocalPosition.y
      value: 0.03486527
      objectReference: {fileID: 0}
    - target: {fileID: -2389525917609993686, guid: 2d24b6b0d9608a44b99cbfc20601d680, type: 3}
      propertyPath: m_LocalPosition.z
      value: -0.000000013737008
      objectReference: {fileID: 0}
    - target: {fileID: -2389525917609993686, guid: 2d24b6b0d9608a44b99cbfc20601d680, type: 3}
      propertyPath: m_LocalRotation.w
      value: 0.9884485
      objectReference: {fileID: 0}
    - target: {fileID: -2389525917609993686, guid: 2d24b6b0d9608a44b99cbfc20601d680, type: 3}
      propertyPath: m_LocalRotation.x
      value: 0.1512428
      objectReference: {fileID: 0}
    - target: {fileID: -2389525917609993686, guid: 2d24b6b0d9608a44b99cbfc20601d680, type: 3}
      propertyPath: m_LocalRotation.y
      value: 0.00108248
      objectReference: {fileID: 0}
    - target: {fileID: -2389525917609993686, guid: 2d24b6b0d9608a44b99cbfc20601d680, type: 3}
      propertyPath: m_LocalRotation.z
      value: 0.009699225
      objectReference: {fileID: 0}
    - target: {fileID: -2072040086291044643, guid: 2d24b6b0d9608a44b99cbfc20601d680, type: 3}
      propertyPath: m_LocalPosition.x
      value: -0.0000000018626451
      objectReference: {fileID: 0}
    - target: {fileID: -2072040086291044643, guid: 2d24b6b0d9608a44b99cbfc20601d680, type: 3}
      propertyPath: m_LocalPosition.y
      value: 0.4106477
      objectReference: {fileID: 0}
    - target: {fileID: -2072040086291044643, guid: 2d24b6b0d9608a44b99cbfc20601d680, type: 3}
      propertyPath: m_LocalPosition.z
      value: -9.313226e-10
      objectReference: {fileID: 0}
    - target: {fileID: -2072040086291044643, guid: 2d24b6b0d9608a44b99cbfc20601d680, type: 3}
      propertyPath: m_LocalRotation.w
      value: 0.9820618
      objectReference: {fileID: 0}
    - target: {fileID: -2072040086291044643, guid: 2d24b6b0d9608a44b99cbfc20601d680, type: 3}
      propertyPath: m_LocalRotation.x
      value: -0.17598324
      objectReference: {fileID: 0}
    - target: {fileID: -2072040086291044643, guid: 2d24b6b0d9608a44b99cbfc20601d680, type: 3}
      propertyPath: m_LocalRotation.y
      value: 0.06267314
      objectReference: {fileID: 0}
    - target: {fileID: -2072040086291044643, guid: 2d24b6b0d9608a44b99cbfc20601d680, type: 3}
      propertyPath: m_LocalRotation.z
      value: -0.025626114
      objectReference: {fileID: 0}
    - target: {fileID: -1864740628597940677, guid: 2d24b6b0d9608a44b99cbfc20601d680, type: 3}
      propertyPath: m_LocalPosition.x
      value: 0.00017053969
      objectReference: {fileID: 0}
    - target: {fileID: -1864740628597940677, guid: 2d24b6b0d9608a44b99cbfc20601d680, type: 3}
      propertyPath: m_LocalPosition.y
      value: 0.033127733
      objectReference: {fileID: 0}
    - target: {fileID: -1864740628597940677, guid: 2d24b6b0d9608a44b99cbfc20601d680, type: 3}
      propertyPath: m_LocalPosition.z
      value: 0.000000011175871
      objectReference: {fileID: 0}
    - target: {fileID: -1864740628597940677, guid: 2d24b6b0d9608a44b99cbfc20601d680, type: 3}
      propertyPath: m_LocalRotation.w
      value: 0.9975378
      objectReference: {fileID: 0}
    - target: {fileID: -1864740628597940677, guid: 2d24b6b0d9608a44b99cbfc20601d680, type: 3}
      propertyPath: m_LocalRotation.x
      value: 0.07005163
      objectReference: {fileID: 0}
    - target: {fileID: -1864740628597940677, guid: 2d24b6b0d9608a44b99cbfc20601d680, type: 3}
      propertyPath: m_LocalRotation.y
      value: 0.0005793571
      objectReference: {fileID: 0}
    - target: {fileID: -1864740628597940677, guid: 2d24b6b0d9608a44b99cbfc20601d680, type: 3}
      propertyPath: m_LocalRotation.z
      value: 0.0033012326
      objectReference: {fileID: 0}
    - target: {fileID: -1812909498023395591, guid: 2d24b6b0d9608a44b99cbfc20601d680, type: 3}
      propertyPath: m_LocalPosition.x
      value: 0.00009128498
      objectReference: {fileID: 0}
    - target: {fileID: -1812909498023395591, guid: 2d24b6b0d9608a44b99cbfc20601d680, type: 3}
      propertyPath: m_LocalPosition.y
      value: 0.24938291
      objectReference: {fileID: 0}
    - target: {fileID: -1812909498023395591, guid: 2d24b6b0d9608a44b99cbfc20601d680, type: 3}
      propertyPath: m_LocalPosition.z
      value: -0.009080699
      objectReference: {fileID: 0}
    - target: {fileID: -1812909498023395591, guid: 2d24b6b0d9608a44b99cbfc20601d680, type: 3}
      propertyPath: m_LocalRotation.w
      value: 0.99413526
      objectReference: {fileID: 0}
    - target: {fileID: -1812909498023395591, guid: 2d24b6b0d9608a44b99cbfc20601d680, type: 3}
      propertyPath: m_LocalRotation.x
      value: 0.000680089
      objectReference: {fileID: 0}
    - target: {fileID: -1812909498023395591, guid: 2d24b6b0d9608a44b99cbfc20601d680, type: 3}
      propertyPath: m_LocalRotation.y
      value: 0.107421756
      objectReference: {fileID: 0}
    - target: {fileID: -1812909498023395591, guid: 2d24b6b0d9608a44b99cbfc20601d680, type: 3}
      propertyPath: m_LocalRotation.z
      value: -0.012462724
      objectReference: {fileID: 0}
    - target: {fileID: -1070350730909333850, guid: 2d24b6b0d9608a44b99cbfc20601d680, type: 3}
      propertyPath: m_LocalPosition.x
      value: -0.03502076
      objectReference: {fileID: 0}
    - target: {fileID: -1070350730909333850, guid: 2d24b6b0d9608a44b99cbfc20601d680, type: 3}
      propertyPath: m_LocalPosition.y
      value: 0.106751844
      objectReference: {fileID: 0}
    - target: {fileID: -1070350730909333850, guid: 2d24b6b0d9608a44b99cbfc20601d680, type: 3}
      propertyPath: m_LocalPosition.z
      value: 0.0005310867
      objectReference: {fileID: 0}
    - target: {fileID: -1070350730909333850, guid: 2d24b6b0d9608a44b99cbfc20601d680, type: 3}
      propertyPath: m_LocalRotation.w
      value: -0.9974313
      objectReference: {fileID: 0}
    - target: {fileID: -1070350730909333850, guid: 2d24b6b0d9608a44b99cbfc20601d680, type: 3}
      propertyPath: m_LocalRotation.x
      value: -0.052296866
      objectReference: {fileID: 0}
    - target: {fileID: -1070350730909333850, guid: 2d24b6b0d9608a44b99cbfc20601d680, type: 3}
      propertyPath: m_LocalRotation.y
      value: 0.002230763
      objectReference: {fileID: 0}
    - target: {fileID: -1070350730909333850, guid: 2d24b6b0d9608a44b99cbfc20601d680, type: 3}
      propertyPath: m_LocalRotation.z
      value: -0.048896614
      objectReference: {fileID: 0}
    - target: {fileID: -870823317777057635, guid: 2d24b6b0d9608a44b99cbfc20601d680, type: 3}
      propertyPath: m_LocalPosition.x
      value: -0.0077019203
      objectReference: {fileID: 0}
    - target: {fileID: -870823317777057635, guid: 2d24b6b0d9608a44b99cbfc20601d680, type: 3}
      propertyPath: m_LocalPosition.y
      value: 0.036793165
      objectReference: {fileID: 0}
    - target: {fileID: -870823317777057635, guid: 2d24b6b0d9608a44b99cbfc20601d680, type: 3}
      propertyPath: m_LocalPosition.z
      value: -0.0000000018626451
      objectReference: {fileID: 0}
    - target: {fileID: -870823317777057635, guid: 2d24b6b0d9608a44b99cbfc20601d680, type: 3}
      propertyPath: m_LocalRotation.w
      value: -0.9850699
      objectReference: {fileID: 0}
    - target: {fileID: -870823317777057635, guid: 2d24b6b0d9608a44b99cbfc20601d680, type: 3}
      propertyPath: m_LocalRotation.x
      value: 0.015087492
      objectReference: {fileID: 0}
    - target: {fileID: -870823317777057635, guid: 2d24b6b0d9608a44b99cbfc20601d680, type: 3}
      propertyPath: m_LocalRotation.y
      value: 0.024335556
      objectReference: {fileID: 0}
    - target: {fileID: -870823317777057635, guid: 2d24b6b0d9608a44b99cbfc20601d680, type: 3}
      propertyPath: m_LocalRotation.z
      value: 0.16975765
      objectReference: {fileID: 0}
    - target: {fileID: -104578136787704052, guid: 2d24b6b0d9608a44b99cbfc20601d680, type: 3}
      propertyPath: m_LocalPosition.x
      value: 0.013237286
      objectReference: {fileID: 0}
    - target: {fileID: -104578136787704052, guid: 2d24b6b0d9608a44b99cbfc20601d680, type: 3}
      propertyPath: m_LocalPosition.y
      value: 0.12402051
      objectReference: {fileID: 0}
    - target: {fileID: -104578136787704052, guid: 2d24b6b0d9608a44b99cbfc20601d680, type: 3}
      propertyPath: m_LocalPosition.z
      value: 0.0008643437
      objectReference: {fileID: 0}
    - target: {fileID: -104578136787704052, guid: 2d24b6b0d9608a44b99cbfc20601d680, type: 3}
      propertyPath: m_LocalRotation.w
      value: -0.98551387
      objectReference: {fileID: 0}
    - target: {fileID: -104578136787704052, guid: 2d24b6b0d9608a44b99cbfc20601d680, type: 3}
      propertyPath: m_LocalRotation.x
      value: -0.16944352
      objectReference: {fileID: 0}
    - target: {fileID: -104578136787704052, guid: 2d24b6b0d9608a44b99cbfc20601d680, type: 3}
      propertyPath: m_LocalRotation.y
      value: -0.0048249657
      objectReference: {fileID: 0}
    - target: {fileID: -104578136787704052, guid: 2d24b6b0d9608a44b99cbfc20601d680, type: 3}
      propertyPath: m_LocalRotation.z
      value: -0.0053040977
      objectReference: {fileID: 0}
    - target: {fileID: 366175167995203695, guid: 2d24b6b0d9608a44b99cbfc20601d680, type: 3}
      propertyPath: m_LocalPosition.x
      value: -4.00864e-14
      objectReference: {fileID: 0}
    - target: {fileID: 366175167995203695, guid: 2d24b6b0d9608a44b99cbfc20601d680, type: 3}
      propertyPath: m_LocalPosition.y
      value: 0.14550434
      objectReference: {fileID: 0}
    - target: {fileID: 366175167995203695, guid: 2d24b6b0d9608a44b99cbfc20601d680, type: 3}
      propertyPath: m_LocalPosition.z
      value: -0.0000000055879354
      objectReference: {fileID: 0}
    - target: {fileID: 366175167995203695, guid: 2d24b6b0d9608a44b99cbfc20601d680, type: 3}
      propertyPath: m_LocalRotation.w
      value: 0.9998542
      objectReference: {fileID: 0}
    - target: {fileID: 366175167995203695, guid: 2d24b6b0d9608a44b99cbfc20601d680, type: 3}
      propertyPath: m_LocalRotation.x
      value: 0.009868026
      objectReference: {fileID: 0}
    - target: {fileID: 366175167995203695, guid: 2d24b6b0d9608a44b99cbfc20601d680, type: 3}
      propertyPath: m_LocalRotation.y
      value: -0.0018232018
      objectReference: {fileID: 0}
    - target: {fileID: 366175167995203695, guid: 2d24b6b0d9608a44b99cbfc20601d680, type: 3}
      propertyPath: m_LocalRotation.z
      value: -0.013819054
      objectReference: {fileID: 0}
    - target: {fileID: 608321761475470972, guid: 2d24b6b0d9608a44b99cbfc20601d680, type: 3}
      propertyPath: m_LocalPosition.x
      value: -0.0000000027939677
      objectReference: {fileID: 0}
    - target: {fileID: 608321761475470972, guid: 2d24b6b0d9608a44b99cbfc20601d680, type: 3}
      propertyPath: m_LocalPosition.y
      value: 0.36669737
      objectReference: {fileID: 0}
    - target: {fileID: 608321761475470972, guid: 2d24b6b0d9608a44b99cbfc20601d680, type: 3}
      propertyPath: m_LocalPosition.z
      value: 0
      objectReference: {fileID: 0}
    - target: {fileID: 608321761475470972, guid: 2d24b6b0d9608a44b99cbfc20601d680, type: 3}
      propertyPath: m_LocalRotation.w
      value: 0.8532485
      objectReference: {fileID: 0}
    - target: {fileID: 608321761475470972, guid: 2d24b6b0d9608a44b99cbfc20601d680, type: 3}
      propertyPath: m_LocalRotation.x
      value: 0.49551165
      objectReference: {fileID: 0}
    - target: {fileID: 608321761475470972, guid: 2d24b6b0d9608a44b99cbfc20601d680, type: 3}
      propertyPath: m_LocalRotation.y
      value: -0.15568684
      objectReference: {fileID: 0}
    - target: {fileID: 608321761475470972, guid: 2d24b6b0d9608a44b99cbfc20601d680, type: 3}
      propertyPath: m_LocalRotation.z
      value: 0.046870757
      objectReference: {fileID: 0}
    - target: {fileID: 919132149155446097, guid: 2d24b6b0d9608a44b99cbfc20601d680, type: 3}
      propertyPath: m_Name
      value: Player
      objectReference: {fileID: 0}
    - target: {fileID: 919132149155446097, guid: 2d24b6b0d9608a44b99cbfc20601d680, type: 3}
      propertyPath: m_IsActive
      value: 1
      objectReference: {fileID: 0}
    - target: {fileID: 919132149155446097, guid: 2d24b6b0d9608a44b99cbfc20601d680, type: 3}
      propertyPath: m_TagString
      value: Player
      objectReference: {fileID: 0}
    - target: {fileID: 1092408308860062549, guid: 2d24b6b0d9608a44b99cbfc20601d680, type: 3}
      propertyPath: m_LocalPosition.x
      value: -0.00007862557
      objectReference: {fileID: 0}
    - target: {fileID: 1092408308860062549, guid: 2d24b6b0d9608a44b99cbfc20601d680, type: 3}
      propertyPath: m_LocalPosition.y
      value: 0.023470616
      objectReference: {fileID: 0}
    - target: {fileID: 1092408308860062549, guid: 2d24b6b0d9608a44b99cbfc20601d680, type: 3}
      propertyPath: m_LocalPosition.z
      value: 0.00000002561137
      objectReference: {fileID: 0}
    - target: {fileID: 1092408308860062549, guid: 2d24b6b0d9608a44b99cbfc20601d680, type: 3}
      propertyPath: m_LocalRotation.w
      value: -0.98783743
      objectReference: {fileID: 0}
    - target: {fileID: 1092408308860062549, guid: 2d24b6b0d9608a44b99cbfc20601d680, type: 3}
      propertyPath: m_LocalRotation.x
      value: -0.15547022
      objectReference: {fileID: 0}
    - target: {fileID: 1092408308860062549, guid: 2d24b6b0d9608a44b99cbfc20601d680, type: 3}
      propertyPath: m_LocalRotation.y
      value: 0.0023173685
      objectReference: {fileID: 0}
    - target: {fileID: 1092408308860062549, guid: 2d24b6b0d9608a44b99cbfc20601d680, type: 3}
      propertyPath: m_LocalRotation.z
      value: -0.0009513495
      objectReference: {fileID: 0}
    - target: {fileID: 1189529853000058984, guid: 2d24b6b0d9608a44b99cbfc20601d680, type: 3}
      propertyPath: m_LocalPosition.x
      value: 0.030382372
      objectReference: {fileID: 0}
    - target: {fileID: 1189529853000058984, guid: 2d24b6b0d9608a44b99cbfc20601d680, type: 3}
      propertyPath: m_LocalPosition.y
      value: 0.09039023
      objectReference: {fileID: 0}
    - target: {fileID: 1189529853000058984, guid: 2d24b6b0d9608a44b99cbfc20601d680, type: 3}
      propertyPath: m_LocalPosition.z
      value: -0.0017473958
      objectReference: {fileID: 0}
    - target: {fileID: 1189529853000058984, guid: 2d24b6b0d9608a44b99cbfc20601d680, type: 3}
      propertyPath: m_LocalRotation.w
      value: -0.97538584
      objectReference: {fileID: 0}
    - target: {fileID: 1189529853000058984, guid: 2d24b6b0d9608a44b99cbfc20601d680, type: 3}
      propertyPath: m_LocalRotation.x
      value: -0.22011703
      objectReference: {fileID: 0}
    - target: {fileID: 1189529853000058984, guid: 2d24b6b0d9608a44b99cbfc20601d680, type: 3}
      propertyPath: m_LocalRotation.y
      value: 0.00026780364
      objectReference: {fileID: 0}
    - target: {fileID: 1189529853000058984, guid: 2d24b6b0d9608a44b99cbfc20601d680, type: 3}
      propertyPath: m_LocalRotation.z
      value: 0.013075185
      objectReference: {fileID: 0}
    - target: {fileID: 1330755669629619180, guid: 2d24b6b0d9608a44b99cbfc20601d680, type: 3}
      propertyPath: m_LocalPosition.x
      value: 0.035356134
      objectReference: {fileID: 0}
    - target: {fileID: 1330755669629619180, guid: 2d24b6b0d9608a44b99cbfc20601d680, type: 3}
      propertyPath: m_LocalPosition.y
      value: 0.102904685
      objectReference: {fileID: 0}
    - target: {fileID: 1330755669629619180, guid: 2d24b6b0d9608a44b99cbfc20601d680, type: 3}
      propertyPath: m_LocalPosition.z
      value: 0.0008335542
      objectReference: {fileID: 0}
    - target: {fileID: 1330755669629619180, guid: 2d24b6b0d9608a44b99cbfc20601d680, type: 3}
      propertyPath: m_LocalRotation.w
      value: 0.99633265
      objectReference: {fileID: 0}
    - target: {fileID: 1330755669629619180, guid: 2d24b6b0d9608a44b99cbfc20601d680, type: 3}
      propertyPath: m_LocalRotation.x
      value: 0.06324316
      objectReference: {fileID: 0}
    - target: {fileID: 1330755669629619180, guid: 2d24b6b0d9608a44b99cbfc20601d680, type: 3}
      propertyPath: m_LocalRotation.y
      value: -0.00087082374
      objectReference: {fileID: 0}
    - target: {fileID: 1330755669629619180, guid: 2d24b6b0d9608a44b99cbfc20601d680, type: 3}
      propertyPath: m_LocalRotation.z
      value: -0.057626344
      objectReference: {fileID: 0}
    - target: {fileID: 1564860333797465651, guid: 2d24b6b0d9608a44b99cbfc20601d680, type: 3}
      propertyPath: m_LocalPosition.x
      value: 0.00007515184
      objectReference: {fileID: 0}
    - target: {fileID: 1564860333797465651, guid: 2d24b6b0d9608a44b99cbfc20601d680, type: 3}
      propertyPath: m_LocalPosition.y
      value: 0.027489098
      objectReference: {fileID: 0}
    - target: {fileID: 1564860333797465651, guid: 2d24b6b0d9608a44b99cbfc20601d680, type: 3}
      propertyPath: m_LocalPosition.z
      value: -0.000000009895302
      objectReference: {fileID: 0}
    - target: {fileID: 1564860333797465651, guid: 2d24b6b0d9608a44b99cbfc20601d680, type: 3}
      propertyPath: m_LocalRotation.w
      value: 0.98338675
      objectReference: {fileID: 0}
    - target: {fileID: 1564860333797465651, guid: 2d24b6b0d9608a44b99cbfc20601d680, type: 3}
      propertyPath: m_LocalRotation.x
      value: 0.18133594
      objectReference: {fileID: 0}
    - target: {fileID: 1564860333797465651, guid: 2d24b6b0d9608a44b99cbfc20601d680, type: 3}
      propertyPath: m_LocalRotation.y
      value: 0.00038188687
      objectReference: {fileID: 0}
    - target: {fileID: 1564860333797465651, guid: 2d24b6b0d9608a44b99cbfc20601d680, type: 3}
      propertyPath: m_LocalRotation.z
      value: 0.008224187
      objectReference: {fileID: 0}
    - target: {fileID: 1852576806548013000, guid: 2d24b6b0d9608a44b99cbfc20601d680, type: 3}
      propertyPath: m_LocalPosition.x
      value: 0.000000009778887
      objectReference: {fileID: 0}
    - target: {fileID: 1852576806548013000, guid: 2d24b6b0d9608a44b99cbfc20601d680, type: 3}
      propertyPath: m_LocalPosition.y
      value: 0.24811955
      objectReference: {fileID: 0}
    - target: {fileID: 1852576806548013000, guid: 2d24b6b0d9608a44b99cbfc20601d680, type: 3}
      propertyPath: m_LocalPosition.z
      value: -0.00000005122274
      objectReference: {fileID: 0}
    - target: {fileID: 1852576806548013000, guid: 2d24b6b0d9608a44b99cbfc20601d680, type: 3}
      propertyPath: m_LocalRotation.w
      value: 0.99697065
      objectReference: {fileID: 0}
    - target: {fileID: 1852576806548013000, guid: 2d24b6b0d9608a44b99cbfc20601d680, type: 3}
      propertyPath: m_LocalRotation.x
      value: 0.06458908
      objectReference: {fileID: 0}
    - target: {fileID: 1852576806548013000, guid: 2d24b6b0d9608a44b99cbfc20601d680, type: 3}
      propertyPath: m_LocalRotation.y
      value: 0.011013813
      objectReference: {fileID: 0}
    - target: {fileID: 1852576806548013000, guid: 2d24b6b0d9608a44b99cbfc20601d680, type: 3}
      propertyPath: m_LocalRotation.z
      value: -0.04191146
      objectReference: {fileID: 0}
    - target: {fileID: 2559285840627121667, guid: 2d24b6b0d9608a44b99cbfc20601d680, type: 3}
      propertyPath: m_LocalPosition.y
      value: -0.060395993
      objectReference: {fileID: 0}
    - target: {fileID: 2559285840627121667, guid: 2d24b6b0d9608a44b99cbfc20601d680, type: 3}
      propertyPath: m_LocalRotation.w
      value: 0.07991168
      objectReference: {fileID: 0}
    - target: {fileID: 2559285840627121667, guid: 2d24b6b0d9608a44b99cbfc20601d680, type: 3}
      propertyPath: m_LocalRotation.x
      value: -0.017729668
      objectReference: {fileID: 0}
    - target: {fileID: 2559285840627121667, guid: 2d24b6b0d9608a44b99cbfc20601d680, type: 3}
      propertyPath: m_LocalRotation.y
      value: 0.07729224
      objectReference: {fileID: 0}
    - target: {fileID: 2559285840627121667, guid: 2d24b6b0d9608a44b99cbfc20601d680, type: 3}
      propertyPath: m_LocalRotation.z
      value: 0.9936427
      objectReference: {fileID: 0}
    - target: {fileID: 2563496969622287784, guid: 2d24b6b0d9608a44b99cbfc20601d680, type: 3}
      propertyPath: m_LocalPosition.x
      value: -0.01257083
      objectReference: {fileID: 0}
    - target: {fileID: 2563496969622287784, guid: 2d24b6b0d9608a44b99cbfc20601d680, type: 3}
      propertyPath: m_LocalPosition.y
      value: 0.24909793
      objectReference: {fileID: 0}
    - target: {fileID: 2563496969622287784, guid: 2d24b6b0d9608a44b99cbfc20601d680, type: 3}
      propertyPath: m_LocalPosition.z
      value: -0.008060739
      objectReference: {fileID: 0}
    - target: {fileID: 2563496969622287784, guid: 2d24b6b0d9608a44b99cbfc20601d680, type: 3}
      propertyPath: m_LocalRotation.w
      value: 0.99685293
      objectReference: {fileID: 0}
    - target: {fileID: 2563496969622287784, guid: 2d24b6b0d9608a44b99cbfc20601d680, type: 3}
      propertyPath: m_LocalRotation.x
      value: 0.009408264
      objectReference: {fileID: 0}
    - target: {fileID: 2563496969622287784, guid: 2d24b6b0d9608a44b99cbfc20601d680, type: 3}
      propertyPath: m_LocalRotation.y
      value: 0.004116356
      objectReference: {fileID: 0}
    - target: {fileID: 2563496969622287784, guid: 2d24b6b0d9608a44b99cbfc20601d680, type: 3}
      propertyPath: m_LocalRotation.z
      value: 0.07860554
      objectReference: {fileID: 0}
    - target: {fileID: 2916570863362053800, guid: 2d24b6b0d9608a44b99cbfc20601d680, type: 3}
      propertyPath: m_LocalPosition.x
      value: 0
      objectReference: {fileID: 0}
    - target: {fileID: 2916570863362053800, guid: 2d24b6b0d9608a44b99cbfc20601d680, type: 3}
      propertyPath: m_LocalPosition.y
      value: 0.17848834
      objectReference: {fileID: 0}
    - target: {fileID: 2916570863362053800, guid: 2d24b6b0d9608a44b99cbfc20601d680, type: 3}
      propertyPath: m_LocalPosition.z
      value: -0.000000044703484
      objectReference: {fileID: 0}
    - target: {fileID: 2916570863362053800, guid: 2d24b6b0d9608a44b99cbfc20601d680, type: 3}
      propertyPath: m_LocalRotation.w
      value: 0.9235825
      objectReference: {fileID: 0}
    - target: {fileID: 2916570863362053800, guid: 2d24b6b0d9608a44b99cbfc20601d680, type: 3}
      propertyPath: m_LocalRotation.x
      value: 0.38301763
      objectReference: {fileID: 0}
    - target: {fileID: 2916570863362053800, guid: 2d24b6b0d9608a44b99cbfc20601d680, type: 3}
      propertyPath: m_LocalRotation.y
      value: -0.016834974
      objectReference: {fileID: 0}
    - target: {fileID: 2916570863362053800, guid: 2d24b6b0d9608a44b99cbfc20601d680, type: 3}
      propertyPath: m_LocalRotation.z
      value: 0.003083795
      objectReference: {fileID: 0}
    - target: {fileID: 3183749884578473501, guid: 2d24b6b0d9608a44b99cbfc20601d680, type: 3}
      propertyPath: m_LocalPosition.x
      value: 0.000114342256
      objectReference: {fileID: 0}
    - target: {fileID: 3183749884578473501, guid: 2d24b6b0d9608a44b99cbfc20601d680, type: 3}
      propertyPath: m_LocalPosition.y
      value: 0.0333378
      objectReference: {fileID: 0}
    - target: {fileID: 3183749884578473501, guid: 2d24b6b0d9608a44b99cbfc20601d680, type: 3}
      propertyPath: m_LocalPosition.z
      value: -0.000000005820766
      objectReference: {fileID: 0}
    - target: {fileID: 3183749884578473501, guid: 2d24b6b0d9608a44b99cbfc20601d680, type: 3}
      propertyPath: m_LocalRotation.w
      value: 0.9871136
      objectReference: {fileID: 0}
    - target: {fileID: 3183749884578473501, guid: 2d24b6b0d9608a44b99cbfc20601d680, type: 3}
      propertyPath: m_LocalRotation.x
      value: 0.1599323
      objectReference: {fileID: 0}
    - target: {fileID: 3183749884578473501, guid: 2d24b6b0d9608a44b99cbfc20601d680, type: 3}
      propertyPath: m_LocalRotation.y
      value: 0.00037884706
      objectReference: {fileID: 0}
    - target: {fileID: 3183749884578473501, guid: 2d24b6b0d9608a44b99cbfc20601d680, type: 3}
      propertyPath: m_LocalRotation.z
      value: 0.0053348835
      objectReference: {fileID: 0}
    - target: {fileID: 3667946887678727147, guid: 2d24b6b0d9608a44b99cbfc20601d680, type: 3}
      propertyPath: m_LocalPosition.x
      value: -0.008598861
      objectReference: {fileID: 0}
    - target: {fileID: 3667946887678727147, guid: 2d24b6b0d9608a44b99cbfc20601d680, type: 3}
      propertyPath: m_LocalPosition.y
      value: 0.11955033
      objectReference: {fileID: 0}
    - target: {fileID: 3667946887678727147, guid: 2d24b6b0d9608a44b99cbfc20601d680, type: 3}
      propertyPath: m_LocalPosition.z
      value: -0.0018190523
      objectReference: {fileID: 0}
    - target: {fileID: 3667946887678727147, guid: 2d24b6b0d9608a44b99cbfc20601d680, type: 3}
      propertyPath: m_LocalRotation.w
      value: -0.992286
      objectReference: {fileID: 0}
    - target: {fileID: 3667946887678727147, guid: 2d24b6b0d9608a44b99cbfc20601d680, type: 3}
      propertyPath: m_LocalRotation.x
      value: -0.12247596
      objectReference: {fileID: 0}
    - target: {fileID: 3667946887678727147, guid: 2d24b6b0d9608a44b99cbfc20601d680, type: 3}
      propertyPath: m_LocalRotation.y
      value: -0.0113306325
      objectReference: {fileID: 0}
    - target: {fileID: 3667946887678727147, guid: 2d24b6b0d9608a44b99cbfc20601d680, type: 3}
      propertyPath: m_LocalRotation.z
      value: -0.015485895
      objectReference: {fileID: 0}
    - target: {fileID: 4747904710347621765, guid: 2d24b6b0d9608a44b99cbfc20601d680, type: 3}
      propertyPath: m_LocalPosition.x
      value: -0.032617927
      objectReference: {fileID: 0}
    - target: {fileID: 4747904710347621765, guid: 2d24b6b0d9608a44b99cbfc20601d680, type: 3}
      propertyPath: m_LocalPosition.y
      value: 0.09494013
      objectReference: {fileID: 0}
    - target: {fileID: 4747904710347621765, guid: 2d24b6b0d9608a44b99cbfc20601d680, type: 3}
      propertyPath: m_LocalPosition.z
      value: -0.001102522
      objectReference: {fileID: 0}
    - target: {fileID: 4747904710347621765, guid: 2d24b6b0d9608a44b99cbfc20601d680, type: 3}
      propertyPath: m_LocalRotation.w
      value: 0.9733565
      objectReference: {fileID: 0}
    - target: {fileID: 4747904710347621765, guid: 2d24b6b0d9608a44b99cbfc20601d680, type: 3}
      propertyPath: m_LocalRotation.x
      value: 0.22901037
      objectReference: {fileID: 0}
    - target: {fileID: 4747904710347621765, guid: 2d24b6b0d9608a44b99cbfc20601d680, type: 3}
      propertyPath: m_LocalRotation.y
      value: -0.0036397567
      objectReference: {fileID: 0}
    - target: {fileID: 4747904710347621765, guid: 2d24b6b0d9608a44b99cbfc20601d680, type: 3}
      propertyPath: m_LocalRotation.z
      value: 0.010875759
      objectReference: {fileID: 0}
    - target: {fileID: 5048025441337412694, guid: 2d24b6b0d9608a44b99cbfc20601d680, type: 3}
      propertyPath: m_LocalPosition.y
      value: 0.0332835
      objectReference: {fileID: 0}
    - target: {fileID: 5048025441337412694, guid: 2d24b6b0d9608a44b99cbfc20601d680, type: 3}
      propertyPath: m_LocalPosition.z
      value: 0.010679852
      objectReference: {fileID: 0}
    - target: {fileID: 5048025441337412694, guid: 2d24b6b0d9608a44b99cbfc20601d680, type: 3}
      propertyPath: m_LocalRotation.w
      value: 0.9660891
      objectReference: {fileID: 0}
    - target: {fileID: 5048025441337412694, guid: 2d24b6b0d9608a44b99cbfc20601d680, type: 3}
      propertyPath: m_LocalRotation.x
      value: 0.19581217
      objectReference: {fileID: 0}
    - target: {fileID: 5048025441337412694, guid: 2d24b6b0d9608a44b99cbfc20601d680, type: 3}
      propertyPath: m_LocalRotation.y
      value: -0.03489653
      objectReference: {fileID: 0}
    - target: {fileID: 5048025441337412694, guid: 2d24b6b0d9608a44b99cbfc20601d680, type: 3}
      propertyPath: m_LocalRotation.z
      value: -0.16465595
      objectReference: {fileID: 0}
    - target: {fileID: 5097370190579632962, guid: 2d24b6b0d9608a44b99cbfc20601d680, type: 3}
      propertyPath: m_LocalPosition.x
      value: -0.00008420393
      objectReference: {fileID: 0}
    - target: {fileID: 5097370190579632962, guid: 2d24b6b0d9608a44b99cbfc20601d680, type: 3}
      propertyPath: m_LocalPosition.y
      value: 0.031519543
      objectReference: {fileID: 0}
    - target: {fileID: 5097370190579632962, guid: 2d24b6b0d9608a44b99cbfc20601d680, type: 3}
      propertyPath: m_LocalPosition.z
      value: 0.00000004679896
      objectReference: {fileID: 0}
    - target: {fileID: 5097370190579632962, guid: 2d24b6b0d9608a44b99cbfc20601d680, type: 3}
      propertyPath: m_LocalRotation.w
      value: -0.9975257
      objectReference: {fileID: 0}
    - target: {fileID: 5097370190579632962, guid: 2d24b6b0d9608a44b99cbfc20601d680, type: 3}
      propertyPath: m_LocalRotation.x
      value: -0.07019037
      objectReference: {fileID: 0}
    - target: {fileID: 5097370190579632962, guid: 2d24b6b0d9608a44b99cbfc20601d680, type: 3}
      propertyPath: m_LocalRotation.y
      value: 0.0016435087
      objectReference: {fileID: 0}
    - target: {fileID: 5097370190579632962, guid: 2d24b6b0d9608a44b99cbfc20601d680, type: 3}
      propertyPath: m_LocalRotation.z
      value: 0.0036414117
      objectReference: {fileID: 0}
    - target: {fileID: 5372056943023685468, guid: 2d24b6b0d9608a44b99cbfc20601d680, type: 3}
      propertyPath: m_LocalPosition.x
      value: 0.0000312342
      objectReference: {fileID: 0}
    - target: {fileID: 5372056943023685468, guid: 2d24b6b0d9608a44b99cbfc20601d680, type: 3}
      propertyPath: m_LocalPosition.y
      value: 0.029849643
      objectReference: {fileID: 0}
    - target: {fileID: 5372056943023685468, guid: 2d24b6b0d9608a44b99cbfc20601d680, type: 3}
      propertyPath: m_LocalPosition.z
      value: -0.000000040163286
      objectReference: {fileID: 0}
    - target: {fileID: 5372056943023685468, guid: 2d24b6b0d9608a44b99cbfc20601d680, type: 3}
      propertyPath: m_LocalRotation.w
      value: -0.98842806
      objectReference: {fileID: 0}
    - target: {fileID: 5372056943023685468, guid: 2d24b6b0d9608a44b99cbfc20601d680, type: 3}
      propertyPath: m_LocalRotation.x
      value: -0.15149285
      objectReference: {fileID: 0}
    - target: {fileID: 5372056943023685468, guid: 2d24b6b0d9608a44b99cbfc20601d680, type: 3}
      propertyPath: m_LocalRotation.y
      value: 0.0017165538
      objectReference: {fileID: 0}
    - target: {fileID: 5372056943023685468, guid: 2d24b6b0d9608a44b99cbfc20601d680, type: 3}
      propertyPath: m_LocalRotation.z
      value: 0.0075486437
      objectReference: {fileID: 0}
    - target: {fileID: 5465940246521907071, guid: 2d24b6b0d9608a44b99cbfc20601d680, type: 3}
      propertyPath: m_LocalPosition.x
      value: 0.00706046
      objectReference: {fileID: 0}
    - target: {fileID: 5465940246521907071, guid: 2d24b6b0d9608a44b99cbfc20601d680, type: 3}
      propertyPath: m_LocalPosition.y
      value: 0.9440301
      objectReference: {fileID: 0}
    - target: {fileID: 5465940246521907071, guid: 2d24b6b0d9608a44b99cbfc20601d680, type: 3}
      propertyPath: m_LocalPosition.z
      value: 0.009760417
      objectReference: {fileID: 0}
    - target: {fileID: 5465940246521907071, guid: 2d24b6b0d9608a44b99cbfc20601d680, type: 3}
      propertyPath: m_LocalRotation.w
      value: 0.99912554
      objectReference: {fileID: 0}
    - target: {fileID: 5465940246521907071, guid: 2d24b6b0d9608a44b99cbfc20601d680, type: 3}
      propertyPath: m_LocalRotation.x
      value: -0.032494675
      objectReference: {fileID: 0}
    - target: {fileID: 5465940246521907071, guid: 2d24b6b0d9608a44b99cbfc20601d680, type: 3}
      propertyPath: m_LocalRotation.y
      value: 0.0051963837
      objectReference: {fileID: 0}
    - target: {fileID: 5465940246521907071, guid: 2d24b6b0d9608a44b99cbfc20601d680, type: 3}
      propertyPath: m_LocalRotation.z
      value: 0.02579463
      objectReference: {fileID: 0}
    - target: {fileID: 5866666021909216657, guid: 2d24b6b0d9608a44b99cbfc20601d680, type: 3}
      propertyPath: m_Controller
      value: 
      objectReference: {fileID: 9100000, guid: b796fe0ed59ef8a4d93290a2f095388c, type: 2}
    - target: {fileID: 6000407479487422213, guid: 2d24b6b0d9608a44b99cbfc20601d680, type: 3}
      propertyPath: m_LocalPosition.x
      value: 0.0099432245
      objectReference: {fileID: 0}
    - target: {fileID: 6000407479487422213, guid: 2d24b6b0d9608a44b99cbfc20601d680, type: 3}
      propertyPath: m_LocalPosition.y
      value: 0.12567109
      objectReference: {fileID: 0}
    - target: {fileID: 6000407479487422213, guid: 2d24b6b0d9608a44b99cbfc20601d680, type: 3}
      propertyPath: m_LocalPosition.z
      value: 0.016563466
      objectReference: {fileID: 0}
    - target: {fileID: 6000407479487422213, guid: 2d24b6b0d9608a44b99cbfc20601d680, type: 3}
      propertyPath: m_LocalRotation.w
      value: 0.8866645
      objectReference: {fileID: 0}
    - target: {fileID: 6000407479487422213, guid: 2d24b6b0d9608a44b99cbfc20601d680, type: 3}
      propertyPath: m_LocalRotation.x
      value: 0.42877105
      objectReference: {fileID: 0}
    - target: {fileID: 6000407479487422213, guid: 2d24b6b0d9608a44b99cbfc20601d680, type: 3}
      propertyPath: m_LocalRotation.y
      value: 0.17095739
      objectReference: {fileID: 0}
    - target: {fileID: 6000407479487422213, guid: 2d24b6b0d9608a44b99cbfc20601d680, type: 3}
      propertyPath: m_LocalRotation.z
      value: -0.027479494
      objectReference: {fileID: 0}
    - target: {fileID: 6341119541397085964, guid: 2d24b6b0d9608a44b99cbfc20601d680, type: 3}
      propertyPath: m_LocalPosition.x
      value: 0.0000052054675
      objectReference: {fileID: 0}
    - target: {fileID: 6341119541397085964, guid: 2d24b6b0d9608a44b99cbfc20601d680, type: 3}
      propertyPath: m_LocalPosition.y
      value: 0.030702645
      objectReference: {fileID: 0}
    - target: {fileID: 6341119541397085964, guid: 2d24b6b0d9608a44b99cbfc20601d680, type: 3}
      propertyPath: m_LocalPosition.z
      value: -0.000000018742867
      objectReference: {fileID: 0}
    - target: {fileID: 6341119541397085964, guid: 2d24b6b0d9608a44b99cbfc20601d680, type: 3}
      propertyPath: m_LocalRotation.w
      value: -0.9884242
      objectReference: {fileID: 0}
    - target: {fileID: 6341119541397085964, guid: 2d24b6b0d9608a44b99cbfc20601d680, type: 3}
      propertyPath: m_LocalRotation.x
      value: -0.151528
      objectReference: {fileID: 0}
    - target: {fileID: 6341119541397085964, guid: 2d24b6b0d9608a44b99cbfc20601d680, type: 3}
      propertyPath: m_LocalRotation.y
      value: 0.0015710292
      objectReference: {fileID: 0}
    - target: {fileID: 6341119541397085964, guid: 2d24b6b0d9608a44b99cbfc20601d680, type: 3}
      propertyPath: m_LocalRotation.z
      value: 0.0073835244
      objectReference: {fileID: 0}
    - target: {fileID: 6502182839619065283, guid: 2d24b6b0d9608a44b99cbfc20601d680, type: 3}
      propertyPath: m_LocalPosition.x
      value: 0.00000001839362
      objectReference: {fileID: 0}
    - target: {fileID: 6502182839619065283, guid: 2d24b6b0d9608a44b99cbfc20601d680, type: 3}
      propertyPath: m_LocalPosition.y
      value: 0.24810036
      objectReference: {fileID: 0}
    - target: {fileID: 6502182839619065283, guid: 2d24b6b0d9608a44b99cbfc20601d680, type: 3}
      propertyPath: m_LocalPosition.z
      value: 0.000000020489097
      objectReference: {fileID: 0}
    - target: {fileID: 6502182839619065283, guid: 2d24b6b0d9608a44b99cbfc20601d680, type: 3}
      propertyPath: m_LocalRotation.w
      value: 0.99805105
      objectReference: {fileID: 0}
    - target: {fileID: 6502182839619065283, guid: 2d24b6b0d9608a44b99cbfc20601d680, type: 3}
      propertyPath: m_LocalRotation.x
      value: 0.05153844
      objectReference: {fileID: 0}
    - target: {fileID: 6502182839619065283, guid: 2d24b6b0d9608a44b99cbfc20601d680, type: 3}
      propertyPath: m_LocalRotation.y
      value: 0.009702787
      objectReference: {fileID: 0}
    - target: {fileID: 6502182839619065283, guid: 2d24b6b0d9608a44b99cbfc20601d680, type: 3}
      propertyPath: m_LocalRotation.z
      value: 0.033821624
      objectReference: {fileID: 0}
    - target: {fileID: 6515712193588681746, guid: 2d24b6b0d9608a44b99cbfc20601d680, type: 3}
      propertyPath: m_LocalPosition.x
      value: -4.50972e-14
      objectReference: {fileID: 0}
    - target: {fileID: 6515712193588681746, guid: 2d24b6b0d9608a44b99cbfc20601d680, type: 3}
      propertyPath: m_LocalPosition.y
      value: 0.16369234
      objectReference: {fileID: 0}
    - target: {fileID: 6515712193588681746, guid: 2d24b6b0d9608a44b99cbfc20601d680, type: 3}
      propertyPath: m_LocalPosition.z
      value: -0.000000004656613
      objectReference: {fileID: 0}
    - target: {fileID: 6515712193588681746, guid: 2d24b6b0d9608a44b99cbfc20601d680, type: 3}
      propertyPath: m_LocalRotation.w
      value: 0.9956943
      objectReference: {fileID: 0}
    - target: {fileID: 6515712193588681746, guid: 2d24b6b0d9608a44b99cbfc20601d680, type: 3}
      propertyPath: m_LocalRotation.x
      value: 0.09261068
      objectReference: {fileID: 0}
    - target: {fileID: 6515712193588681746, guid: 2d24b6b0d9608a44b99cbfc20601d680, type: 3}
      propertyPath: m_LocalRotation.y
      value: 0.0010535717
      objectReference: {fileID: 0}
    - target: {fileID: 6515712193588681746, guid: 2d24b6b0d9608a44b99cbfc20601d680, type: 3}
      propertyPath: m_LocalRotation.z
      value: -0.0038870128
      objectReference: {fileID: 0}
    - target: {fileID: 6655383506977046455, guid: 2d24b6b0d9608a44b99cbfc20601d680, type: 3}
      propertyPath: m_LocalPosition.x
      value: -0.00005951163
      objectReference: {fileID: 0}
    - target: {fileID: 6655383506977046455, guid: 2d24b6b0d9608a44b99cbfc20601d680, type: 3}
      propertyPath: m_LocalPosition.y
      value: 0.027528632
      objectReference: {fileID: 0}
    - target: {fileID: 6655383506977046455, guid: 2d24b6b0d9608a44b99cbfc20601d680, type: 3}
      propertyPath: m_LocalPosition.z
      value: 0.000000011874363
      objectReference: {fileID: 0}
    - target: {fileID: 6655383506977046455, guid: 2d24b6b0d9608a44b99cbfc20601d680, type: 3}
      propertyPath: m_LocalRotation.w
      value: 0.9884312
      objectReference: {fileID: 0}
    - target: {fileID: 6655383506977046455, guid: 2d24b6b0d9608a44b99cbfc20601d680, type: 3}
      propertyPath: m_LocalRotation.x
      value: 0.15119393
      objectReference: {fileID: 0}
    - target: {fileID: 6655383506977046455, guid: 2d24b6b0d9608a44b99cbfc20601d680, type: 3}
      propertyPath: m_LocalRotation.y
      value: 0.000761017
      objectReference: {fileID: 0}
    - target: {fileID: 6655383506977046455, guid: 2d24b6b0d9608a44b99cbfc20601d680, type: 3}
      propertyPath: m_LocalRotation.z
      value: 0.011983913
      objectReference: {fileID: 0}
    - target: {fileID: 7078722787440015773, guid: 2d24b6b0d9608a44b99cbfc20601d680, type: 3}
      propertyPath: m_LocalPosition.y
      value: 0.14232767
      objectReference: {fileID: 0}
    - target: {fileID: 7078722787440015773, guid: 2d24b6b0d9608a44b99cbfc20601d680, type: 3}
      propertyPath: m_LocalPosition.z
      value: -0.0002784552
      objectReference: {fileID: 0}
    - target: {fileID: 7078722787440015773, guid: 2d24b6b0d9608a44b99cbfc20601d680, type: 3}
      propertyPath: m_LocalRotation.w
      value: -0.41088957
      objectReference: {fileID: 0}
    - target: {fileID: 7078722787440015773, guid: 2d24b6b0d9608a44b99cbfc20601d680, type: 3}
      propertyPath: m_LocalRotation.x
      value: -0.6359668
      objectReference: {fileID: 0}
    - target: {fileID: 7078722787440015773, guid: 2d24b6b0d9608a44b99cbfc20601d680, type: 3}
      propertyPath: m_LocalRotation.y
      value: -0.29595128
      objectReference: {fileID: 0}
    - target: {fileID: 7078722787440015773, guid: 2d24b6b0d9608a44b99cbfc20601d680, type: 3}
      propertyPath: m_LocalRotation.z
      value: 0.58234787
      objectReference: {fileID: 0}
    - target: {fileID: 7666680083751660616, guid: 2d24b6b0d9608a44b99cbfc20601d680, type: 3}
      propertyPath: m_LocalPosition.x
      value: -0.00035937488
      objectReference: {fileID: 0}
    - target: {fileID: 7666680083751660616, guid: 2d24b6b0d9608a44b99cbfc20601d680, type: 3}
      propertyPath: m_LocalPosition.y
      value: 0.033391245
      objectReference: {fileID: 0}
    - target: {fileID: 7666680083751660616, guid: 2d24b6b0d9608a44b99cbfc20601d680, type: 3}
      propertyPath: m_LocalPosition.z
      value: -0.000000016763806
      objectReference: {fileID: 0}
    - target: {fileID: 7666680083751660616, guid: 2d24b6b0d9608a44b99cbfc20601d680, type: 3}
      propertyPath: m_LocalRotation.w
      value: 0.9884546
      objectReference: {fileID: 0}
    - target: {fileID: 7666680083751660616, guid: 2d24b6b0d9608a44b99cbfc20601d680, type: 3}
      propertyPath: m_LocalRotation.x
      value: 0.15098381
      objectReference: {fileID: 0}
    - target: {fileID: 7666680083751660616, guid: 2d24b6b0d9608a44b99cbfc20601d680, type: 3}
      propertyPath: m_LocalRotation.y
      value: 0.0011054277
      objectReference: {fileID: 0}
    - target: {fileID: 7666680083751660616, guid: 2d24b6b0d9608a44b99cbfc20601d680, type: 3}
      propertyPath: m_LocalRotation.z
      value: 0.012665495
      objectReference: {fileID: 0}
    - target: {fileID: 8169382868667117632, guid: 2d24b6b0d9608a44b99cbfc20601d680, type: 3}
      propertyPath: m_LocalPosition.y
      value: -0.06039598
      objectReference: {fileID: 0}
    - target: {fileID: 8169382868667117632, guid: 2d24b6b0d9608a44b99cbfc20601d680, type: 3}
      propertyPath: m_LocalRotation.w
      value: 0.034576196
      objectReference: {fileID: 0}
    - target: {fileID: 8169382868667117632, guid: 2d24b6b0d9608a44b99cbfc20601d680, type: 3}
      propertyPath: m_LocalRotation.x
      value: -0.03785007
      objectReference: {fileID: 0}
    - target: {fileID: 8169382868667117632, guid: 2d24b6b0d9608a44b99cbfc20601d680, type: 3}
      propertyPath: m_LocalRotation.y
      value: -0.026768485
      objectReference: {fileID: 0}
    - target: {fileID: 8169382868667117632, guid: 2d24b6b0d9608a44b99cbfc20601d680, type: 3}
      propertyPath: m_LocalRotation.z
      value: 0.9983263
      objectReference: {fileID: 0}
    - target: {fileID: 8255111157037086696, guid: 2d24b6b0d9608a44b99cbfc20601d680, type: 3}
      propertyPath: m_LocalPosition.x
      value: 0.010240006
      objectReference: {fileID: 0}
    - target: {fileID: 8255111157037086696, guid: 2d24b6b0d9608a44b99cbfc20601d680, type: 3}
      propertyPath: m_LocalPosition.y
      value: 0.11065644
      objectReference: {fileID: 0}
    - target: {fileID: 8255111157037086696, guid: 2d24b6b0d9608a44b99cbfc20601d680, type: 3}
      propertyPath: m_LocalPosition.z
      value: -0.0007200786
      objectReference: {fileID: 0}
    - target: {fileID: 8255111157037086696, guid: 2d24b6b0d9608a44b99cbfc20601d680, type: 3}
      propertyPath: m_LocalRotation.w
      value: 0.99080586
      objectReference: {fileID: 0}
    - target: {fileID: 8255111157037086696, guid: 2d24b6b0d9608a44b99cbfc20601d680, type: 3}
      propertyPath: m_LocalRotation.x
      value: 0.13239037
      objectReference: {fileID: 0}
    - target: {fileID: 8255111157037086696, guid: 2d24b6b0d9608a44b99cbfc20601d680, type: 3}
      propertyPath: m_LocalRotation.y
      value: -0.014800575
      objectReference: {fileID: 0}
    - target: {fileID: 8255111157037086696, guid: 2d24b6b0d9608a44b99cbfc20601d680, type: 3}
      propertyPath: m_LocalRotation.z
      value: -0.023612896
      objectReference: {fileID: 0}
    - target: {fileID: 8447082967072642302, guid: 2d24b6b0d9608a44b99cbfc20601d680, type: 3}
      propertyPath: m_LocalPosition.x
      value: -0.030414367
      objectReference: {fileID: 0}
    - target: {fileID: 8447082967072642302, guid: 2d24b6b0d9608a44b99cbfc20601d680, type: 3}
      propertyPath: m_LocalPosition.y
      value: 0.033609316
      objectReference: {fileID: 0}
    - target: {fileID: 8447082967072642302, guid: 2d24b6b0d9608a44b99cbfc20601d680, type: 3}
      propertyPath: m_LocalPosition.z
      value: 0.012380442
      objectReference: {fileID: 0}
    - target: {fileID: 8447082967072642302, guid: 2d24b6b0d9608a44b99cbfc20601d680, type: 3}
      propertyPath: m_LocalRotation.w
      value: -0.96566266
      objectReference: {fileID: 0}
    - target: {fileID: 8447082967072642302, guid: 2d24b6b0d9608a44b99cbfc20601d680, type: 3}
      propertyPath: m_LocalRotation.x
      value: -0.19333576
      objectReference: {fileID: 0}
    - target: {fileID: 8447082967072642302, guid: 2d24b6b0d9608a44b99cbfc20601d680, type: 3}
      propertyPath: m_LocalRotation.y
      value: -0.028690552
      objectReference: {fileID: 0}
    - target: {fileID: 8447082967072642302, guid: 2d24b6b0d9608a44b99cbfc20601d680, type: 3}
      propertyPath: m_LocalRotation.z
      value: -0.17115419
      objectReference: {fileID: 0}
    m_RemovedComponents: []
    m_RemovedGameObjects: []
    m_AddedGameObjects: []
    m_AddedComponents:
    - targetCorrespondingSourceObject: {fileID: 919132149155446097, guid: 2d24b6b0d9608a44b99cbfc20601d680, type: 3}
      insertIndex: -1
      addedObject: {fileID: 1388385681463989377}
    - targetCorrespondingSourceObject: {fileID: 919132149155446097, guid: 2d24b6b0d9608a44b99cbfc20601d680, type: 3}
      insertIndex: -1
      addedObject: {fileID: 7428587646865752151}
    - targetCorrespondingSourceObject: {fileID: 919132149155446097, guid: 2d24b6b0d9608a44b99cbfc20601d680, type: 3}
      insertIndex: -1
      addedObject: {fileID: 8462570071084697303}
  m_SourcePrefab: {fileID: 100100000, guid: 2d24b6b0d9608a44b99cbfc20601d680, type: 3}
--- !u!1 &3459546546619115449 stripped
GameObject:
  m_CorrespondingSourceObject: {fileID: 919132149155446097, guid: 2d24b6b0d9608a44b99cbfc20601d680, type: 3}
  m_PrefabInstance: {fileID: 4378535199842261736}
  m_PrefabAsset: {fileID: 0}
--- !u!114 &1388385681463989377
MonoBehaviour:
  m_ObjectHideFlags: 0
  m_CorrespondingSourceObject: {fileID: 0}
  m_PrefabInstance: {fileID: 0}
  m_PrefabAsset: {fileID: 0}
  m_GameObject: {fileID: 3459546546619115449}
  m_Enabled: 1
  m_EditorHideFlags: 0
  m_Script: {fileID: 11500000, guid: 8d13bd5dc7705604a9b54948e6e69bdb, type: 3}
  m_Name: 
  m_EditorClassIdentifier: 
  cam: {fileID: 0}
--- !u!143 &7428587646865752151
CharacterController:
  m_ObjectHideFlags: 0
  m_CorrespondingSourceObject: {fileID: 0}
  m_PrefabInstance: {fileID: 0}
  m_PrefabAsset: {fileID: 0}
  m_GameObject: {fileID: 3459546546619115449}
  m_Material: {fileID: 0}
  m_IncludeLayers:
    serializedVersion: 2
    m_Bits: 0
  m_ExcludeLayers:
    serializedVersion: 2
    m_Bits: 0
  m_LayerOverridePriority: 0
  m_IsTrigger: 0
  m_ProvidesContacts: 0
  m_Enabled: 1
  serializedVersion: 3
  m_Height: 1.52
  m_Radius: 0.25
  m_SlopeLimit: 45
  m_StepOffset: 0.3
  m_SkinWidth: 0.08
  m_MinMoveDistance: 0.001
  m_Center: {x: 0, y: 0.81, z: 0}
--- !u!114 &8462570071084697303
MonoBehaviour:
  m_ObjectHideFlags: 0
  m_CorrespondingSourceObject: {fileID: 0}
  m_PrefabInstance: {fileID: 0}
  m_PrefabAsset: {fileID: 0}
  m_GameObject: {fileID: 3459546546619115449}
  m_Enabled: 1
  m_EditorHideFlags: 0
  m_Script: {fileID: 11500000, guid: 146e574f62821994ea24b2a5400a0d15, type: 3}
  m_Name: 
  m_EditorClassIdentifier: 
  rotationSpeed: 4
  rotationThreshold: 0.3
  degreesToTurn: 160
  motionParam: motion
  mirrorIdleParam: mirrorIdle
  turn180Param: turn180
  StartAnimTime: 0.3
  StopAnimTime: 0.15
  jumpHeight: 2
  gravityValue: -9.81
