{
  "docs": {
    "Getting Started": [
      "gettingstarted/download",
      "gettingstarted/runsandbox"
    ],
    "Basic Guides": [
      "guide/baselinengsi",
      "guide/longtermstorage"
    ],
    "Datamodels": [
      "datamodels/datamodels",
      "datamodels/datamodelmapper"
    ],
    "Marketplace": [
      "marketplace/authentication",
      "marketplace/deployment"
    ]
  },
  "docs-other": {}
}
