{
    "EngineConfiguration": {
        "PollInterval": "00:00:15",
        "Components": [
            {
                "Id": "PerformanceCounterMemory",
                "FullName": "AWS.EC2.Windows.CloudWatch.PerformanceCounterComponent.PerformanceCounterInputComponent,AWS.EC2.Windows.CloudWatch",
                "Parameters": {
                    "CategoryName": "Memory",
                    "CounterName": "Available MBytes",
                    "InstanceName": "",
                    "MetricName": "Available Memory, Mb",
                    "Unit": "Megabytes",
                    "DimensionName": "InstanceId",
                    "DimensionValue": "{instance_id}"
                }
            },
            {
                "Id": "PerformanceCounterCPU",
                "FullName": "AWS.EC2.Windows.CloudWatch.PerformanceCounterComponent.PerformanceCounterInputComponent,AWS.EC2.Windows.CloudWatch",
                "Parameters": {
                    "CategoryName": "Processor",
                    "CounterName": "% Processor Time",
                    "InstanceName": "_Total",
                    "MetricName": "CPU Usage, %",
                    "Unit": "Percent",
                    "DimensionName": "InstanceId",
                    "DimensionValue": "{instance_id}"
                }
            },
            {
                "Id": "PerformanceCounterFreeDiskSpacePercentC",
                "FullName": "AWS.EC2.Windows.CloudWatch.PerformanceCounterComponent.PerformanceCounterInputComponent,AWS.EC2.Windows.CloudWatch",
                "Parameters": {
                    "CategoryName": "LogicalDisk",
                    "CounterName": "% Free Space",
                    "InstanceName": "C:",
                    "MetricName": "Free Disk C Space, %",
                    "Unit": "Percent",
                    "DimensionName": "InstanceId",
                    "DimensionValue": "{instance_id}"
                }
            },
            {
                "Id": "PerformanceCounterFreeDiskSpacePercentD",
                "FullName": "AWS.EC2.Windows.CloudWatch.PerformanceCounterComponent.PerformanceCounterInputComponent,AWS.EC2.Windows.CloudWatch",
                "Parameters": {
                    "CategoryName": "LogicalDisk",
                    "CounterName": "% Free Space",
                    "InstanceName": "D:",
                    "MetricName": "Free Disk D Space, %",
                    "Unit": "Percent",
                    "DimensionName": "InstanceId",
                    "DimensionValue": "{instance_id}"
                }
            },
            {
                "Id": "PerformanceCounterFreeDiskSpacePercentE",
                "FullName": "AWS.EC2.Windows.CloudWatch.PerformanceCounterComponent.PerformanceCounterInputComponent,AWS.EC2.Windows.CloudWatch",
                "Parameters": {
                    "CategoryName": "LogicalDisk",
                    "CounterName": "% Free Space",
                    "InstanceName": "E:",
                    "MetricName": "Free Disk E Space, %",
                    "Unit": "Percent",
                    "DimensionName": "InstanceId",
                    "DimensionValue": "{instance_id}"
                }
            },
            {
                "Id": "PerformanceCounterFreeDiskSpacePercentW",
                "FullName": "AWS.EC2.Windows.CloudWatch.PerformanceCounterComponent.PerformanceCounterInputComponent,AWS.EC2.Windows.CloudWatch",
                "Parameters": {
                    "CategoryName": "LogicalDisk",
                    "CounterName": "% Free Space",
                    "InstanceName": "W:",
                    "MetricName": "Free Disk W Space, %",
                    "Unit": "Percent",
                    "DimensionName": "InstanceId",
                    "DimensionValue": "{instance_id}"
                }
            },
            {
                "Id": "PerformanceCounterFreeDiskSpacePercentY",
                "FullName": "AWS.EC2.Windows.CloudWatch.PerformanceCounterComponent.PerformanceCounterInputComponent,AWS.EC2.Windows.CloudWatch",
                "Parameters": {
                    "CategoryName": "LogicalDisk",
                    "CounterName": "% Free Space",
                    "InstanceName": "Y:",
                    "MetricName": "Free Disk Y Space, %",
                    "Unit": "Percent",
                    "DimensionName": "InstanceId",
                    "DimensionValue": "{instance_id}"
                }
            },
            {
                "Id": "PerformanceCounterFreeDiskSpacePercentF",
                "FullName": "AWS.EC2.Windows.CloudWatch.PerformanceCounterComponent.PerformanceCounterInputComponent,AWS.EC2.Windows.CloudWatch",
                "Parameters": {
                    "CategoryName": "LogicalDisk",
                    "CounterName": "% Free Space",
                    "InstanceName": "F:",
                    "MetricName": "Free Disk F Space, %",
                    "Unit": "Percent",
                    "DimensionName": "InstanceId",
                    "DimensionValue": "{instance_id}"
                }
            },
            {
                "Id": "CloudWatch",
                "FullName": "AWS.EC2.Windows.CloudWatch.CloudWatch.CloudWatchOutputComponent,AWS.EC2.Windows.CloudWatch",
                "Parameters":
                {
                    "AccessKey": "",
                    "SecretKey": "",
                    "Region": "us-west-2",
                    "NameSpace": "Windows custom metrics"
                }
            }
        ],
        "Flows": {
            "Flows":
            [
                "PerformanceCounterMemory,CloudWatch",
                "PerformanceCounterFreeDiskSpacePercentC,CloudWatch",
                "PerformanceCounterFreeDiskSpacePercentD,CloudWatch",
                "PerformanceCounterFreeDiskSpacePercentE,CloudWatch",
                "PerformanceCounterFreeDiskSpacePercentF,CloudWatch",
                "PerformanceCounterFreeDiskSpacePercentW,CloudWatch",
                "PerformanceCounterFreeDiskSpacePercentY,CloudWatch",
                "PerformanceCounterCPU,CloudWatch"
            ]
        }
    }
}
