[
    { "model": "auth.user",
        "pk": 1,
        "fields": {
            "username": "admin",
            "password": "pbkdf2_sha256$320000$acCCjenuGTjkk4zECmw76P$xyCSmUHpRJ421zlQZ3g14EuItANNxhT+mH0yyIWsxF8=",
            "is_superuser": true,
            "is_staff": true,
            "is_active": true
        }
    }
]