93.136.110.32 - - [03/May/2020:00:15:36 +0000] "GET / HTTP/1.1" 400 762
89.189.156.52 - - [03/May/2020:00:18:36 +0000] "GET / HTTP/1.1" 400 762
139.180.158.28 - - [03/May/2020:01:14:58 +0000] "GET / HTTP/1.0" 200 11196
197.234.176.154 - - [03/May/2020:01:20:53 +0000] "GET / HTTP/1.1" 200 11216
183.136.225.46 - - [03/May/2020:04:31:51 +0000] "GET / HTTP/1.1" 200 11216
183.136.225.46 - - [03/May/2020:04:31:52 +0000] "GET / HTTP/1.1" 200 11216
89.44.132.42 - - [03/May/2020:04:42:56 +0000] "GET / HTTP/1.1" 200 11216
152.231.80.234 - - [03/May/2020:05:31:44 +0000] "GET / HTTP/1.1" 400 762
93.151.235.200 - - [03/May/2020:07:20:26 +0000] "GET / HTTP/1.1" 400 762
95.248.66.212 - - [03/May/2020:08:12:23 +0000] "GET / HTTP/1.1" 400 762
89.40.73.99 - - [03/May/2020:09:44:46 +0000] "-" 400 1879
83.97.20.31 - - [03/May/2020:10:17:47 +0000] "GET / HTTP/1.0" 200 11196
93.151.235.200 - - [03/May/2020:11:03:40 +0000] "GET / HTTP/1.1" 400 762
37.233.60.56 - - [03/May/2020:11:08:31 +0000] "GET / HTTP/1.1" 400 762
101.53.158.201 - - [03/May/2020:11:21:51 +0000] "GET /HelloWorld HTTP/1.1" 200 162
101.53.158.201 - - [03/May/2020:11:21:51 +0000] "GET /favicon.ico HTTP/1.1" 200 21630
189.154.2.5 - - [03/May/2020:11:40:14 +0000] "GET / HTTP/1.1" 200 11216
95.14.103.31 - - [03/May/2020:11:47:19 +0000] "GET / HTTP/1.1" 200 11216
195.54.167.225 - - [03/May/2020:12:59:18 +0000] "-" 400 1879
106.3.147.2 - - [03/May/2020:14:37:45 +0000] "GET /TP/public/index.php HTTP/1.1" 404 736
106.3.147.2 - - [03/May/2020:14:37:46 +0000] "GET /TP/index.php HTTP/1.1" 404 725
106.3.147.2 - - [03/May/2020:14:37:46 +0000] "GET /thinkphp/html/public/index.php HTTP/1.1" 404 751
106.3.147.2 - - [03/May/2020:14:37:47 +0000] "GET /html/public/index.php HTTP/1.1" 404 738
106.3.147.2 - - [03/May/2020:14:37:47 +0000] "GET /public/index.php HTTP/1.1" 404 729
106.3.147.2 - - [03/May/2020:14:37:48 +0000] "GET /TP/html/public/index.php HTTP/1.1" 404 745
106.3.147.2 - - [03/May/2020:14:37:48 +0000] "GET /elrekt.php HTTP/1.1" 404 719
106.3.147.2 - - [03/May/2020:14:37:49 +0000] "GET /index.php HTTP/1.1" 404 718
106.3.147.2 - - [03/May/2020:14:37:49 +0000] "POST /users?page=&size=5 HTTP/1.1" 404 714
106.3.147.2 - - [03/May/2020:14:37:50 +0000] "GET / HTTP/1.1" 200 11216
31.202.57.251 - - [03/May/2020:14:38:53 +0000] "GET / HTTP/1.1" 200 11216
5.188.210.101 - - [03/May/2020:16:05:10 +0000] "-" 400 1879
5.188.210.101 - - [03/May/2020:16:08:16 +0000] "-" 400 1879
5.188.210.101 - - [03/May/2020:16:08:45 +0000] "GET /echo.php HTTP/1.1" 404 717
184.105.247.194 - - [03/May/2020:18:03:53 +0000] "GET / HTTP/1.1" 200 11216
139.180.158.28 - - [03/May/2020:18:16:08 +0000] "GET / HTTP/1.0" 200 11196
165.16.37.150 - - [03/May/2020:18:16:18 +0000] "GET / HTTP/1.1" 200 11216
191.54.106.94 - - [03/May/2020:18:23:14 +0000] "GET / HTTP/1.1" 400 762
45.13.93.90 - - [03/May/2020:18:24:12 +0000] "CONNECT ip.ws.126.net:443 HTTP/1.1" 400 795
89.40.73.89 - - [03/May/2020:18:26:02 +0000] "-" 400 1879
45.125.66.204 - - [03/May/2020:19:16:48 +0000] "GET / HTTP/1.1" 200 11216
78.187.193.94 - - [03/May/2020:20:38:17 +0000] "GET / HTTP/1.1" 200 11216
162.243.139.191 - - [03/May/2020:21:35:12 +0000] "GET /hudson HTTP/1.1" 404 715
196.2.9.178 - - [03/May/2020:21:44:26 +0000] "GET / HTTP/1.1" 200 11216
78.191.60.49 - - [03/May/2020:22:42:08 +0000] "GET / HTTP/1.1" 200 11216
80.48.175.216 - - [03/May/2020:23:11:41 +0000] "GET / HTTP/1.1" 200 11216
195.218.255.70 - - [03/May/2020:23:50:36 +0000] "GET / HTTP/1.1" 400 762
