Started at Sat May 02 14:36:05 UTC 2020
Processing PrashanthMavenTest
Offering PrashanthMavenTest to Project Build Discarder
Processing Selenium Test
Offering Selenium Test to Project Build Discarder
Processing Tommy The Kutta
Offering Tommy The Kutta to Project Build Discarder
Processing Selenium Test/com.edureka:TestApp
Offering Selenium Test/com.edureka:TestApp to Project Build Discarder
Processing PrashanthMavenTest/com.qaagility:HelloWorld
Offering PrashanthMavenTest/com.qaagility:HelloWorld to Project Build Discarder
Finished at Sat May 02 14:36:05 UTC 2020. 16ms
