162.243.137.64 - - [08/May/2020:00:28:40 +0000] "GET / HTTP/1.1" 200 11216
187.102.50.55 - - [08/May/2020:00:46:36 +0000] "GET / HTTP/1.1" 200 11216
168.227.181.188 - - [08/May/2020:00:51:12 +0000] "GET / HTTP/1.1" 200 11216
41.251.88.179 - - [08/May/2020:01:50:09 +0000] "GET / HTTP/1.1" 200 11216
196.52.43.95 - - [08/May/2020:04:26:58 +0000] "GET / HTTP/1.0" 200 11196
185.80.32.81 - - [08/May/2020:06:10:37 +0000] "GET / HTTP/1.1" 200 11216
89.40.73.104 - - [08/May/2020:06:24:51 +0000] "-" 400 1879
185.62.23.107 - - [08/May/2020:06:35:12 +0000] "GET / HTTP/1.1" 200 11216
190.104.229.67 - - [08/May/2020:06:42:59 +0000] "GET / HTTP/1.1" 200 11216
95.80.109.2 - - [08/May/2020:07:49:38 +0000] "GET / HTTP/1.1" 200 11216
198.108.66.196 - - [08/May/2020:10:30:32 +0000] "GET / HTTP/1.1" 200 11216
180.254.156.77 - - [08/May/2020:11:20:23 +0000] "GET / HTTP/1.1" 200 11216
190.128.154.222 - - [08/May/2020:12:10:17 +0000] "HEAD / HTTP/1.1" 200 -
190.128.154.222 - - [08/May/2020:12:10:17 +0000] "GET / HTTP/1.1" 200 11216
183.129.159.244 - - [08/May/2020:13:57:46 +0000] "GET / HTTP/1.0" 200 11196
115.238.44.237 - - [08/May/2020:14:01:48 +0000] "GET / HTTP/1.0" 200 11196
185.232.65.240 - - [08/May/2020:15:04:03 +0000] "-" 400 1879
123.206.232.191 - - [08/May/2020:15:21:37 +0000] "GET /TP/public/index.php HTTP/1.1" 404 736
123.206.232.191 - - [08/May/2020:15:21:38 +0000] "GET /TP/index.php HTTP/1.1" 404 725
123.206.232.191 - - [08/May/2020:15:21:42 +0000] "GET /thinkphp/html/public/index.php HTTP/1.1" 404 751
123.206.232.191 - - [08/May/2020:15:21:46 +0000] "GET /html/public/index.php HTTP/1.1" 404 738
123.206.232.191 - - [08/May/2020:15:21:48 +0000] "GET /public/index.php HTTP/1.1" 404 729
123.206.232.191 - - [08/May/2020:15:21:49 +0000] "GET /TP/html/public/index.php HTTP/1.1" 404 745
123.206.232.191 - - [08/May/2020:15:21:51 +0000] "GET /elrekt.php HTTP/1.1" 404 719
123.206.232.191 - - [08/May/2020:15:21:52 +0000] "GET /index.php HTTP/1.1" 404 718
123.206.232.191 - - [08/May/2020:15:21:53 +0000] "POST /users?page=&size=5 HTTP/1.1" 404 714
123.206.232.191 - - [08/May/2020:15:21:54 +0000] "GET / HTTP/1.1" 200 11216
216.218.206.69 - - [08/May/2020:15:37:56 +0000] "GET / HTTP/1.1" 200 11216
162.243.141.119 - - [08/May/2020:15:57:06 +0000] "GET /hudson HTTP/1.1" 404 715
