1588230371319|create|jfrog-support-bundle/
1588230371319|create|artifactory-build-info/
1588230371319|create|example-repo-local/
1588230509526|delete|example-repo-local/
1588230509526|create|libs-release-local/
1588230509526|create|libs-snapshot-local/
1588230509526|create|jcenter-cache/
1588230509526|create|libs-release/
1588230509526|create|libs-snapshot/
1588230989250|create|libs-snapshot-local/com/
1588230989250|create|libs-snapshot-local/com/qaagility/
1588230989250|create|libs-snapshot-local/com/qaagility/HelloWorld/
1588230989250|create|libs-snapshot-local/com/qaagility/HelloWorld/1.0-SNAPSHOT/
1588230989250|create|libs-snapshot-local/com/qaagility/HelloWorld/1.0-SNAPSHOT/HelloWorld-1.0-20200430.071609-1.war
1588230989250|props|libs-snapshot-local/com/qaagility/HelloWorld/1.0-SNAPSHOT/HelloWorld-1.0-20200430.071609-1.war
1588230989467|create|libs-snapshot-local/com/qaagility/HelloWorld/1.0-SNAPSHOT/HelloWorld-1.0-20200430.071609-1.pom
1588230989467|props|libs-snapshot-local/com/qaagility/HelloWorld/1.0-SNAPSHOT/HelloWorld-1.0-20200430.071609-1.pom
1588230989467|create|libs-snapshot-local/com/qaagility/HelloWorld/1.0-SNAPSHOT/maven-metadata.xml
1588230989543|create|libs-snapshot-local/com/qaagility/HelloWorld/maven-metadata.xml
1588230989887|create|artifactory-build-info/BuildHelloWeb/
1588230989887|create|artifactory-build-info/BuildHelloWeb/2-1588230975689.json
1588231060563|delete|libs-snapshot-local/com/qaagility/HelloWorld/1.0-SNAPSHOT/HelloWorld-1.0-20200430.071609-1.war
1588231060577|delete|libs-snapshot-local/com/qaagility/HelloWorld/1.0-SNAPSHOT/HelloWorld-1.0-20200430.071609-1.pom
1588231060594|delete|libs-snapshot-local/com/qaagility/HelloWorld/maven-metadata.xml
1588231065065|delete|libs-snapshot-local/com/qaagility/HelloWorld/1.0-SNAPSHOT/maven-metadata.xml
1588231065103|delete|libs-snapshot-local/com/qaagility/HelloWorld/1.0-SNAPSHOT/
1588231065118|delete|libs-snapshot-local/com/qaagility/HelloWorld/
1588231070904|delete|libs-snapshot-local/com/qaagility/
1588231074956|delete|libs-snapshot-local/com/
1588231165896|create|libs-snapshot-local/com/
1588231165896|create|libs-snapshot-local/com/qaagility/
1588231165896|create|libs-snapshot-local/com/qaagility/HelloWorld/
1588231165896|create|libs-snapshot-local/com/qaagility/HelloWorld/1.0-SNAPSHOT/
1588231165896|create|libs-snapshot-local/com/qaagility/HelloWorld/1.0-SNAPSHOT/HelloWorld-1.0-20200430.071858-1.war
1588231165896|props|libs-snapshot-local/com/qaagility/HelloWorld/1.0-SNAPSHOT/HelloWorld-1.0-20200430.071858-1.war
1588231165979|create|libs-snapshot-local/com/qaagility/HelloWorld/1.0-SNAPSHOT/HelloWorld-1.0-20200430.071858-1.pom
1588231165979|props|libs-snapshot-local/com/qaagility/HelloWorld/1.0-SNAPSHOT/HelloWorld-1.0-20200430.071858-1.pom
1588231165979|create|libs-snapshot-local/com/qaagility/HelloWorld/1.0-SNAPSHOT/maven-metadata.xml
1588231166023|create|libs-snapshot-local/com/qaagility/HelloWorld/maven-metadata.xml
1588231166161|create|artifactory-build-info/BuildHelloWeb/3-1588231145582.json
1588231318251|create|libs-snapshot-local/com/qaagility/HelloWorld/1.0-SNAPSHOT/HelloWorld-1.0-20200430.072130-2.war
1588231318251|props|libs-snapshot-local/com/qaagility/HelloWorld/1.0-SNAPSHOT/HelloWorld-1.0-20200430.072130-2.war
1588231318251|update|libs-snapshot-local/com/qaagility/HelloWorld/1.0-SNAPSHOT/maven-metadata.xml
1588231318298|create|libs-snapshot-local/com/qaagility/HelloWorld/1.0-SNAPSHOT/HelloWorld-1.0-20200430.072130-2.pom
1588231318298|props|libs-snapshot-local/com/qaagility/HelloWorld/1.0-SNAPSHOT/HelloWorld-1.0-20200430.072130-2.pom
1588231318298|update|libs-snapshot-local/com/qaagility/HelloWorld/1.0-SNAPSHOT/maven-metadata.xml
1588231318364|update|libs-snapshot-local/com/qaagility/HelloWorld/maven-metadata.xml
1588231318480|create|artifactory-build-info/BuildHelloWeb/4-1588231297812.json
1588231783435|delete|libs-snapshot-local/com/qaagility/HelloWorld/1.0-SNAPSHOT/HelloWorld-1.0-20200430.071858-1.pom
1588231783468|delete|libs-snapshot-local/com/qaagility/HelloWorld/1.0-SNAPSHOT/HelloWorld-1.0-20200430.071858-1.war
1588231783497|delete|libs-snapshot-local/com/qaagility/HelloWorld/1.0-SNAPSHOT/HelloWorld-1.0-20200430.072130-2.pom
1588231783532|delete|libs-snapshot-local/com/qaagility/HelloWorld/1.0-SNAPSHOT/HelloWorld-1.0-20200430.072130-2.war
1588231783551|delete|libs-snapshot-local/com/qaagility/HelloWorld/1.0-SNAPSHOT/maven-metadata.xml
1588231783599|delete|libs-snapshot-local/com/qaagility/HelloWorld/1.0-SNAPSHOT/
1588231783622|delete|libs-snapshot-local/com/qaagility/HelloWorld/maven-metadata.xml
1588231783639|delete|libs-snapshot-local/com/qaagility/HelloWorld/
1588231788095|delete|libs-snapshot-local/com/qaagility/
1588231791651|delete|libs-snapshot-local/com/
1588410800949|create|libs-snapshot-local/com/
1588410800949|create|libs-snapshot-local/com/qaagility/
1588410800949|create|libs-snapshot-local/com/qaagility/HelloWorld/
1588410800949|create|libs-snapshot-local/com/qaagility/HelloWorld/1.0-SNAPSHOT/
1588410800949|create|libs-snapshot-local/com/qaagility/HelloWorld/1.0-SNAPSHOT/HelloWorld-1.0-20200502.091255-1.war
1588410800949|props|libs-snapshot-local/com/qaagility/HelloWorld/1.0-SNAPSHOT/HelloWorld-1.0-20200502.091255-1.war
1588410801125|create|libs-snapshot-local/com/qaagility/HelloWorld/1.0-SNAPSHOT/HelloWorld-1.0-20200502.091255-1.pom
1588410801125|props|libs-snapshot-local/com/qaagility/HelloWorld/1.0-SNAPSHOT/HelloWorld-1.0-20200502.091255-1.pom
1588410801125|create|libs-snapshot-local/com/qaagility/HelloWorld/1.0-SNAPSHOT/maven-metadata.xml
1588410801207|create|libs-snapshot-local/com/qaagility/HelloWorld/maven-metadata.xml
1588410801614|create|artifactory-build-info/PrashanthMavenTest/
1588410801614|create|artifactory-build-info/PrashanthMavenTest/10-1588410783101.json
1588411029132|create|libs-snapshot-local/com/qaagility/HelloWorld/1.0-SNAPSHOT/HelloWorld-1.0-20200502.091647-2.war
1588411029132|props|libs-snapshot-local/com/qaagility/HelloWorld/1.0-SNAPSHOT/HelloWorld-1.0-20200502.091647-2.war
1588411029132|update|libs-snapshot-local/com/qaagility/HelloWorld/1.0-SNAPSHOT/maven-metadata.xml
1588411029220|create|libs-snapshot-local/com/qaagility/HelloWorld/1.0-SNAPSHOT/HelloWorld-1.0-20200502.091647-2.pom
1588411029220|props|libs-snapshot-local/com/qaagility/HelloWorld/1.0-SNAPSHOT/HelloWorld-1.0-20200502.091647-2.pom
1588411029220|update|libs-snapshot-local/com/qaagility/HelloWorld/1.0-SNAPSHOT/maven-metadata.xml
1588411029241|update|libs-snapshot-local/com/qaagility/HelloWorld/maven-metadata.xml
1588411029343|create|artifactory-build-info/PrashanthMavenTest/11-1588411012677.json
1588411063523|create|libs-snapshot-local/com/qaagility/HelloWorld/1.0-SNAPSHOT/HelloWorld-1.0-20200502.091722-3.war
1588411063523|props|libs-snapshot-local/com/qaagility/HelloWorld/1.0-SNAPSHOT/HelloWorld-1.0-20200502.091722-3.war
1588411063523|update|libs-snapshot-local/com/qaagility/HelloWorld/1.0-SNAPSHOT/maven-metadata.xml
1588411063568|create|libs-snapshot-local/com/qaagility/HelloWorld/1.0-SNAPSHOT/HelloWorld-1.0-20200502.091722-3.pom
1588411063568|props|libs-snapshot-local/com/qaagility/HelloWorld/1.0-SNAPSHOT/HelloWorld-1.0-20200502.091722-3.pom
1588411063568|update|libs-snapshot-local/com/qaagility/HelloWorld/1.0-SNAPSHOT/maven-metadata.xml
1588411063596|update|libs-snapshot-local/com/qaagility/HelloWorld/maven-metadata.xml
1588411063700|create|artifactory-build-info/PrashanthMavenTest/12-1588411047333.json
1588424629940|create|libs-snapshot-local/com/qaagility/HelloWorld/1.0-SNAPSHOT/HelloWorld-1.0-20200502.130324-4.war
1588424629940|props|libs-snapshot-local/com/qaagility/HelloWorld/1.0-SNAPSHOT/HelloWorld-1.0-20200502.130324-4.war
1588424629940|update|libs-snapshot-local/com/qaagility/HelloWorld/1.0-SNAPSHOT/maven-metadata.xml
1588424630103|create|libs-snapshot-local/com/qaagility/HelloWorld/1.0-SNAPSHOT/HelloWorld-1.0-20200502.130324-4.pom
1588424630103|props|libs-snapshot-local/com/qaagility/HelloWorld/1.0-SNAPSHOT/HelloWorld-1.0-20200502.130324-4.pom
1588424630103|update|libs-snapshot-local/com/qaagility/HelloWorld/1.0-SNAPSHOT/maven-metadata.xml
1588424630196|update|libs-snapshot-local/com/qaagility/HelloWorld/maven-metadata.xml
1588424630560|create|artifactory-build-info/PrashanthMavenTest/14-1588424611743.json
1588427749024|create|libs-snapshot-local/com/qaagility/HelloWorld/1.0-SNAPSHOT/HelloWorld-1.0-20200502.135523-5.war
1588427749024|props|libs-snapshot-local/com/qaagility/HelloWorld/1.0-SNAPSHOT/HelloWorld-1.0-20200502.135523-5.war
1588427749024|update|libs-snapshot-local/com/qaagility/HelloWorld/1.0-SNAPSHOT/maven-metadata.xml
1588427749191|create|libs-snapshot-local/com/qaagility/HelloWorld/1.0-SNAPSHOT/HelloWorld-1.0-20200502.135523-5.pom
1588427749191|props|libs-snapshot-local/com/qaagility/HelloWorld/1.0-SNAPSHOT/HelloWorld-1.0-20200502.135523-5.pom
1588427749191|update|libs-snapshot-local/com/qaagility/HelloWorld/1.0-SNAPSHOT/maven-metadata.xml
1588427749270|update|libs-snapshot-local/com/qaagility/HelloWorld/maven-metadata.xml
1588427749684|create|artifactory-build-info/PrashanthMavenTest/18-1588427731010.json
1588429002783|create|libs-snapshot-local/com/qaagility/HelloWorld/1.0-SNAPSHOT/HelloWorld-1.0-20200502.141620-6.war
1588429002783|props|libs-snapshot-local/com/qaagility/HelloWorld/1.0-SNAPSHOT/HelloWorld-1.0-20200502.141620-6.war
1588429002783|update|libs-snapshot-local/com/qaagility/HelloWorld/1.0-SNAPSHOT/maven-metadata.xml
1588429002830|create|libs-snapshot-local/com/qaagility/HelloWorld/1.0-SNAPSHOT/HelloWorld-1.0-20200502.141620-6.pom
1588429002830|props|libs-snapshot-local/com/qaagility/HelloWorld/1.0-SNAPSHOT/HelloWorld-1.0-20200502.141620-6.pom
1588429002830|update|libs-snapshot-local/com/qaagility/HelloWorld/1.0-SNAPSHOT/maven-metadata.xml
1588429002859|update|libs-snapshot-local/com/qaagility/HelloWorld/maven-metadata.xml
1588429002979|create|artifactory-build-info/PrashanthMavenTest/19-1588428986174.json
1588504420740|create|libs-snapshot-local/com/qaagility/HelloWorld/1.0-SNAPSHOT/HelloWorld-1.0-20200503.111314-7.war
1588504420740|props|libs-snapshot-local/com/qaagility/HelloWorld/1.0-SNAPSHOT/HelloWorld-1.0-20200503.111314-7.war
1588504420740|update|libs-snapshot-local/com/qaagility/HelloWorld/1.0-SNAPSHOT/maven-metadata.xml
1588504420842|create|libs-snapshot-local/com/qaagility/HelloWorld/1.0-SNAPSHOT/HelloWorld-1.0-20200503.111314-7.pom
1588504420842|props|libs-snapshot-local/com/qaagility/HelloWorld/1.0-SNAPSHOT/HelloWorld-1.0-20200503.111314-7.pom
1588504420842|update|libs-snapshot-local/com/qaagility/HelloWorld/1.0-SNAPSHOT/maven-metadata.xml
1588504420910|update|libs-snapshot-local/com/qaagility/HelloWorld/maven-metadata.xml
1588504421241|create|artifactory-build-info/PrashanthMavenTest/20-1588504402555.json
