111.92.72.238 - - [02/May/2020:10:04:04 +0000] "GET /HelloWorld HTTP/1.1" 404 719
111.92.72.238 - - [02/May/2020:10:04:04 +0000] "GET /favicon.ico HTTP/1.1" 200 21630
111.92.72.238 - - [02/May/2020:10:04:08 +0000] "GET /HelloWorld HTTP/1.1" 404 719
111.92.72.238 - - [02/May/2020:10:04:08 +0000] "GET /favicon.ico HTTP/1.1" 200 21630
111.92.72.238 - - [02/May/2020:10:08:43 +0000] "GET /HelloWorld HTTP/1.1" 404 719
111.92.72.238 - - [02/May/2020:10:08:43 +0000] "GET /favicon.ico HTTP/1.1" 200 21630
111.92.72.238 - - [02/May/2020:10:08:44 +0000] "GET /HelloWorld HTTP/1.1" 404 719
111.92.72.238 - - [02/May/2020:10:08:44 +0000] "GET /favicon.ico HTTP/1.1" 200 21630
111.92.72.238 - - [02/May/2020:10:08:45 +0000] "GET /HelloWorld HTTP/1.1" 404 719
111.92.72.238 - - [02/May/2020:10:08:45 +0000] "GET /favicon.ico HTTP/1.1" 200 21630
111.92.72.238 - - [02/May/2020:10:08:45 +0000] "GET /HelloWorld HTTP/1.1" 404 719
111.92.72.238 - - [02/May/2020:10:08:46 +0000] "GET /HelloWorld HTTP/1.1" 404 719
111.92.72.238 - - [02/May/2020:10:08:46 +0000] "GET /favicon.ico HTTP/1.1" 200 21630
111.92.72.238 - - [02/May/2020:10:09:45 +0000] "GET /HelloWorld HTTP/1.1" 404 719
111.92.72.238 - - [02/May/2020:10:09:45 +0000] "GET /favicon.ico HTTP/1.1" 200 21630
111.92.72.238 - - [02/May/2020:10:09:46 +0000] "GET /HelloWorld HTTP/1.1" 404 719
111.92.72.238 - - [02/May/2020:10:09:46 +0000] "GET /favicon.ico HTTP/1.1" 200 21630
111.92.72.238 - - [02/May/2020:10:12:27 +0000] "GET /HelloWorld HTTP/1.1" 404 719
111.92.72.238 - - [02/May/2020:10:12:27 +0000] "GET /favicon.ico HTTP/1.1" 200 21630
111.92.72.238 - - [02/May/2020:10:12:28 +0000] "GET /HelloWorld HTTP/1.1" 404 719
111.92.72.238 - - [02/May/2020:10:12:29 +0000] "GET /favicon.ico HTTP/1.1" 200 21630
111.92.72.238 - - [02/May/2020:10:13:26 +0000] "GET /HelloWorld HTTP/1.1" 200 162
111.92.72.238 - - [02/May/2020:10:13:26 +0000] "GET /favicon.ico HTTP/1.1" 200 21630
178.176.194.62 - - [02/May/2020:10:23:40 +0000] "POST /tmUnblock.cgi HTTP/1.1" 404 722
35.193.253.1 - - [02/May/2020:10:36:23 +0000] "GET / HTTP/1.1" 200 11216
80.82.78.104 - - [02/May/2020:10:42:15 +0000] "GET ../../proc/ HTTP" 400 795
193.118.53.210 - - [02/May/2020:11:57:26 +0000] "GET / HTTP/1.1" 200 11216
86.104.10.9 - - [02/May/2020:12:32:54 +0000] "-" 400 1879
188.208.214.234 - - [02/May/2020:13:20:11 +0000] "GET / HTTP/1.1" 200 11216
101.53.158.201 - - [02/May/2020:13:48:50 +0000] "GET /HelloWorld HTTP/1.1" 200 162
101.53.158.201 - - [02/May/2020:13:48:50 +0000] "GET /favicon.ico HTTP/1.1" 200 21630
101.53.158.201 - - [02/May/2020:13:56:28 +0000] "GET /HelloWorld HTTP/1.1" 200 162
101.53.158.201 - - [02/May/2020:13:56:28 +0000] "GET /favicon.ico HTTP/1.1" 200 21630
101.53.158.201 - - [02/May/2020:14:17:23 +0000] "GET /HelloWorld HTTP/1.1" 200 162
101.53.158.201 - - [02/May/2020:14:17:24 +0000] "GET /favicon.ico HTTP/1.1" 200 21630
121.122.82.188 - - [02/May/2020:14:33:06 +0000] "GET / HTTP/1.1" 400 762
74.82.47.2 - - [02/May/2020:16:56:14 +0000] "GET / HTTP/1.1" 200 11216
94.73.3.194 - - [02/May/2020:17:50:42 +0000] "GET / HTTP/1.1" 200 11216
162.243.140.216 - - [02/May/2020:18:27:48 +0000] "GET /hudson HTTP/1.1" 404 715
46.1.131.164 - - [02/May/2020:18:47:35 +0000] "GET / HTTP/1.1" 200 11216
89.40.73.239 - - [02/May/2020:22:34:42 +0000] "-" 400 1879
47.205.52.166 - - [02/May/2020:23:26:50 +0000] "GET / HTTP/1.1" 200 11216
47.205.52.166 - - [02/May/2020:23:26:50 +0000] "-" 400 1879
47.205.52.166 - - [02/May/2020:23:26:51 +0000] "-" 400 1879
47.205.52.166 - - [02/May/2020:23:26:51 +0000] "-" 400 1879
139.162.79.87 - - [02/May/2020:23:36:32 +0000] "GET / HTTP/1.1" 200 11216
115.144.69.4 - - [02/May/2020:23:52:35 +0000] "-" 400 1879
115.144.69.4 - - [02/May/2020:23:52:36 +0000] "GET /cityjson HTTP/1.1" 404 717
115.144.69.4 - - [02/May/2020:23:52:36 +0000] "-" 400 1879
115.144.69.4 - - [02/May/2020:23:52:37 +0000] "-" 400 1879
