Started at Sat May 02 13:04:19 UTC 2020
Processing PrashanthMavenTest
Offering PrashanthMavenTest to Project Build Discarder
Processing Tommy The Kutta
Offering Tommy The Kutta to Project Build Discarder
Processing PrashanthMavenTest/com.qaagility:HelloWorld
Offering PrashanthMavenTest/com.qaagility:HelloWorld to Project Build Discarder
Finished at Sat May 02 13:04:19 UTC 2020. 2ms
