Started at Sat May 02 10:09:35 UTC 2020
Processing PrashanthMavenTest
Offering PrashanthMavenTest to Project Build Discarder
Processing PrashanthMavenTest/com.qaagility:HelloWorld
Offering PrashanthMavenTest/com.qaagility:HelloWorld to Project Build Discarder
Finished at Sat May 02 10:09:35 UTC 2020. 16ms
