14.96.108.30 - - [30/Apr/2020:06:34:14 +0000] "GET / HTTP/1.1" 200 11216
14.96.108.30 - - [30/Apr/2020:06:34:14 +0000] "GET /tomcat.png HTTP/1.1" 200 5103
14.96.108.30 - - [30/Apr/2020:06:34:14 +0000] "GET /tomcat.css HTTP/1.1" 200 5581
14.96.108.30 - - [30/Apr/2020:06:34:14 +0000] "GET /bg-nav.png HTTP/1.1" 200 1401
14.96.108.30 - - [30/Apr/2020:06:34:14 +0000] "GET /asf-logo-wide.svg HTTP/1.1" 200 27235
14.96.108.30 - - [30/Apr/2020:06:34:14 +0000] "GET /bg-button.png HTTP/1.1" 200 713
14.96.108.30 - - [30/Apr/2020:06:34:14 +0000] "GET /bg-upper.png HTTP/1.1" 200 3103
14.96.108.30 - - [30/Apr/2020:06:34:14 +0000] "GET /bg-middle.png HTTP/1.1" 200 1918
14.96.108.30 - - [30/Apr/2020:06:34:15 +0000] "GET /favicon.ico HTTP/1.1" 200 21630
14.96.108.30 - - [30/Apr/2020:06:34:19 +0000] "GET /HelloWorld HTTP/1.1" 200 162
27.74.101.193 - - [30/Apr/2020:06:42:49 +0000] "GET / HTTP/1.1" 400 762
91.222.250.235 - - [30/Apr/2020:07:00:32 +0000] "GET / HTTP/1.1" 200 11216
185.227.188.37 - - [30/Apr/2020:07:10:55 +0000] "GET / HTTP/1.1" 200 11216
177.125.78.214 - - [30/Apr/2020:08:23:10 +0000] "GET / HTTP/1.1" 200 11216
216.218.206.66 - - [30/Apr/2020:08:39:49 +0000] "GET / HTTP/1.1" 200 11216
