<svg xmlns="http://www.w3.org/2000/svg" width="33.477" height="37.801" viewBox="0 0 33.477 37.801">
  <g id="Group_11847" data-name="Group 11847" transform="translate(-31.504)">
    <path id="Path_10299" data-name="Path 10299" d="M108.476,255.89c0-.961-.666-1.534-1.845-1.534a4,4,0,0,0-.975.093v3.083a3.618,3.618,0,0,0,.791.061C107.7,257.595,108.476,256.959,108.476,255.89Z" transform="translate(-69.063 -236.9)" fill="#fff"/>
    <path id="Path_10300" data-name="Path 10300" d="M62.862,13.521h-.908V9.142a.639.639,0,0,0-.008-.082.727.727,0,0,0-.176-.48L54.482.254,54.477.248a.736.736,0,0,0-.148-.124C54.313.114,54.3.1,54.281.1a.764.764,0,0,0-.146-.061l-.04-.013A.739.739,0,0,0,53.924,0H36.013A1.484,1.484,0,0,0,34.53,1.482V13.521h-.907A2.119,2.119,0,0,0,31.5,15.64V26.658a2.119,2.119,0,0,0,2.119,2.119h.908v7.542A1.484,1.484,0,0,0,36.013,37.8H60.472a1.484,1.484,0,0,0,1.482-1.482V28.776h.908a2.119,2.119,0,0,0,2.119-2.119V15.64A2.119,2.119,0,0,0,62.862,13.521ZM36.013,1.483H53.183V9.067a.741.741,0,0,0,.741.741h6.548v3.713H36.013ZM45.425,23.05V26.2H43.256V15.752h2.758l2.169,3.827a30.151,30.151,0,0,1,1.7,3.579h.046a38.777,38.777,0,0,1-.2-4.354V15.752H51.9V26.2H49.423l-2.232-4.029a38.752,38.752,0,0,1-1.814-3.687l-.046.015C45.395,19.874,45.425,21.346,45.425,23.05ZM34.253,26.2v-10.3a19.353,19.353,0,0,1,3.192-.217,5.009,5.009,0,0,1,3.192.837,3.054,3.054,0,0,1,1.116,2.417,3.335,3.335,0,0,1-.961,2.479,4.841,4.841,0,0,1-3.393,1.1,6.013,6.013,0,0,1-.805-.046V26.2h-2.34Zm26.219,9.722H36.013V28.776H60.472v7.141Zm2.2-10.2a11.7,11.7,0,0,1-3.487.589,5.82,5.82,0,0,1-4.245-1.41,5.054,5.054,0,0,1-1.472-3.8c.015-3.471,2.541-5.453,5.965-5.453a7.184,7.184,0,0,1,2.9.511l-.5,1.89A5.789,5.789,0,0,0,59.4,17.6a3.16,3.16,0,0,0-3.455,3.378,3.421,3.421,0,0,0,4.448,3.269V22.058H58.782V20.214h3.89v5.5Z" transform="translate(0)" fill="#fff"/>
  </g>
</svg>
