application\admin\api\controller\ParsersController.class
application\admin\api\domain\RepositoryResponseData.class
application\admin\api\ApplicationAdmin.class
application\admin\api\service\ParsingServiceImpl.class
application\admin\api\service\ParsingServiceInterface.class
