##__________________________________________________
# INFO     Copyright © 2021 Altearn.

# Authors: A~Z
# Contributors:
# MC Version:
# Last check:

# Original path: glib.core:shutdown
# Documentation: https://glib-core.readthedocs.io//core
# Parallelizable: <true/false/global>
# Note:
# Remove the gunivers-lib trailing scores, then unload it.
# See glib.core:clean for more.

#__________________________________________________
# PARAMETERS

#__________________________________________________
# INIT

#__________________________________________________
# CONFIG

#__________________________________________________
# CODE

function glib:clean
datapack disable gunivers-lib
