{
    "_comment": "Name is the display name of your plugin | Tag is the tag defined in your commands AND the name of your folder",
    "name": "Base+",
    "tag": "basePlus",
    "description": "The basic upgrade plugin."
}
