{
    "_comment": "Name is the display name of your plugin | Tag is the tag defined in your commands AND the name of your folder",
    "name": "Role-Reaction",
    "tag": "RoleReaction",
    "description": "A plugin for create basic role-reaction messages",
    "index" : "index.js",
    "package" : ["lowdb"]
}