{
    "token": "TOKEN",
    "presence": {
        "activated": true,
        "list": [
            {
                "activity": {
                    "name": "1",
                    "type": "PLAYING"
                    },
                "status": "online"
            },
            {
                "activity": {
                    "name": "2",
                    "type": "WATCHING"
                    },
                "status": "dnd"
            },
            {
                "activity": {
                    "name": "3",
                    "type": "LISTENING"
                    },
                "status": "idle"
            },
            {
                "activity": {
                    "name": "4",
                    "type": "STREAMING",
                    "url": "https://twitch.tv/username",
                    "/COMMENT": "'url' need to be a twitch channel url"
                    },
                "status": "online"
            }
        ],
        "time": 10000
    },
    "owners": [
        "OWNER_ID1",
        "OWNER_ID2" 
    ],
    "prefix": "!",
    "help": {
        "category": [
            ["Testing","test"],
            ["<:Information:673358345998041120>・Information", "info"],
            ["⚙️・Config", "config"]
        ]
    },
    "perm_min": "8",
    "emojis": {
        "succes": "✅",
        "fail": "❌"
    }
}