<?xml version="1.0" encoding="UTF-8"?>
<svg xmlns="http://www.w3.org/2000/svg" xmlns:xlink="http://www.w3.org/1999/xlink" width="64pt" height="64pt" viewBox="0 0 64 64" version="1.1">
<g id="surface1">
<path style=" stroke:none;fill-rule:nonzero;fill:rgb(0%,0%,0%);fill-opacity:1;" d="M 46.355469 0 L 17.667969 0 C 7.925781 0 0 7.925781 0 17.667969 L 0 46.355469 C 0 56.097656 7.925781 64.023438 17.667969 64.023438 L 46.355469 64.023438 C 56.097656 64.023438 64.023438 56.097656 64.023438 46.355469 L 64.023438 17.667969 C 64.023438 7.925781 56.097656 0 46.355469 0 Z M 58.34375 46.355469 C 58.34375 52.964844 52.964844 58.34375 46.355469 58.34375 L 17.667969 58.34375 C 11.058594 58.34375 5.679688 52.964844 5.679688 46.355469 L 5.679688 17.667969 C 5.679688 11.058594 11.058594 5.679688 17.667969 5.679688 L 46.355469 5.679688 C 52.964844 5.679688 58.34375 11.058594 58.34375 17.667969 Z M 58.34375 46.355469 "/>
<path style=" stroke:none;fill-rule:nonzero;fill:rgb(0%,0%,0%);fill-opacity:1;" d="M 32.011719 15.515625 C 22.914062 15.515625 15.515625 22.914062 15.515625 32.011719 C 15.515625 41.109375 22.914062 48.507812 32.011719 48.507812 C 41.109375 48.507812 48.507812 41.109375 48.507812 32.011719 C 48.507812 22.914062 41.109375 15.515625 32.011719 15.515625 Z M 32.011719 42.828125 C 26.046875 42.828125 21.195312 37.976562 21.195312 32.011719 C 21.195312 26.046875 26.046875 21.195312 32.011719 21.195312 C 37.976562 21.195312 42.828125 26.046875 42.828125 32.011719 C 42.828125 37.976562 37.976562 42.828125 32.011719 42.828125 Z M 32.011719 42.828125 "/>
<path style=" stroke:none;fill-rule:nonzero;fill:rgb(0%,0%,0%);fill-opacity:1;" d="M 49.199219 10.699219 C 48.105469 10.699219 47.03125 11.140625 46.257812 11.917969 C 45.480469 12.691406 45.035156 13.765625 45.035156 14.863281 C 45.035156 15.960938 45.480469 17.035156 46.257812 17.8125 C 47.03125 18.582031 48.105469 19.03125 49.199219 19.03125 C 50.300781 19.03125 51.371094 18.582031 52.148438 17.8125 C 52.921875 17.035156 53.367188 15.957031 53.367188 14.863281 C 53.367188 13.765625 52.921875 12.691406 52.148438 11.917969 C 51.375 11.140625 50.300781 10.699219 49.199219 10.699219 Z M 49.199219 10.699219 "/>
</g>
</svg>
