^C:\USERS\ALMOG\DESKTOP\11FR 6 CLASS\C++\FIRST SEMESTER\LESSON 14 - TAST\HW\CPP---FIRST-SEMESTER-14\CPP FIRST SEMESTER - LESSON 14\CPP FIRST SEMESTER - LESSON 14\X64\DEBUG\BOOLEAN.OBJ|C:\USERS\ALMOG\DESKTOP\11FR 6 CLASS\C++\FIRST SEMESTER\LESSON 14 - TAST\HW\CPP---FIRST-SEMESTER-14\CPP FIRST SEMESTER - LESSON 14\CPP FIRST SEMESTER - LESSON 14\X64\DEBUG\HELPER.OBJ|C:\USERS\ALMOG\DESKTOP\11FR 6 CLASS\C++\FIRST SEMESTER\LESSON 14 - TAST\HW\CPP---FIRST-SEMESTER-14\CPP FIRST SEMESTER - LESSON 14\CPP FIRST SEMESTER - LESSON 14\X64\DEBUG\INDENTATIONEXCEPTION.OBJ|C:\USERS\ALMOG\DESKTOP\11FR 6 CLASS\C++\FIRST SEMESTER\LESSON 14 - TAST\HW\CPP---FIRST-SEMESTER-14\CPP FIRST SEMESTER - LESSON 14\CPP FIRST SEMESTER - LESSON 14\X64\DEBUG\INTEGER.OBJ|C:\USERS\ALMOG\DESKTOP\11FR 6 CLASS\C++\FIRST SEMESTER\LESSON 14 - TAST\HW\CPP---FIRST-SEMESTER-14\CPP FIRST SEMESTER - LESSON 14\CPP FIRST SEMESTER - LESSON 14\X64\DEBUG\INTERPRETER.OBJ|C:\USERS\ALMOG\DESKTOP\11FR 6 CLASS\C++\FIRST SEMESTER\LESSON 14 - TAST\HW\CPP---FIRST-SEMESTER-14\CPP FIRST SEMESTER - LESSON 14\CPP FIRST SEMESTER - LESSON 14\X64\DEBUG\PARSER.OBJ|C:\USERS\ALMOG\DESKTOP\11FR 6 CLASS\C++\FIRST SEMESTER\LESSON 14 - TAST\HW\CPP---FIRST-SEMESTER-14\CPP FIRST SEMESTER - LESSON 14\CPP FIRST SEMESTER - LESSON 14\X64\DEBUG\SEQUENCE.OBJ|C:\USERS\ALMOG\DESKTOP\11FR 6 CLASS\C++\FIRST SEMESTER\LESSON 14 - TAST\HW\CPP---FIRST-SEMESTER-14\CPP FIRST SEMESTER - LESSON 14\CPP FIRST SEMESTER - LESSON 14\X64\DEBUG\STRING.OBJ|C:\USERS\ALMOG\DESKTOP\11FR 6 CLASS\C++\FIRST SEMESTER\LESSON 14 - TAST\HW\CPP---FIRST-SEMESTER-14\CPP FIRST SEMESTER - LESSON 14\CPP FIRST SEMESTER - LESSON 14\X64\DEBUG\SYNTAXEXCEPTION.OBJ|C:\USERS\ALMOG\DESKTOP\11FR 6 CLASS\C++\FIRST SEMESTER\LESSON 14 - TAST\HW\CPP---FIRST-SEMESTER-14\CPP FIRST SEMESTER - LESSON 14\CPP FIRST SEMESTER - LESSON 14\X64\DEBUG\TYPE.OBJ|C:\USERS\ALMOG\DESKTOP\11FR 6 CLASS\C++\FIRST SEMESTER\LESSON 14 - TAST\HW\CPP---FIRST-SEMESTER-14\CPP FIRST SEMESTER - LESSON 14\CPP FIRST SEMESTER - LESSON 14\X64\DEBUG\VOID.OBJ
C:\USERS\ALMOG\DESKTOP\11FR 6 CLASS\C++\FIRST SEMESTER\LESSON 14 - TAST\HW\CPP---FIRST-SEMESTER-14\CPP FIRST SEMESTER - LESSON 14\X64\DEBUG\CPP FIRST SEMESTER - LESSON 14.EXE
C:\USERS\ALMOG\DESKTOP\11FR 6 CLASS\C++\FIRST SEMESTER\LESSON 14 - TAST\HW\CPP---FIRST-SEMESTER-14\CPP FIRST SEMESTER - LESSON 14\X64\DEBUG\CPP FIRST SEMESTER - LESSON 14.ILK
C:\USERS\ALMOG\DESKTOP\11FR 6 CLASS\C++\FIRST SEMESTER\LESSON 14 - TAST\HW\CPP---FIRST-SEMESTER-14\CPP FIRST SEMESTER - LESSON 14\X64\DEBUG\CPP FIRST SEMESTER - LESSON 14.PDB
