^C:\USERS\ALMOG\DESKTOP\11FR 6 CLASS\C++\FIRST SEMESTER\LESSON 14 - TAST\HW\CPP---FIRST-SEMESTER-14\CPP FIRST SEMESTER - LESSON 14\CPP FIRST SEMESTER - LESSON 14\HELPER.CPP
/c /ZI /JMC /nologo /W3 /WX- /diagnostics:classic /sdl /Od /D _MBCS /Gm- /EHsc /RTC1 /MDd /GS /fp:precise /permissive- /Zc:wchar_t /Zc:forScope /Zc:inline /Fo"X64\DEBUG\\" /Fd"X64\DEBUG\VC141.PDB" /Gd /TP /FC C:\USERS\ALMOG\DESKTOP\11FR 6 CLASS\C++\FIRST SEMESTER\LESSON 14 - TAST\HW\CPP---FIRST-SEMESTER-14\CPP FIRST SEMESTER - LESSON 14\CPP FIRST SEMESTER - LESSON 14\HELPER.CPP
^C:\USERS\ALMOG\DESKTOP\11FR 6 CLASS\C++\FIRST SEMESTER\LESSON 14 - TAST\HW\CPP---FIRST-SEMESTER-14\CPP FIRST SEMESTER - LESSON 14\CPP FIRST SEMESTER - LESSON 14\INDENTATIONEXCEPTION.CPP
/c /ZI /JMC /nologo /W3 /WX- /diagnostics:classic /sdl /Od /D _MBCS /Gm- /EHsc /RTC1 /MDd /GS /fp:precise /permissive- /Zc:wchar_t /Zc:forScope /Zc:inline /Fo"X64\DEBUG\\" /Fd"X64\DEBUG\VC141.PDB" /Gd /TP /FC C:\USERS\ALMOG\DESKTOP\11FR 6 CLASS\C++\FIRST SEMESTER\LESSON 14 - TAST\HW\CPP---FIRST-SEMESTER-14\CPP FIRST SEMESTER - LESSON 14\CPP FIRST SEMESTER - LESSON 14\INDENTATIONEXCEPTION.CPP
^C:\USERS\ALMOG\DESKTOP\11FR 6 CLASS\C++\FIRST SEMESTER\LESSON 14 - TAST\HW\CPP---FIRST-SEMESTER-14\CPP FIRST SEMESTER - LESSON 14\CPP FIRST SEMESTER - LESSON 14\TYPE.CPP
/c /ZI /JMC /nologo /W3 /WX- /diagnostics:classic /sdl /Od /D _MBCS /Gm- /EHsc /RTC1 /MDd /GS /fp:precise /permissive- /Zc:wchar_t /Zc:forScope /Zc:inline /Fo"X64\DEBUG\\" /Fd"X64\DEBUG\VC141.PDB" /Gd /TP /FC C:\USERS\ALMOG\DESKTOP\11FR 6 CLASS\C++\FIRST SEMESTER\LESSON 14 - TAST\HW\CPP---FIRST-SEMESTER-14\CPP FIRST SEMESTER - LESSON 14\CPP FIRST SEMESTER - LESSON 14\TYPE.CPP
^C:\USERS\ALMOG\DESKTOP\11FR 6 CLASS\C++\FIRST SEMESTER\LESSON 14 - TAST\HW\CPP---FIRST-SEMESTER-14\CPP FIRST SEMESTER - LESSON 14\CPP FIRST SEMESTER - LESSON 14\VOID.CPP
/c /ZI /JMC /nologo /W3 /WX- /diagnostics:classic /sdl /Od /D _MBCS /Gm- /EHsc /RTC1 /MDd /GS /fp:precise /permissive- /Zc:wchar_t /Zc:forScope /Zc:inline /Fo"X64\DEBUG\\" /Fd"X64\DEBUG\VC141.PDB" /Gd /TP /FC C:\USERS\ALMOG\DESKTOP\11FR 6 CLASS\C++\FIRST SEMESTER\LESSON 14 - TAST\HW\CPP---FIRST-SEMESTER-14\CPP FIRST SEMESTER - LESSON 14\CPP FIRST SEMESTER - LESSON 14\VOID.CPP
^C:\USERS\ALMOG\DESKTOP\11FR 6 CLASS\C++\FIRST SEMESTER\LESSON 14 - TAST\HW\CPP---FIRST-SEMESTER-14\CPP FIRST SEMESTER - LESSON 14\CPP FIRST SEMESTER - LESSON 14\INTEGER.CPP
/c /ZI /JMC /nologo /W3 /WX- /diagnostics:classic /sdl /Od /D _MBCS /Gm- /EHsc /RTC1 /MDd /GS /fp:precise /permissive- /Zc:wchar_t /Zc:forScope /Zc:inline /Fo"X64\DEBUG\\" /Fd"X64\DEBUG\VC141.PDB" /Gd /TP /FC C:\USERS\ALMOG\DESKTOP\11FR 6 CLASS\C++\FIRST SEMESTER\LESSON 14 - TAST\HW\CPP---FIRST-SEMESTER-14\CPP FIRST SEMESTER - LESSON 14\CPP FIRST SEMESTER - LESSON 14\INTEGER.CPP
^C:\USERS\ALMOG\DESKTOP\11FR 6 CLASS\C++\FIRST SEMESTER\LESSON 14 - TAST\HW\CPP---FIRST-SEMESTER-14\CPP FIRST SEMESTER - LESSON 14\CPP FIRST SEMESTER - LESSON 14\SYNTAXEXCEPTION.CPP
/c /ZI /JMC /nologo /W3 /WX- /diagnostics:classic /sdl /Od /D _MBCS /Gm- /EHsc /RTC1 /MDd /GS /fp:precise /permissive- /Zc:wchar_t /Zc:forScope /Zc:inline /Fo"X64\DEBUG\\" /Fd"X64\DEBUG\VC141.PDB" /Gd /TP /FC C:\USERS\ALMOG\DESKTOP\11FR 6 CLASS\C++\FIRST SEMESTER\LESSON 14 - TAST\HW\CPP---FIRST-SEMESTER-14\CPP FIRST SEMESTER - LESSON 14\CPP FIRST SEMESTER - LESSON 14\SYNTAXEXCEPTION.CPP
^C:\USERS\ALMOG\DESKTOP\11FR 6 CLASS\C++\FIRST SEMESTER\LESSON 14 - TAST\HW\CPP---FIRST-SEMESTER-14\CPP FIRST SEMESTER - LESSON 14\CPP FIRST SEMESTER - LESSON 14\SEQUENCE.CPP
/c /ZI /JMC /nologo /W3 /WX- /diagnostics:classic /sdl /Od /D _MBCS /Gm- /EHsc /RTC1 /MDd /GS /fp:precise /permissive- /Zc:wchar_t /Zc:forScope /Zc:inline /Fo"X64\DEBUG\\" /Fd"X64\DEBUG\VC141.PDB" /Gd /TP /FC C:\USERS\ALMOG\DESKTOP\11FR 6 CLASS\C++\FIRST SEMESTER\LESSON 14 - TAST\HW\CPP---FIRST-SEMESTER-14\CPP FIRST SEMESTER - LESSON 14\CPP FIRST SEMESTER - LESSON 14\SEQUENCE.CPP
^C:\USERS\ALMOG\DESKTOP\11FR 6 CLASS\C++\FIRST SEMESTER\LESSON 14 - TAST\HW\CPP---FIRST-SEMESTER-14\CPP FIRST SEMESTER - LESSON 14\CPP FIRST SEMESTER - LESSON 14\STRING.CPP
/c /ZI /JMC /nologo /W3 /WX- /diagnostics:classic /sdl /Od /D _MBCS /Gm- /EHsc /RTC1 /MDd /GS /fp:precise /permissive- /Zc:wchar_t /Zc:forScope /Zc:inline /Fo"X64\DEBUG\\" /Fd"X64\DEBUG\VC141.PDB" /Gd /TP /FC C:\USERS\ALMOG\DESKTOP\11FR 6 CLASS\C++\FIRST SEMESTER\LESSON 14 - TAST\HW\CPP---FIRST-SEMESTER-14\CPP FIRST SEMESTER - LESSON 14\CPP FIRST SEMESTER - LESSON 14\STRING.CPP
^C:\USERS\ALMOG\DESKTOP\11FR 6 CLASS\C++\FIRST SEMESTER\LESSON 14 - TAST\HW\CPP---FIRST-SEMESTER-14\CPP FIRST SEMESTER - LESSON 14\CPP FIRST SEMESTER - LESSON 14\INTERPRETER.CPP
/c /ZI /JMC /nologo /W3 /WX- /diagnostics:classic /sdl /Od /D _MBCS /Gm- /EHsc /RTC1 /MDd /GS /fp:precise /permissive- /Zc:wchar_t /Zc:forScope /Zc:inline /Fo"X64\DEBUG\\" /Fd"X64\DEBUG\VC141.PDB" /Gd /TP /FC C:\USERS\ALMOG\DESKTOP\11FR 6 CLASS\C++\FIRST SEMESTER\LESSON 14 - TAST\HW\CPP---FIRST-SEMESTER-14\CPP FIRST SEMESTER - LESSON 14\CPP FIRST SEMESTER - LESSON 14\INTERPRETER.CPP
^C:\USERS\ALMOG\DESKTOP\11FR 6 CLASS\C++\FIRST SEMESTER\LESSON 14 - TAST\HW\CPP---FIRST-SEMESTER-14\CPP FIRST SEMESTER - LESSON 14\CPP FIRST SEMESTER - LESSON 14\BOOLEAN.CPP
/c /ZI /JMC /nologo /W3 /WX- /diagnostics:classic /sdl /Od /D _MBCS /Gm- /EHsc /RTC1 /MDd /GS /fp:precise /permissive- /Zc:wchar_t /Zc:forScope /Zc:inline /Fo"X64\DEBUG\\" /Fd"X64\DEBUG\VC141.PDB" /Gd /TP /FC C:\USERS\ALMOG\DESKTOP\11FR 6 CLASS\C++\FIRST SEMESTER\LESSON 14 - TAST\HW\CPP---FIRST-SEMESTER-14\CPP FIRST SEMESTER - LESSON 14\CPP FIRST SEMESTER - LESSON 14\BOOLEAN.CPP
^C:\USERS\ALMOG\DESKTOP\11FR 6 CLASS\C++\FIRST SEMESTER\LESSON 14 - TAST\HW\CPP---FIRST-SEMESTER-14\CPP FIRST SEMESTER - LESSON 14\CPP FIRST SEMESTER - LESSON 14\PARSER.CPP
/c /ZI /JMC /nologo /W3 /WX- /diagnostics:classic /sdl /Od /D _MBCS /Gm- /EHsc /RTC1 /MDd /GS /fp:precise /permissive- /Zc:wchar_t /Zc:forScope /Zc:inline /Fo"X64\DEBUG\\" /Fd"X64\DEBUG\VC141.PDB" /Gd /TP /FC C:\USERS\ALMOG\DESKTOP\11FR 6 CLASS\C++\FIRST SEMESTER\LESSON 14 - TAST\HW\CPP---FIRST-SEMESTER-14\CPP FIRST SEMESTER - LESSON 14\CPP FIRST SEMESTER - LESSON 14\PARSER.CPP
