^C:\USERS\ALMOG\DESKTOP\11FR 6 CLASS\C++\FIRST SEMESTER\LESSON 11\HW\CPP---FIRST-SEMESTER-11\PROCESSES AND THREADS\PROCESSES AND THREADS\MAIN.CPP|C:\USERS\ALMOG\DESKTOP\11FR 6 CLASS\C++\FIRST SEMESTER\LESSON 11\HW\CPP---FIRST-SEMESTER-11\PROCESSES AND THREADS\PROCESSES AND THREADS\THREADS.CPP
C:\USERS\ALMOG\DESKTOP\11FR 6 CLASS\C++\FIRST SEMESTER\LESSON 11\HW\CPP---FIRST-SEMESTER-11\PROCESSES AND THREADS\PROCESSES AND THREADS\DEBUG\VC141.PDB
C:\USERS\ALMOG\DESKTOP\11FR 6 CLASS\C++\FIRST SEMESTER\LESSON 11\HW\CPP---FIRST-SEMESTER-11\PROCESSES AND THREADS\PROCESSES AND THREADS\DEBUG\VC141.IDB
C:\USERS\ALMOG\DESKTOP\11FR 6 CLASS\C++\FIRST SEMESTER\LESSON 11\HW\CPP---FIRST-SEMESTER-11\PROCESSES AND THREADS\PROCESSES AND THREADS\DEBUG\THREADS.OBJ
C:\USERS\ALMOG\DESKTOP\11FR 6 CLASS\C++\FIRST SEMESTER\LESSON 11\HW\CPP---FIRST-SEMESTER-11\PROCESSES AND THREADS\PROCESSES AND THREADS\DEBUG\MAIN.OBJ
^C:\USERS\ALMOG\DESKTOP\11FR 6 CLASS\C++\FIRST SEMESTER\LESSON 11\HW\CPP---FIRST-SEMESTER-11\PROCESSES AND THREADS\PROCESSES AND THREADS\THREADS.CPP
C:\USERS\ALMOG\DESKTOP\11FR 6 CLASS\C++\FIRST SEMESTER\LESSON 11\HW\CPP---FIRST-SEMESTER-11\PROCESSES AND THREADS\PROCESSES AND THREADS\DEBUG\VC141.PDB
C:\USERS\ALMOG\DESKTOP\11FR 6 CLASS\C++\FIRST SEMESTER\LESSON 11\HW\CPP---FIRST-SEMESTER-11\PROCESSES AND THREADS\PROCESSES AND THREADS\DEBUG\VC141.IDB
C:\USERS\ALMOG\DESKTOP\11FR 6 CLASS\C++\FIRST SEMESTER\LESSON 11\HW\CPP---FIRST-SEMESTER-11\PROCESSES AND THREADS\PROCESSES AND THREADS\DEBUG\THREADS.OBJ
^C:\USERS\ALMOG\DESKTOP\11FR 6 CLASS\C++\FIRST SEMESTER\LESSON 11\HW\CPP---FIRST-SEMESTER-11\PROCESSES AND THREADS\PROCESSES AND THREADS\MAIN.CPP
C:\USERS\ALMOG\DESKTOP\11FR 6 CLASS\C++\FIRST SEMESTER\LESSON 11\HW\CPP---FIRST-SEMESTER-11\PROCESSES AND THREADS\PROCESSES AND THREADS\DEBUG\VC141.PDB
C:\USERS\ALMOG\DESKTOP\11FR 6 CLASS\C++\FIRST SEMESTER\LESSON 11\HW\CPP---FIRST-SEMESTER-11\PROCESSES AND THREADS\PROCESSES AND THREADS\DEBUG\VC141.IDB
C:\USERS\ALMOG\DESKTOP\11FR 6 CLASS\C++\FIRST SEMESTER\LESSON 11\HW\CPP---FIRST-SEMESTER-11\PROCESSES AND THREADS\PROCESSES AND THREADS\DEBUG\MAIN.OBJ
