^C:\USERS\ALMOG\DESKTOP\11FR 6 CLASS\C++\FIRST SEMESTER\LESSON 10\HW\CPP---FIRST-SEMESTER-10\STL - LESSON 10\STL - LESSON 10\CUSTOMER.CPP|C:\USERS\ALMOG\DESKTOP\11FR 6 CLASS\C++\FIRST SEMESTER\LESSON 10\HW\CPP---FIRST-SEMESTER-10\STL - LESSON 10\STL - LESSON 10\ITEM.CPP|C:\USERS\ALMOG\DESKTOP\11FR 6 CLASS\C++\FIRST SEMESTER\LESSON 10\HW\CPP---FIRST-SEMESTER-10\STL - LESSON 10\STL - LESSON 10\ITEMSMENU.CPP|C:\USERS\ALMOG\DESKTOP\11FR 6 CLASS\C++\FIRST SEMESTER\LESSON 10\HW\CPP---FIRST-SEMESTER-10\STL - LESSON 10\STL - LESSON 10\MAIN.CPP|C:\USERS\ALMOG\DESKTOP\11FR 6 CLASS\C++\FIRST SEMESTER\LESSON 10\HW\CPP---FIRST-SEMESTER-10\STL - LESSON 10\STL - LESSON 10\MAINMENU.CPP|C:\USERS\ALMOG\DESKTOP\11FR 6 CLASS\C++\FIRST SEMESTER\LESSON 10\HW\CPP---FIRST-SEMESTER-10\STL - LESSON 10\STL - LESSON 10\OPTIONTWOMENU.CPP
C:\USERS\ALMOG\DESKTOP\11FR 6 CLASS\C++\FIRST SEMESTER\LESSON 10\HW\CPP---FIRST-SEMESTER-10\STL - LESSON 10\STL - LESSON 10\DEBUG\VC141.PDB
C:\USERS\ALMOG\DESKTOP\11FR 6 CLASS\C++\FIRST SEMESTER\LESSON 10\HW\CPP---FIRST-SEMESTER-10\STL - LESSON 10\STL - LESSON 10\DEBUG\VC141.IDB
C:\USERS\ALMOG\DESKTOP\11FR 6 CLASS\C++\FIRST SEMESTER\LESSON 10\HW\CPP---FIRST-SEMESTER-10\STL - LESSON 10\STL - LESSON 10\DEBUG\OPTIONTWOMENU.OBJ
C:\USERS\ALMOG\DESKTOP\11FR 6 CLASS\C++\FIRST SEMESTER\LESSON 10\HW\CPP---FIRST-SEMESTER-10\STL - LESSON 10\STL - LESSON 10\DEBUG\MAINMENU.OBJ
C:\USERS\ALMOG\DESKTOP\11FR 6 CLASS\C++\FIRST SEMESTER\LESSON 10\HW\CPP---FIRST-SEMESTER-10\STL - LESSON 10\STL - LESSON 10\DEBUG\MAIN.OBJ
C:\USERS\ALMOG\DESKTOP\11FR 6 CLASS\C++\FIRST SEMESTER\LESSON 10\HW\CPP---FIRST-SEMESTER-10\STL - LESSON 10\STL - LESSON 10\DEBUG\ITEMSMENU.OBJ
C:\USERS\ALMOG\DESKTOP\11FR 6 CLASS\C++\FIRST SEMESTER\LESSON 10\HW\CPP---FIRST-SEMESTER-10\STL - LESSON 10\STL - LESSON 10\DEBUG\ITEM.OBJ
C:\USERS\ALMOG\DESKTOP\11FR 6 CLASS\C++\FIRST SEMESTER\LESSON 10\HW\CPP---FIRST-SEMESTER-10\STL - LESSON 10\STL - LESSON 10\DEBUG\CUSTOMER.OBJ
^C:\USERS\ALMOG\DESKTOP\11FR 6 CLASS\C++\FIRST SEMESTER\LESSON 10\HW\CPP---FIRST-SEMESTER-10\STL - LESSON 10\STL - LESSON 10\CUSTOMER.CPP
C:\USERS\ALMOG\DESKTOP\11FR 6 CLASS\C++\FIRST SEMESTER\LESSON 10\HW\CPP---FIRST-SEMESTER-10\STL - LESSON 10\STL - LESSON 10\DEBUG\VC141.PDB
^C:\USERS\ALMOG\DESKTOP\11FR 6 CLASS\C++\FIRST SEMESTER\LESSON 10\HW\CPP---FIRST-SEMESTER-10\STL - LESSON 10\STL - LESSON 10\ITEM.CPP
C:\USERS\ALMOG\DESKTOP\11FR 6 CLASS\C++\FIRST SEMESTER\LESSON 10\HW\CPP---FIRST-SEMESTER-10\STL - LESSON 10\STL - LESSON 10\DEBUG\VC141.PDB
^C:\USERS\ALMOG\DESKTOP\11FR 6 CLASS\C++\FIRST SEMESTER\LESSON 10\HW\CPP---FIRST-SEMESTER-10\STL - LESSON 10\STL - LESSON 10\ITEMSMENU.CPP|C:\USERS\ALMOG\DESKTOP\11FR 6 CLASS\C++\FIRST SEMESTER\LESSON 10\HW\CPP---FIRST-SEMESTER-10\STL - LESSON 10\STL - LESSON 10\MAIN.CPP|C:\USERS\ALMOG\DESKTOP\11FR 6 CLASS\C++\FIRST SEMESTER\LESSON 10\HW\CPP---FIRST-SEMESTER-10\STL - LESSON 10\STL - LESSON 10\MAINMENU.CPP|C:\USERS\ALMOG\DESKTOP\11FR 6 CLASS\C++\FIRST SEMESTER\LESSON 10\HW\CPP---FIRST-SEMESTER-10\STL - LESSON 10\STL - LESSON 10\OPTIONTWOMENU.CPP
C:\USERS\ALMOG\DESKTOP\11FR 6 CLASS\C++\FIRST SEMESTER\LESSON 10\HW\CPP---FIRST-SEMESTER-10\STL - LESSON 10\STL - LESSON 10\DEBUG\VC141.PDB
C:\USERS\ALMOG\DESKTOP\11FR 6 CLASS\C++\FIRST SEMESTER\LESSON 10\HW\CPP---FIRST-SEMESTER-10\STL - LESSON 10\STL - LESSON 10\DEBUG\VC141.IDB
C:\USERS\ALMOG\DESKTOP\11FR 6 CLASS\C++\FIRST SEMESTER\LESSON 10\HW\CPP---FIRST-SEMESTER-10\STL - LESSON 10\STL - LESSON 10\DEBUG\MAIN.OBJ
C:\USERS\ALMOG\DESKTOP\11FR 6 CLASS\C++\FIRST SEMESTER\LESSON 10\HW\CPP---FIRST-SEMESTER-10\STL - LESSON 10\STL - LESSON 10\DEBUG\OPTIONTWOMENU.OBJ
C:\USERS\ALMOG\DESKTOP\11FR 6 CLASS\C++\FIRST SEMESTER\LESSON 10\HW\CPP---FIRST-SEMESTER-10\STL - LESSON 10\STL - LESSON 10\DEBUG\MAINMENU.OBJ
C:\USERS\ALMOG\DESKTOP\11FR 6 CLASS\C++\FIRST SEMESTER\LESSON 10\HW\CPP---FIRST-SEMESTER-10\STL - LESSON 10\STL - LESSON 10\DEBUG\ITEMSMENU.OBJ
^C:\USERS\ALMOG\DESKTOP\11FR 6 CLASS\C++\FIRST SEMESTER\LESSON 10\HW\CPP---FIRST-SEMESTER-10\STL - LESSON 10\STL - LESSON 10\ITEMSMENU.CPP
C:\USERS\ALMOG\DESKTOP\11FR 6 CLASS\C++\FIRST SEMESTER\LESSON 10\HW\CPP---FIRST-SEMESTER-10\STL - LESSON 10\STL - LESSON 10\DEBUG\VC141.PDB
^C:\USERS\ALMOG\DESKTOP\11FR 6 CLASS\C++\FIRST SEMESTER\LESSON 10\HW\CPP---FIRST-SEMESTER-10\STL - LESSON 10\STL - LESSON 10\MAIN.CPP
C:\USERS\ALMOG\DESKTOP\11FR 6 CLASS\C++\FIRST SEMESTER\LESSON 10\HW\CPP---FIRST-SEMESTER-10\STL - LESSON 10\STL - LESSON 10\DEBUG\VC141.PDB
^C:\USERS\ALMOG\DESKTOP\11FR 6 CLASS\C++\FIRST SEMESTER\LESSON 10\HW\CPP---FIRST-SEMESTER-10\STL - LESSON 10\STL - LESSON 10\MAINMENU.CPP
C:\USERS\ALMOG\DESKTOP\11FR 6 CLASS\C++\FIRST SEMESTER\LESSON 10\HW\CPP---FIRST-SEMESTER-10\STL - LESSON 10\STL - LESSON 10\DEBUG\VC141.PDB
C:\USERS\ALMOG\DESKTOP\11FR 6 CLASS\C++\FIRST SEMESTER\LESSON 10\HW\CPP---FIRST-SEMESTER-10\STL - LESSON 10\STL - LESSON 10\DEBUG\VC141.IDB
C:\USERS\ALMOG\DESKTOP\11FR 6 CLASS\C++\FIRST SEMESTER\LESSON 10\HW\CPP---FIRST-SEMESTER-10\STL - LESSON 10\STL - LESSON 10\DEBUG\MAINMENU.OBJ
^C:\USERS\ALMOG\DESKTOP\11FR 6 CLASS\C++\FIRST SEMESTER\LESSON 10\HW\CPP---FIRST-SEMESTER-10\STL - LESSON 10\STL - LESSON 10\OPTIONTWOMENU.CPP
C:\USERS\ALMOG\DESKTOP\11FR 6 CLASS\C++\FIRST SEMESTER\LESSON 10\HW\CPP---FIRST-SEMESTER-10\STL - LESSON 10\STL - LESSON 10\DEBUG\VC141.PDB
C:\USERS\ALMOG\DESKTOP\11FR 6 CLASS\C++\FIRST SEMESTER\LESSON 10\HW\CPP---FIRST-SEMESTER-10\STL - LESSON 10\STL - LESSON 10\DEBUG\VC141.IDB
C:\USERS\ALMOG\DESKTOP\11FR 6 CLASS\C++\FIRST SEMESTER\LESSON 10\HW\CPP---FIRST-SEMESTER-10\STL - LESSON 10\STL - LESSON 10\DEBUG\OPTIONTWOMENU.OBJ
