^C:\USERS\ALMOG\DESKTOP\11FR 6 CLASS\C++\FIRST SEMESTER\LESSON 7 + 8\LESSON_7_CHESS_PROJECT\LESSON_7_CHESS\CHESS\CHESS\BISHOP.CPP|C:\USERS\ALMOG\DESKTOP\11FR 6 CLASS\C++\FIRST SEMESTER\LESSON 7 + 8\LESSON_7_CHESS_PROJECT\LESSON_7_CHESS\CHESS\CHESS\BOARD.CPP|C:\USERS\ALMOG\DESKTOP\11FR 6 CLASS\C++\FIRST SEMESTER\LESSON 7 + 8\LESSON_7_CHESS_PROJECT\LESSON_7_CHESS\CHESS\CHESS\KING.CPP|C:\USERS\ALMOG\DESKTOP\11FR 6 CLASS\C++\FIRST SEMESTER\LESSON 7 + 8\LESSON_7_CHESS_PROJECT\LESSON_7_CHESS\CHESS\CHESS\KNIGHT.CPP|C:\USERS\ALMOG\DESKTOP\11FR 6 CLASS\C++\FIRST SEMESTER\LESSON 7 + 8\LESSON_7_CHESS_PROJECT\LESSON_7_CHESS\CHESS\CHESS\PAWN.CPP|C:\USERS\ALMOG\DESKTOP\11FR 6 CLASS\C++\FIRST SEMESTER\LESSON 7 + 8\LESSON_7_CHESS_PROJECT\LESSON_7_CHESS\CHESS\CHESS\PLAYER.CPP|C:\USERS\ALMOG\DESKTOP\11FR 6 CLASS\C++\FIRST SEMESTER\LESSON 7 + 8\LESSON_7_CHESS_PROJECT\LESSON_7_CHESS\CHESS\CHESS\POINT.CPP|C:\USERS\ALMOG\DESKTOP\11FR 6 CLASS\C++\FIRST SEMESTER\LESSON 7 + 8\LESSON_7_CHESS_PROJECT\LESSON_7_CHESS\CHESS\CHESS\QUEEN.CPP|C:\USERS\ALMOG\DESKTOP\11FR 6 CLASS\C++\FIRST SEMESTER\LESSON 7 + 8\LESSON_7_CHESS_PROJECT\LESSON_7_CHESS\CHESS\CHESS\ROOK.CPP|C:\USERS\ALMOG\DESKTOP\11FR 6 CLASS\C++\FIRST SEMESTER\LESSON 7 + 8\LESSON_7_CHESS_PROJECT\LESSON_7_CHESS\CHESS\CHESS\SOURCE.CPP|C:\USERS\ALMOG\DESKTOP\11FR 6 CLASS\C++\FIRST SEMESTER\LESSON 7 + 8\LESSON_7_CHESS_PROJECT\LESSON_7_CHESS\CHESS\CHESS\STDAFX.CPP|C:\USERS\ALMOG\DESKTOP\11FR 6 CLASS\C++\FIRST SEMESTER\LESSON 7 + 8\LESSON_7_CHESS_PROJECT\LESSON_7_CHESS\CHESS\CHESS\TOOL.CPP
C:\USERS\ALMOG\DESKTOP\11FR 6 CLASS\C++\FIRST SEMESTER\LESSON 7 + 8\LESSON_7_CHESS_PROJECT\LESSON_7_CHESS\CHESS\CHESS\DEBUG\VC141.PDB
C:\USERS\ALMOG\DESKTOP\11FR 6 CLASS\C++\FIRST SEMESTER\LESSON 7 + 8\LESSON_7_CHESS_PROJECT\LESSON_7_CHESS\CHESS\CHESS\DEBUG\VC141.IDB
C:\USERS\ALMOG\DESKTOP\11FR 6 CLASS\C++\FIRST SEMESTER\LESSON 7 + 8\LESSON_7_CHESS_PROJECT\LESSON_7_CHESS\CHESS\CHESS\DEBUG\TOOL.OBJ
C:\USERS\ALMOG\DESKTOP\11FR 6 CLASS\C++\FIRST SEMESTER\LESSON 7 + 8\LESSON_7_CHESS_PROJECT\LESSON_7_CHESS\CHESS\CHESS\DEBUG\STDAFX.OBJ
C:\USERS\ALMOG\DESKTOP\11FR 6 CLASS\C++\FIRST SEMESTER\LESSON 7 + 8\LESSON_7_CHESS_PROJECT\LESSON_7_CHESS\CHESS\CHESS\DEBUG\SOURCE.OBJ
C:\USERS\ALMOG\DESKTOP\11FR 6 CLASS\C++\FIRST SEMESTER\LESSON 7 + 8\LESSON_7_CHESS_PROJECT\LESSON_7_CHESS\CHESS\CHESS\DEBUG\ROOK.OBJ
C:\USERS\ALMOG\DESKTOP\11FR 6 CLASS\C++\FIRST SEMESTER\LESSON 7 + 8\LESSON_7_CHESS_PROJECT\LESSON_7_CHESS\CHESS\CHESS\DEBUG\QUEEN.OBJ
C:\USERS\ALMOG\DESKTOP\11FR 6 CLASS\C++\FIRST SEMESTER\LESSON 7 + 8\LESSON_7_CHESS_PROJECT\LESSON_7_CHESS\CHESS\CHESS\DEBUG\POINT.OBJ
C:\USERS\ALMOG\DESKTOP\11FR 6 CLASS\C++\FIRST SEMESTER\LESSON 7 + 8\LESSON_7_CHESS_PROJECT\LESSON_7_CHESS\CHESS\CHESS\DEBUG\PLAYER.OBJ
C:\USERS\ALMOG\DESKTOP\11FR 6 CLASS\C++\FIRST SEMESTER\LESSON 7 + 8\LESSON_7_CHESS_PROJECT\LESSON_7_CHESS\CHESS\CHESS\DEBUG\PAWN.OBJ
C:\USERS\ALMOG\DESKTOP\11FR 6 CLASS\C++\FIRST SEMESTER\LESSON 7 + 8\LESSON_7_CHESS_PROJECT\LESSON_7_CHESS\CHESS\CHESS\DEBUG\KNIGHT.OBJ
C:\USERS\ALMOG\DESKTOP\11FR 6 CLASS\C++\FIRST SEMESTER\LESSON 7 + 8\LESSON_7_CHESS_PROJECT\LESSON_7_CHESS\CHESS\CHESS\DEBUG\KING.OBJ
C:\USERS\ALMOG\DESKTOP\11FR 6 CLASS\C++\FIRST SEMESTER\LESSON 7 + 8\LESSON_7_CHESS_PROJECT\LESSON_7_CHESS\CHESS\CHESS\DEBUG\BOARD.OBJ
C:\USERS\ALMOG\DESKTOP\11FR 6 CLASS\C++\FIRST SEMESTER\LESSON 7 + 8\LESSON_7_CHESS_PROJECT\LESSON_7_CHESS\CHESS\CHESS\DEBUG\BISHOP.OBJ
^C:\USERS\ALMOG\DESKTOP\11FR 6 CLASS\C++\FIRST SEMESTER\LESSON 7 + 8\LESSON_7_CHESS_PROJECT\LESSON_7_CHESS\CHESS\CHESS\BISHOP.CPP
C:\USERS\ALMOG\DESKTOP\11FR 6 CLASS\C++\FIRST SEMESTER\LESSON 7 + 8\LESSON_7_CHESS_PROJECT\LESSON_7_CHESS\CHESS\CHESS\DEBUG\VC141.PDB
^C:\USERS\ALMOG\DESKTOP\11FR 6 CLASS\C++\FIRST SEMESTER\LESSON 7 + 8\LESSON_7_CHESS_PROJECT\LESSON_7_CHESS\CHESS\CHESS\KNIGHT.CPP
C:\USERS\ALMOG\DESKTOP\11FR 6 CLASS\C++\FIRST SEMESTER\LESSON 7 + 8\LESSON_7_CHESS_PROJECT\LESSON_7_CHESS\CHESS\CHESS\DEBUG\VC141.PDB
^C:\USERS\ALMOG\DESKTOP\11FR 6 CLASS\C++\FIRST SEMESTER\LESSON 7 + 8\LESSON_7_CHESS_PROJECT\LESSON_7_CHESS\CHESS\CHESS\PAWN.CPP
C:\USERS\ALMOG\DESKTOP\11FR 6 CLASS\C++\FIRST SEMESTER\LESSON 7 + 8\LESSON_7_CHESS_PROJECT\LESSON_7_CHESS\CHESS\CHESS\DEBUG\VC141.PDB
^C:\USERS\ALMOG\DESKTOP\11FR 6 CLASS\C++\FIRST SEMESTER\LESSON 7 + 8\LESSON_7_CHESS_PROJECT\LESSON_7_CHESS\CHESS\CHESS\POINT.CPP
C:\USERS\ALMOG\DESKTOP\11FR 6 CLASS\C++\FIRST SEMESTER\LESSON 7 + 8\LESSON_7_CHESS_PROJECT\LESSON_7_CHESS\CHESS\CHESS\DEBUG\VC141.PDB
^C:\USERS\ALMOG\DESKTOP\11FR 6 CLASS\C++\FIRST SEMESTER\LESSON 7 + 8\LESSON_7_CHESS_PROJECT\LESSON_7_CHESS\CHESS\CHESS\QUEEN.CPP
C:\USERS\ALMOG\DESKTOP\11FR 6 CLASS\C++\FIRST SEMESTER\LESSON 7 + 8\LESSON_7_CHESS_PROJECT\LESSON_7_CHESS\CHESS\CHESS\DEBUG\VC141.PDB
^C:\USERS\ALMOG\DESKTOP\11FR 6 CLASS\C++\FIRST SEMESTER\LESSON 7 + 8\LESSON_7_CHESS_PROJECT\LESSON_7_CHESS\CHESS\CHESS\ROOK.CPP
C:\USERS\ALMOG\DESKTOP\11FR 6 CLASS\C++\FIRST SEMESTER\LESSON 7 + 8\LESSON_7_CHESS_PROJECT\LESSON_7_CHESS\CHESS\CHESS\DEBUG\VC141.PDB
^C:\USERS\ALMOG\DESKTOP\11FR 6 CLASS\C++\FIRST SEMESTER\LESSON 7 + 8\LESSON_7_CHESS_PROJECT\LESSON_7_CHESS\CHESS\CHESS\STDAFX.CPP
C:\USERS\ALMOG\DESKTOP\11FR 6 CLASS\C++\FIRST SEMESTER\LESSON 7 + 8\LESSON_7_CHESS_PROJECT\LESSON_7_CHESS\CHESS\CHESS\DEBUG\VC141.PDB
^C:\USERS\ALMOG\DESKTOP\11FR 6 CLASS\C++\FIRST SEMESTER\LESSON 7 + 8\LESSON_7_CHESS_PROJECT\LESSON_7_CHESS\CHESS\CHESS\TOOL.CPP
C:\USERS\ALMOG\DESKTOP\11FR 6 CLASS\C++\FIRST SEMESTER\LESSON 7 + 8\LESSON_7_CHESS_PROJECT\LESSON_7_CHESS\CHESS\CHESS\DEBUG\VC141.PDB
^C:\USERS\ALMOG\DESKTOP\11FR 6 CLASS\C++\FIRST SEMESTER\LESSON 7 + 8\LESSON_7_CHESS_PROJECT\LESSON_7_CHESS\CHESS\CHESS\BOARD.CPP|C:\USERS\ALMOG\DESKTOP\11FR 6 CLASS\C++\FIRST SEMESTER\LESSON 7 + 8\LESSON_7_CHESS_PROJECT\LESSON_7_CHESS\CHESS\CHESS\KING.CPP|C:\USERS\ALMOG\DESKTOP\11FR 6 CLASS\C++\FIRST SEMESTER\LESSON 7 + 8\LESSON_7_CHESS_PROJECT\LESSON_7_CHESS\CHESS\CHESS\PLAYER.CPP|C:\USERS\ALMOG\DESKTOP\11FR 6 CLASS\C++\FIRST SEMESTER\LESSON 7 + 8\LESSON_7_CHESS_PROJECT\LESSON_7_CHESS\CHESS\CHESS\SOURCE.CPP
C:\USERS\ALMOG\DESKTOP\11FR 6 CLASS\C++\FIRST SEMESTER\LESSON 7 + 8\LESSON_7_CHESS_PROJECT\LESSON_7_CHESS\CHESS\CHESS\DEBUG\VC141.PDB
C:\USERS\ALMOG\DESKTOP\11FR 6 CLASS\C++\FIRST SEMESTER\LESSON 7 + 8\LESSON_7_CHESS_PROJECT\LESSON_7_CHESS\CHESS\CHESS\DEBUG\VC141.IDB
C:\USERS\ALMOG\DESKTOP\11FR 6 CLASS\C++\FIRST SEMESTER\LESSON 7 + 8\LESSON_7_CHESS_PROJECT\LESSON_7_CHESS\CHESS\CHESS\DEBUG\SOURCE.OBJ
C:\USERS\ALMOG\DESKTOP\11FR 6 CLASS\C++\FIRST SEMESTER\LESSON 7 + 8\LESSON_7_CHESS_PROJECT\LESSON_7_CHESS\CHESS\CHESS\DEBUG\PLAYER.OBJ
C:\USERS\ALMOG\DESKTOP\11FR 6 CLASS\C++\FIRST SEMESTER\LESSON 7 + 8\LESSON_7_CHESS_PROJECT\LESSON_7_CHESS\CHESS\CHESS\DEBUG\KING.OBJ
C:\USERS\ALMOG\DESKTOP\11FR 6 CLASS\C++\FIRST SEMESTER\LESSON 7 + 8\LESSON_7_CHESS_PROJECT\LESSON_7_CHESS\CHESS\CHESS\DEBUG\BOARD.OBJ
^C:\USERS\ALMOG\DESKTOP\11FR 6 CLASS\C++\FIRST SEMESTER\LESSON 7 + 8\LESSON_7_CHESS_PROJECT\LESSON_7_CHESS\CHESS\CHESS\BOARD.CPP
C:\USERS\ALMOG\DESKTOP\11FR 6 CLASS\C++\FIRST SEMESTER\LESSON 7 + 8\LESSON_7_CHESS_PROJECT\LESSON_7_CHESS\CHESS\CHESS\DEBUG\VC141.PDB
^C:\USERS\ALMOG\DESKTOP\11FR 6 CLASS\C++\FIRST SEMESTER\LESSON 7 + 8\LESSON_7_CHESS_PROJECT\LESSON_7_CHESS\CHESS\CHESS\KING.CPP
C:\USERS\ALMOG\DESKTOP\11FR 6 CLASS\C++\FIRST SEMESTER\LESSON 7 + 8\LESSON_7_CHESS_PROJECT\LESSON_7_CHESS\CHESS\CHESS\DEBUG\VC141.PDB
^C:\USERS\ALMOG\DESKTOP\11FR 6 CLASS\C++\FIRST SEMESTER\LESSON 7 + 8\LESSON_7_CHESS_PROJECT\LESSON_7_CHESS\CHESS\CHESS\PLAYER.CPP
C:\USERS\ALMOG\DESKTOP\11FR 6 CLASS\C++\FIRST SEMESTER\LESSON 7 + 8\LESSON_7_CHESS_PROJECT\LESSON_7_CHESS\CHESS\CHESS\DEBUG\VC141.PDB
C:\USERS\ALMOG\DESKTOP\11FR 6 CLASS\C++\FIRST SEMESTER\LESSON 7 + 8\LESSON_7_CHESS_PROJECT\LESSON_7_CHESS\CHESS\CHESS\DEBUG\VC141.IDB
C:\USERS\ALMOG\DESKTOP\11FR 6 CLASS\C++\FIRST SEMESTER\LESSON 7 + 8\LESSON_7_CHESS_PROJECT\LESSON_7_CHESS\CHESS\CHESS\DEBUG\PLAYER.OBJ
^C:\USERS\ALMOG\DESKTOP\11FR 6 CLASS\C++\FIRST SEMESTER\LESSON 7 + 8\LESSON_7_CHESS_PROJECT\LESSON_7_CHESS\CHESS\CHESS\SOURCE.CPP
C:\USERS\ALMOG\DESKTOP\11FR 6 CLASS\C++\FIRST SEMESTER\LESSON 7 + 8\LESSON_7_CHESS_PROJECT\LESSON_7_CHESS\CHESS\CHESS\DEBUG\VC141.PDB
C:\USERS\ALMOG\DESKTOP\11FR 6 CLASS\C++\FIRST SEMESTER\LESSON 7 + 8\LESSON_7_CHESS_PROJECT\LESSON_7_CHESS\CHESS\CHESS\DEBUG\VC141.IDB
C:\USERS\ALMOG\DESKTOP\11FR 6 CLASS\C++\FIRST SEMESTER\LESSON 7 + 8\LESSON_7_CHESS_PROJECT\LESSON_7_CHESS\CHESS\CHESS\DEBUG\SOURCE.OBJ
