{
  "project_info": {
    "project_number": "200690458949",
    "firebase_url": "https://gfgtodo.firebaseio.com",
    "project_id": "gfgtodo",
    "storage_bucket": "gfgtodo.appspot.com"
  },
  "client": [
    {
      "client_info": {
        "mobilesdk_app_id": "1:200690458949:android:104848bb8040dc7f",
        "android_client_info": {
          "package_name": "com.goflamingo.apps.gfgEmployees"
        }
      },
      "oauth_client": [
        {
          "client_id": "200690458949-btnrn9en55ai1fji5ajmh4h4dousemkm.apps.googleusercontent.com",
          "client_type": 3
        }
      ],
      "api_key": [
        {
          "current_key": "AIzaSyCjlbsnMq84ggSBfaMkF85hgVSvak2jkUo"
        }
      ],
      "services": {
        "analytics_service": {
          "status": 1
        },
        "appinvite_service": {
          "status": 1,
          "other_platform_oauth_client": []
        },
        "ads_service": {
          "status": 2
        }
      }
    }
  ],
  "configuration_version": "1"
}