Date,Mean_Price
2020-02-17,84.79579734802246
2020-02-18,84.16681480407715
2020-02-19,82.24661827087402
2020-02-20,77.23419570922852
2020-02-21,78.67373275756836
2020-02-22,80.16821479797363
2020-02-23,82.11419296264648
