Date,Mean_Price
2020-02-17,73.26076316833496
2020-02-18,74.78180694580078
2020-02-19,74.23871231079102
2020-02-20,70.05820083618164
2020-02-21,71.71885299682617
2020-02-22,74.41962814331055
2020-02-23,77.34649658203125
