Accuracy for SawtoothSAD 15x15= 0.424266
Accuracy for SawtoothSAD 17x17= 0.422672
Accuracy for SawtoothSAD 19x19= 0.420907
Accuracy for SawtoothSAD 21x21= 0.419318
Accuracy for SawtoothSAD 23x23= 0.417475
