<?xml version="1.0" encoding="UTF-8" standalone="no"?>
<svg
   xmlns:dc="http://purl.org/dc/elements/1.1/"
   xmlns:cc="http://creativecommons.org/ns#"
   xmlns:rdf="http://www.w3.org/1999/02/22-rdf-syntax-ns#"
   xmlns:svg="http://www.w3.org/2000/svg"
   xmlns="http://www.w3.org/2000/svg"
   xmlns:sodipodi="http://sodipodi.sourceforge.net/DTD/sodipodi-0.dtd"
   xmlns:inkscape="http://www.inkscape.org/namespaces/inkscape"
   inkscape:version="1.0 (5b275a35d9, 2020-05-03)"
   sodipodi:docname="1.svg"
   id="svg70"
   version="1.1"
   viewBox="0 0 32 16"
   height="16"
   width="32">
  <metadata
     id="metadata76">
    <rdf:RDF>
      <cc:Work
         rdf:about="">
        <dc:format>image/svg+xml</dc:format>
        <dc:type
           rdf:resource="http://purl.org/dc/dcmitype/StillImage" />
        <dc:title></dc:title>
      </cc:Work>
    </rdf:RDF>
  </metadata>
  <defs
     id="defs74" />
  <sodipodi:namedview
     inkscape:current-layer="g68"
     inkscape:window-maximized="1"
     inkscape:window-y="27"
     inkscape:window-x="70"
     inkscape:cy="8"
     inkscape:cx="16"
     inkscape:zoom="52.0625"
     showgrid="false"
     id="namedview72"
     inkscape:window-height="1016"
     inkscape:window-width="1850"
     inkscape:pageshadow="2"
     inkscape:pageopacity="0"
     guidetolerance="10"
     gridtolerance="10"
     objecttolerance="10"
     borderopacity="1"
     bordercolor="#666666"
     pagecolor="#ffffff" />
  <g
     id="g68"
     fill="none">
    <path
       id="path62"
       transform="translate(0 2)"
       d="M8 0c.552 0 1 .384 1 .857 0 .474-.448.857-1 .857C4.686 1.714 3 3.16 3 6c0 2.84 1.686 4.286 5 4.286.552 0 1 .383 1 .857 0 .473-.448.857-1 .857-4.419 0-7-2.212-7-6s2.581-6 7-6zM1 6h6c.552 0 1 .448 1 1s-.448 1-1 1H1c-.552 0-1-.448-1-1s.448-1 1-1zm0-3h7c.552 0 1 .448 1 1s-.448 1-1 1H1c-.552 0-1-.448-1-1s.448-1 1-1z"
       fill="#EF7711" />
    <path
       id="path64"
       transform="translate(0 2)"
       d="M31 0c.552 0 1 .384 1 .857 0 .474-.448.857-1 .857-3.314 0-5 1.445-5 4.286 0 2.84 1.686 4.286 5 4.286.552 0 1 .383 1 .857 0 .473-.448.857-1 .857-4.419 0-7-2.212-7-6s2.581-6 7-6zm-7 6h6c.552 0 1 .448 1 1s-.448 1-1 1h-6c-.552 0-1-.448-1-1s.448-1 1-1zm0-3h7c.552 0 1 .448 1 1s-.448 1-1 1h-7c-.552 0-1-.448-1-1s.448-1 1-1z"
       fill-opacity=".7"
       fill="#ACB0B9" />
    <path
       fill="#acb0b9"
       fill-opacity="0.7"
       d="m 20,2 c 0.552,0 1,0.384 1,0.857 0,0.474 -0.448,0.857 -1,0.857 -3.314,0 -5,1.445 -5,4.286 0,2.84 1.686,4.286 5,4.286 0.552,0 1,0.383 1,0.857 C 21,13.616 20.552,14 20,14 15.581,14 13,11.788 13,8 13,4.212 15.581,2 20,2 Z m -7,6 h 6 c 0.552,0 1,0.448 1,1 0,0.552 -0.448,0.9999999 -1,0.9999999 H 13 C 12.448,9.9999999 12,9.552 12,9 12,8.448 12.448,8 13,8 Z m 0,-3 h 7 c 0.552,0 1,0.448 1,1 0,0.552 -0.448,1 -1,1 H 13 C 12.448,7 12,6.552 12,6 12,5.448 12.448,5 13,5 Z"
       id="path64-3" />
  </g>
</svg>
